Implementation notes: amd64, samba, crypto_hash/prh42s1024

Computer: samba
Microarchitecture: amd64; Skylake (506e3)
Architecture: amd64
CPU ID: GenuineIntel-000506e3-bfebfbff
SUPERCOP version: 20240625
Operation: crypto_hash
Primitive: prh42s1024
TimeObject sizeTest sizeImplementationCompilerBenchmark dateSUPERCOP version
17672533 0 014253 804 960refgcc_-march=native_-mtune=native_-O2_-fwrapv_-fPIC_-fPIE_-gdwarf-4_-Wall2024062620240625
19063851 0 017765 804 960refgcc_-march=native_-mtune=native_-O3_-fwrapv_-fPIC_-fPIE_-gdwarf-4_-Wall2024062620240625

Compiler output


try.c: /usr/bin/ld: libcrypto_hash_prh42s1024.a(hash.o): in function `crypto_hash_prh42s1024_ref_constbranchindex':
try.c: .../supercop-data/samba/amd64/try/c/clang_-march=native_-O2_-fwrapv_-Qunused-arguments_-fPIC_-fPIE_-gdwarf-4_-Wall/constbranchindex/crypto_hash/prh42s1024/ref/work/hash.c:11: undefined reference to `prvhash42s_oneshot'
try.c: clang: error: linker command failed with exit code 1 (use -v to see invocation)

Number of similar (implementation,compiler) pairs: 1, namely:
ImplementationCompiler
refclang -march=native -O2 -fwrapv -Qunused-arguments -fPIC -fPIE -gdwarf-4 -Wall (Ubuntu_Clang_14.0.0)

Compiler output


try.c: /usr/bin/ld: libcrypto_hash_prh42s1024.a(hash.o): in function `prvhash42s_oneshot':
try.c: .../supercop-data/samba/amd64/try/c/clang_-march=native_-O3_-fwrapv_-Qunused-arguments_-fPIC_-fPIE_-gdwarf-4_-Wall/constbranchindex/crypto_hash/prh42s1024/ref/work/./prvhash42s.h:321: undefined reference to `prvhash42s_init'
try.c: /usr/bin/ld: .../supercop-data/samba/amd64/try/c/clang_-march=native_-O3_-fwrapv_-Qunused-arguments_-fPIC_-fPIE_-gdwarf-4_-Wall/constbranchindex/crypto_hash/prh42s1024/ref/work/./prvhash42s.h:322: undefined reference to `prvhash42s_update'
try.c: /usr/bin/ld: .../supercop-data/samba/amd64/try/c/clang_-march=native_-O3_-fwrapv_-Qunused-arguments_-fPIC_-fPIE_-gdwarf-4_-Wall/constbranchindex/crypto_hash/prh42s1024/ref/work/./prvhash42s.h:323: undefined reference to `prvhash42s_final'
try.c: clang: error: linker command failed with exit code 1 (use -v to see invocation)

Number of similar (implementation,compiler) pairs: 1, namely:
ImplementationCompiler
refclang -march=native -O3 -fwrapv -Qunused-arguments -fPIC -fPIE -gdwarf-4 -Wall (Ubuntu_Clang_14.0.0)

Compiler output


try.c: /usr/bin/ld: libcrypto_hash_prh42s1024.a(hash.o): in function `prvhash42s_oneshot':
try.c: .../supercop-data/samba/amd64/try/c/clang_-march=native_-O_-fwrapv_-Qunused-arguments_-fPIC_-fPIE_-gdwarf-4_-Wall/constbranchindex/crypto_hash/prh42s1024/ref/work/./prvhash42s.h:321: undefined reference to `prvhash42s_init'
try.c: /usr/bin/ld: .../supercop-data/samba/amd64/try/c/clang_-march=native_-O_-fwrapv_-Qunused-arguments_-fPIC_-fPIE_-gdwarf-4_-Wall/constbranchindex/crypto_hash/prh42s1024/ref/work/./prvhash42s.h:322: undefined reference to `prvhash42s_update'
try.c: /usr/bin/ld: .../supercop-data/samba/amd64/try/c/clang_-march=native_-O_-fwrapv_-Qunused-arguments_-fPIC_-fPIE_-gdwarf-4_-Wall/constbranchindex/crypto_hash/prh42s1024/ref/work/./prvhash42s.h:323: undefined reference to `prvhash42s_final'
try.c: clang: error: linker command failed with exit code 1 (use -v to see invocation)

Number of similar (implementation,compiler) pairs: 1, namely:
ImplementationCompiler
refclang -march=native -O -fwrapv -Qunused-arguments -fPIC -fPIE -gdwarf-4 -Wall (Ubuntu_Clang_14.0.0)

Compiler output


try.c: /usr/bin/ld: libcrypto_hash_prh42s1024.a(hash.o): in function `crypto_hash_prh42s1024_ref_constbranchindex':
try.c: .../supercop-data/samba/amd64/try/c/clang_-march=native_-Os_-fwrapv_-Qunused-arguments_-fPIC_-fPIE_-gdwarf-4_-Wall/constbranchindex/crypto_hash/prh42s1024/ref/work/hash.c:11: undefined reference to `prvhash42s_oneshot'
try.c: clang: error: linker command failed with exit code 1 (use -v to see invocation)

Number of similar (implementation,compiler) pairs: 1, namely:
ImplementationCompiler
refclang -march=native -Os -fwrapv -Qunused-arguments -fPIC -fPIE -gdwarf-4 -Wall (Ubuntu_Clang_14.0.0)

Compiler output


try.c: /usr/bin/ld: libcrypto_hash_prh42s1024.a(hash.o): in function `prvhash42s_oneshot':
try.c: .../supercop-data/samba/amd64/try/c/clang_-mcpu=native_-O3_-fwrapv_-Qunused-arguments_-fPIC_-fPIE_-gdwarf-4_-Wall/constbranchindex/crypto_hash/prh42s1024/ref/work/./prvhash42s.h:321: undefined reference to `prvhash42s_init'
try.c: /usr/bin/ld: .../supercop-data/samba/amd64/try/c/clang_-mcpu=native_-O3_-fwrapv_-Qunused-arguments_-fPIC_-fPIE_-gdwarf-4_-Wall/constbranchindex/crypto_hash/prh42s1024/ref/work/./prvhash42s.h:322: undefined reference to `prvhash42s_update'
try.c: /usr/bin/ld: .../supercop-data/samba/amd64/try/c/clang_-mcpu=native_-O3_-fwrapv_-Qunused-arguments_-fPIC_-fPIE_-gdwarf-4_-Wall/constbranchindex/crypto_hash/prh42s1024/ref/work/./prvhash42s.h:323: undefined reference to `prvhash42s_final'
try.c: clang: error: linker command failed with exit code 1 (use -v to see invocation)

Number of similar (implementation,compiler) pairs: 1, namely:
ImplementationCompiler
refclang -mcpu=native -O3 -fwrapv -Qunused-arguments -fPIC -fPIE -gdwarf-4 -Wall (Ubuntu_Clang_14.0.0)

Compiler output


try.c: /usr/bin/ld: libcrypto_hash_prh42s1024.a(hash.o): in function `prvhash42s_oneshot':
try.c: .../supercop-data/samba/amd64/try/c/gcc_-march=native_-mtune=native_-O_-fwrapv_-fPIC_-fPIE_-gdwarf-4_-Wall/constbranchindex/crypto_hash/prh42s1024/ref/work/prvhash42s.h:322: undefined reference to `prvhash42s_update'
try.c: /usr/bin/ld: libcrypto_hash_prh42s1024.a(hash.o): in function `prvhash42s_final':
try.c: .../supercop-data/samba/amd64/try/c/gcc_-march=native_-mtune=native_-O_-fwrapv_-fPIC_-fPIE_-gdwarf-4_-Wall/constbranchindex/crypto_hash/prh42s1024/ref/work/prvhash42s.h:265: undefined reference to `prvhash42s_update'
try.c: /usr/bin/ld: .../supercop-data/samba/amd64/try/c/gcc_-march=native_-mtune=native_-O_-fwrapv_-fPIC_-fPIE_-gdwarf-4_-Wall/constbranchindex/crypto_hash/prh42s1024/ref/work/prvhash42s.h:266: undefined reference to `prvhash42s_update'
try.c: collect2: error: ld returned 1 exit status

Number of similar (implementation,compiler) pairs: 1, namely:
ImplementationCompiler
refgcc -march=native -mtune=native -O -fwrapv -fPIC -fPIE -gdwarf-4 -Wall (11.4.0)

Compiler output


try.c: /usr/bin/ld: libcrypto_hash_prh42s1024.a(hash.o): in function `crypto_hash_prh42s1024_ref_constbranchindex':
try.c: .../supercop-data/samba/amd64/try/c/gcc_-march=native_-mtune=native_-Os_-fwrapv_-fPIC_-fPIE_-gdwarf-4_-Wall/constbranchindex/crypto_hash/prh42s1024/ref/work/hash.c:11: undefined reference to `prvhash42s_oneshot'
try.c: collect2: error: ld returned 1 exit status

Number of similar (implementation,compiler) pairs: 1, namely:
ImplementationCompiler
refgcc -march=native -mtune=native -Os -fwrapv -fPIC -fPIE -gdwarf-4 -Wall (11.4.0)

Passed TIMECOP


TIMECOP iterations: 10

Number of similar (implementation,compiler) pairs: 2, namely:
ImplementationCompiler
refgcc -march=native -mtune=native -O2 -fwrapv -fPIC -fPIE -gdwarf-4 -Wall (11.4.0)
refgcc -march=native -mtune=native -O3 -fwrapv -fPIC -fPIE -gdwarf-4 -Wall (11.4.0)