Implementation notes: amd64, speed2supercop, crypto_hash/echosp512

Computer: speed2supercop
Microarchitecture: amd64; Haswell+AES (306c3)
Architecture: amd64
CPU ID: GenuineIntel-000306c3-1fc9cbf5
SUPERCOP version: 20240107
Operation: crypto_hash
Primitive: echosp512
TimeObject sizeTest sizeImplementationCompilerBenchmark dateSUPERCOP version
6161219830 0 129893 752 808T:generic/opt64gcc_-march=native_-mtune=native_-O_-fomit-frame-pointer_-fwrapv_-fPIC_-fPIE2024011420240107
6429621998 0 134381 752 808T:generic/opt64gcc_-march=native_-mtune=native_-O3_-fomit-frame-pointer_-fwrapv_-fPIC_-fPIE2024011420240107
6456821686 0 132205 752 808T:generic/opt64gcc_-march=native_-mtune=native_-O2_-fomit-frame-pointer_-fwrapv_-fPIC_-fPIE2024011420240107
6644820169 0 129120 728 776T:generic/opt64gcc_-march=native_-mtune=native_-Os_-fomit-frame-pointer_-fwrapv_-fPIC_-fPIE2024011420240107
7291622711 0 1635188 760 816T:generic/opt32gcc_-march=native_-mtune=native_-O3_-fomit-frame-pointer_-fwrapv_-fPIC_-fPIE2024011420240107
7422018416 0 1627431 736 784T:generic/opt32gcc_-march=native_-mtune=native_-Os_-fomit-frame-pointer_-fwrapv_-fPIC_-fPIE2024011420240107
7479221087 0 1631700 760 816T:generic/opt32gcc_-march=native_-mtune=native_-O2_-fomit-frame-pointer_-fwrapv_-fPIC_-fPIE2024011420240107
7721219596 0 1629724 760 816T:generic/opt32gcc_-march=native_-mtune=native_-O_-fomit-frame-pointer_-fwrapv_-fPIC_-fPIE2024011420240107
10253231302 0 1643693 752 816T:powerpc/pp32cv2gcc_-march=native_-mtune=native_-O3_-fomit-frame-pointer_-fwrapv_-fPIC_-fPIE2024011420240107
10366425640 0 1634608 728 784T:powerpc/pp32cv2gcc_-march=native_-mtune=native_-Os_-fomit-frame-pointer_-fwrapv_-fPIC_-fPIE2024011420240107
11470828091 0 1638165 752 816T:powerpc/pp32cv2gcc_-march=native_-mtune=native_-O_-fomit-frame-pointer_-fwrapv_-fPIC_-fPIE2024011420240107
11642830830 0 1641357 752 816T:powerpc/pp32cv2gcc_-march=native_-mtune=native_-O2_-fomit-frame-pointer_-fwrapv_-fPIC_-fPIE2024011420240107
12312419286 0 1631677 752 816T:powerpc/pp32cv1gcc_-march=native_-mtune=native_-O3_-fomit-frame-pointer_-fwrapv_-fPIC_-fPIE2024011420240107
12523217822 0 1628349 752 816T:powerpc/pp32cv1gcc_-march=native_-mtune=native_-O2_-fomit-frame-pointer_-fwrapv_-fPIC_-fPIE2024011420240107
13416017873 0 1627941 752 816T:powerpc/pp32cv1gcc_-march=native_-mtune=native_-O_-fomit-frame-pointer_-fwrapv_-fPIC_-fPIE2024011420240107
13679616666 0 1625624 728 784T:powerpc/pp32cv1gcc_-march=native_-mtune=native_-Os_-fomit-frame-pointer_-fwrapv_-fPIC_-fPIE2024011420240107

Compiler output

Implementation: T:aes/aes64
Security model: timingleaks
Compiler: gcc -march=native -mtune=native -O2 -fomit-frame-pointer -fwrapv -fPIC -fPIE
try.c: /usr/bin/ld: libcrypto_hash_echosp512.a(echo64.o): relocation R_X86_64_32S against symbol `OLDCV' can not be used when making a PIE object; recompile with -fPIE
try.c: /usr/bin/ld: failed to set dynamic section sizes: bad value
try.c: collect2: error: ld returned 1 exit status

Number of similar (compiler,implementation) pairs: 4, namely:
CompilerImplementations
gcc -march=native -mtune=native -O2 -fomit-frame-pointer -fwrapv -fPIC -fPIE T:aes/aes64
gcc -march=native -mtune=native -O3 -fomit-frame-pointer -fwrapv -fPIC -fPIE T:aes/aes64
gcc -march=native -mtune=native -O -fomit-frame-pointer -fwrapv -fPIC -fPIE T:aes/aes64
gcc -march=native -mtune=native -Os -fomit-frame-pointer -fwrapv -fPIC -fPIE T:aes/aes64

Compiler output

Implementation: T:athlon/athlon64
Security model: timingleaks
Compiler: gcc -march=native -mtune=native -O2 -fomit-frame-pointer -fwrapv -fPIC -fPIE
echo64.S: echo64.c: Assembler messages:
echo64.S: echo64.c:729: Error: no such instruction: `movzbl ebp,ah'
echo64.S: echo64.c:729: Error: no such instruction: `movzbl esi,al'
echo64.S: echo64.c:729: Error: no such instruction: `movzbl ebp,bl'
echo64.S: echo64.c:729: Error: no such instruction: `movzbl esi,bh'
echo64.S: echo64.c:729: Error: no such instruction: `movzbl ebp,al'
echo64.S: echo64.c:729: Error: no such instruction: `movzbl esi,ah'
echo64.S: echo64.c:729: Error: no such instruction: `movzbl ebp,bh'
echo64.S: echo64.c:729: Error: no such instruction: `movzbl esi,bl'
echo64.S: echo64.c:729: Error: no such instruction: `movzbl ebp,ah'
echo64.S: echo64.c:729: Error: no such instruction: `movzbl esi,al'
echo64.S: echo64.c:729: Error: no such instruction: `movzbl ebp,bl'
echo64.S: echo64.c:729: Error: no such instruction: `movzbl esi,bh'
echo64.S: echo64.c:729: Error: no such instruction: `movzbl ebp,al'
echo64.S: echo64.c:729: Error: no such instruction: `movzbl esi,ah'
echo64.S: echo64.c:729: Error: no such instruction: `movzbl ebp,bl'
echo64.S: echo64.c:729: Error: no such instruction: `movzbl esi,bh'
echo64.S: echo64.c:729: Error: no such instruction: `movzbl ebp,dl'
echo64.S: echo64.c:729: Error: no such instruction: `movzbl esi,dh'
echo64.S: echo64.c:729: Error: no such instruction: `movzbl ebp,ch'
echo64.S: echo64.c:729: Error: no such instruction: `movzbl esi,cl'
echo64.S: echo64.c:729: Error: no such instruction: `movzbl ebp,cl'
echo64.S: echo64.c:729: Error: no such instruction: `movzbl esi,ch'
echo64.S: echo64.c:729: Error: no such instruction: `movzbl ebp,dh'
echo64.S: echo64.c:729: Error: no such instruction: `movzbl esi,dl'
echo64.S: ...

Number of similar (compiler,implementation) pairs: 4, namely:
CompilerImplementations
gcc -march=native -mtune=native -O2 -fomit-frame-pointer -fwrapv -fPIC -fPIE T:athlon/athlon64
gcc -march=native -mtune=native -O3 -fomit-frame-pointer -fwrapv -fPIC -fPIE T:athlon/athlon64
gcc -march=native -mtune=native -O -fomit-frame-pointer -fwrapv -fPIC -fPIE T:athlon/athlon64
gcc -march=native -mtune=native -Os -fomit-frame-pointer -fwrapv -fPIC -fPIE T:athlon/athlon64

Compiler output

Implementation: T:core2/core2v64
Security model: timingleaks
Compiler: gcc -march=native -mtune=native -O2 -fomit-frame-pointer -fwrapv -fPIC -fPIE
echo64.S: echo64.c: Assembler messages:
echo64.S: echo64.c:635: Error: no such instruction: `movzbl ebp,ah'
echo64.S: echo64.c:635: Error: no such instruction: `movzbl esi,al'
echo64.S: echo64.c:635: Error: no such instruction: `movzbl ebp,bl'
echo64.S: echo64.c:635: Error: no such instruction: `movzbl esi,bh'
echo64.S: echo64.c:635: Error: no such instruction: `movzbl ebp,al'
echo64.S: echo64.c:635: Error: no such instruction: `movzbl esi,ah'
echo64.S: echo64.c:635: Error: no such instruction: `movzbl ebp,bh'
echo64.S: echo64.c:635: Error: no such instruction: `movzbl esi,bl'
echo64.S: echo64.c:635: Error: no such instruction: `movzbl ebp,ah'
echo64.S: echo64.c:635: Error: no such instruction: `movzbl esi,al'
echo64.S: echo64.c:635: Error: no such instruction: `movzbl ebp,bl'
echo64.S: echo64.c:635: Error: no such instruction: `movzbl esi,bh'
echo64.S: echo64.c:635: Error: no such instruction: `movzbl ebp,al'
echo64.S: echo64.c:635: Error: no such instruction: `movzbl esi,ah'
echo64.S: echo64.c:635: Error: no such instruction: `movzbl ebp,bl'
echo64.S: echo64.c:635: Error: no such instruction: `movzbl esi,bh'
echo64.S: echo64.c:635: Error: no such instruction: `movzbl ebp,dl'
echo64.S: echo64.c:635: Error: no such instruction: `movzbl esi,dh'
echo64.S: echo64.c:635: Error: no such instruction: `movzbl ebp,ch'
echo64.S: echo64.c:635: Error: no such instruction: `movzbl esi,cl'
echo64.S: echo64.c:635: Error: no such instruction: `movzbl ebp,cl'
echo64.S: echo64.c:635: Error: no such instruction: `movzbl esi,ch'
echo64.S: echo64.c:635: Error: no such instruction: `movzbl ebp,dh'
echo64.S: echo64.c:635: Error: no such instruction: `movzbl esi,dl'
echo64.S: ...

Number of similar (compiler,implementation) pairs: 4, namely:
CompilerImplementations
gcc -march=native -mtune=native -O2 -fomit-frame-pointer -fwrapv -fPIC -fPIE T:core2/core2v64
gcc -march=native -mtune=native -O3 -fomit-frame-pointer -fwrapv -fPIC -fPIE T:core2/core2v64
gcc -march=native -mtune=native -O -fomit-frame-pointer -fwrapv -fPIC -fPIE T:core2/core2v64
gcc -march=native -mtune=native -Os -fomit-frame-pointer -fwrapv -fPIC -fPIE T:core2/core2v64

Compiler output

Implementation: T:generic/opt32
Security model: timingleaks
Compiler: gcc -march=native -mtune=native -O2 -fomit-frame-pointer -fwrapv -fPIC -fPIE
echo32.c: echo32.c: In function 'PrintState':
echo32.c: echo32.c:37:25: warning: implicit declaration of function 'printf' [-Wimplicit-function-declaration]
echo32.c: 37 | printf ("row %d,col %d :",i,j);
echo32.c: | ^~~~~~
echo32.c: echo32.c:12:1: note: include '<stdio.h>' or provide a declaration of 'printf'
echo32.c: 11 | #include "api.h"
echo32.c: +++ |+#include <stdio.h>
echo32.c: 12 |
echo32.c: echo32.c:37:25: warning: incompatible implicit declaration of built-in function 'printf' [-Wbuiltin-declaration-mismatch]
echo32.c: 37 | printf ("row %d,col %d :",i,j);
echo32.c: | ^~~~~~
echo32.c: echo32.c:37:25: note: include '<stdio.h>' or provide a declaration of 'printf'
echo32.c: echo32.c:47:9: warning: incompatible implicit declaration of built-in function 'printf' [-Wbuiltin-declaration-mismatch]
echo32.c: 47 | printf("-----------------------------------\n");
echo32.c: | ^~~~~~
echo32.c: echo32.c:47:9: note: include '<stdio.h>' or provide a declaration of 'printf'

Number of similar (compiler,implementation) pairs: 4, namely:
CompilerImplementations
gcc -march=native -mtune=native -O2 -fomit-frame-pointer -fwrapv -fPIC -fPIE T:generic/opt32
gcc -march=native -mtune=native -O3 -fomit-frame-pointer -fwrapv -fPIC -fPIE T:generic/opt32
gcc -march=native -mtune=native -O -fomit-frame-pointer -fwrapv -fPIC -fPIE T:generic/opt32
gcc -march=native -mtune=native -Os -fomit-frame-pointer -fwrapv -fPIC -fPIE T:generic/opt32

Compiler output

Implementation: T:generic/opt64
Security model: timingleaks
Compiler: gcc -march=native -mtune=native -O2 -fomit-frame-pointer -fwrapv -fPIC -fPIE
echo64.c: echo64.c: In function 'crypto_hash_echosp512_generic_opt64_timingleaks':
echo64.c: echo64.c:555:29: warning: passing argument 2 of 'Hash' discards 'const' qualifier from pointer target type [-Wdiscarded-qualifiers]
echo64.c: 555 | if (Hash(CRYPTO_BYTES * 8,in,inlen * 8,out) == SUCCESS) return 0;
echo64.c: | ^~
echo64.c: echo64.c:542:46: note: expected 'BitSequence *' {aka 'unsigned char *'} but argument is of type 'const unsigned char *'
echo64.c: 542 | HashReturn Hash(int hashbitlen, BitSequence *data, DataLength databitlen, BitSequence *hashval)
echo64.c: | ~~~~~~~~~~~~~^~~~

Number of similar (compiler,implementation) pairs: 4, namely:
CompilerImplementations
gcc -march=native -mtune=native -O2 -fomit-frame-pointer -fwrapv -fPIC -fPIE T:generic/opt64
gcc -march=native -mtune=native -O3 -fomit-frame-pointer -fwrapv -fPIC -fPIE T:generic/opt64
gcc -march=native -mtune=native -O -fomit-frame-pointer -fwrapv -fPIC -fPIE T:generic/opt64
gcc -march=native -mtune=native -Os -fomit-frame-pointer -fwrapv -fPIC -fPIE T:generic/opt64

Compiler output

Implementation: T:pentium/pentium4v64v1
Security model: timingleaks
Compiler: gcc -march=native -mtune=native -O2 -fomit-frame-pointer -fwrapv -fPIC -fPIE
try.c: /usr/bin/ld: libcrypto_hash_echosp512.a(echo32.o): relocation R_X86_64_32S against symbol `SHA3_R' can not be used when making a PIE object; recompile with -fPIE
try.c: /usr/bin/ld: failed to set dynamic section sizes: bad value
try.c: collect2: error: ld returned 1 exit status

Number of similar (compiler,implementation) pairs: 4, namely:
CompilerImplementations
gcc -march=native -mtune=native -O2 -fomit-frame-pointer -fwrapv -fPIC -fPIE T:pentium/pentium4v64v1
gcc -march=native -mtune=native -O3 -fomit-frame-pointer -fwrapv -fPIC -fPIE T:pentium/pentium4v64v1
gcc -march=native -mtune=native -O -fomit-frame-pointer -fwrapv -fPIC -fPIE T:pentium/pentium4v64v1
gcc -march=native -mtune=native -Os -fomit-frame-pointer -fwrapv -fPIC -fPIE T:pentium/pentium4v64v1

Compiler output

Implementation: T:pentium/pentium4v64v2
Security model: timingleaks
Compiler: gcc -march=native -mtune=native -O2 -fomit-frame-pointer -fwrapv -fPIC -fPIE
try.c: /usr/bin/ld: libcrypto_hash_echosp512.a(echo64.o): relocation R_X86_64_32S against symbol `SHA3_R' can not be used when making a PIE object; recompile with -fPIE
try.c: /usr/bin/ld: failed to set dynamic section sizes: bad value
try.c: collect2: error: ld returned 1 exit status

Number of similar (compiler,implementation) pairs: 4, namely:
CompilerImplementations
gcc -march=native -mtune=native -O2 -fomit-frame-pointer -fwrapv -fPIC -fPIE T:pentium/pentium4v64v2
gcc -march=native -mtune=native -O3 -fomit-frame-pointer -fwrapv -fPIC -fPIE T:pentium/pentium4v64v2
gcc -march=native -mtune=native -O -fomit-frame-pointer -fwrapv -fPIC -fPIE T:pentium/pentium4v64v2
gcc -march=native -mtune=native -Os -fomit-frame-pointer -fwrapv -fPIC -fPIE T:pentium/pentium4v64v2