Implementation notes: amd64, shoe, crypto_hash/groestl256

Computer: shoe
Microarchitecture: amd64; Broadwell+AES (306d4)
Architecture: amd64
CPU ID: GenuineIntel-000306d4-bfebfbff
SUPERCOP version: 20240425
Operation: crypto_hash
Primitive: groestl256
TimeObject sizeTest sizeImplementationCompilerBenchmark dateSUPERCOP version
1527519562 0 97632295 788 1944T:aesni-intrgcc_-march=native_-mtune=native_-O3_-fomit-frame-pointer_-fwrapv_-fPIC_-fPIE2024042720240425
1531619626 0 97632359 788 1944T:avx-intrgcc_-march=native_-mtune=native_-O3_-fomit-frame-pointer_-fwrapv_-fPIC_-fPIE2024042720240425
1543819153 0 97630087 788 1944T:avx-intrgcc_-march=native_-mtune=native_-O2_-fomit-frame-pointer_-fwrapv_-fPIC_-fPIE2024042720240425
1544219089 0 97630023 788 1944T:aesni-intrgcc_-march=native_-mtune=native_-O2_-fomit-frame-pointer_-fwrapv_-fPIC_-fPIE2024042720240425
1548818208 0 97628830 780 1944T:aesni-intrgcc_-march=native_-mtune=native_-O_-fomit-frame-pointer_-fwrapv_-fPIC_-fPIE2024042720240425
1549518248 0 97628878 780 1944T:avx-intrgcc_-march=native_-mtune=native_-O_-fomit-frame-pointer_-fwrapv_-fPIC_-fPIE2024042720240425
1625218677 0 97628346 764 1912T:aesni-intrgcc_-march=native_-mtune=native_-Os_-fomit-frame-pointer_-fwrapv_-fPIC_-fPIE2024042720240425
1666418632 0 97628314 764 1912T:avx-intrgcc_-march=native_-mtune=native_-Os_-fomit-frame-pointer_-fwrapv_-fPIC_-fPIE2024042720240425
1741521615 0 105634171 820 1976T:avx-intrclang_-march=native_-O2_-fomit-frame-pointer_-fwrapv_-Qunused-arguments_-fPIC_-fPIE2024042720240425
1745018332 0 105628665 812 1944T:avx-intrclang_-march=native_-Os_-fomit-frame-pointer_-fwrapv_-Qunused-arguments_-fPIC_-fPIE2024042720240425
1745921395 0 99233947 820 1912T:aesni-intrclang_-march=native_-O2_-fomit-frame-pointer_-fwrapv_-Qunused-arguments_-fPIC_-fPIE2024042720240425
1746121636 0 105634267 820 1976T:avx-intrclang_-march=native_-O3_-fomit-frame-pointer_-fwrapv_-Qunused-arguments_-fPIC_-fPIE2024042720240425
1752021416 0 99234075 820 1912T:aesni-intrclang_-march=native_-O3_-fomit-frame-pointer_-fwrapv_-Qunused-arguments_-fPIC_-fPIE2024042720240425
1759218123 0 99228457 812 1880T:aesni-intrclang_-march=native_-Os_-fomit-frame-pointer_-fwrapv_-Qunused-arguments_-fPIC_-fPIE2024042720240425
1763821769 0 134432345 812 2232T:avx-intrclang_-march=native_-O_-fomit-frame-pointer_-fwrapv_-Qunused-arguments_-fPIC_-fPIE2024042720240425
1794221577 0 121632169 812 2104T:aesni-intrclang_-march=native_-O_-fomit-frame-pointer_-fwrapv_-Qunused-arguments_-fPIC_-fPIE2024042720240425
3077654308 0 067760 812 920T:opteron-unrolledclang_-march=native_-O2_-fomit-frame-pointer_-fwrapv_-Qunused-arguments_-fPIC_-fPIE2024042720240425
3084454512 0 067344 812 888T:opteron-unrolledclang_-mcpu=native_-O3_-fomit-frame-pointer_-fwrapv_-Qunused-arguments_-fPIC_-fPIE2024042720240425
3085154420 0 067968 812 920T:opteron-unrolledclang_-march=native_-O3_-fomit-frame-pointer_-fwrapv_-Qunused-arguments_-fPIC_-fPIE2024042720240425
3086853651 0 063878 804 888T:opteron-unrolledclang_-march=native_-Os_-fomit-frame-pointer_-fwrapv_-Qunused-arguments_-fPIC_-fPIE2024042720240425
3195941806 0 126451482 764 2200T:vperm-intrgcc_-march=native_-mtune=native_-Os_-fomit-frame-pointer_-fwrapv_-fPIC_-fPIE2024042720240425
3217822276 0 035712 812 920T:opteronclang_-march=native_-O2_-fomit-frame-pointer_-fwrapv_-Qunused-arguments_-fPIC_-fPIE2024042720240425
3218222388 0 035920 812 920T:opteronclang_-march=native_-O3_-fomit-frame-pointer_-fwrapv_-Qunused-arguments_-fPIC_-fPIE2024042720240425
3220222448 0 035264 812 888T:opteronclang_-mcpu=native_-O3_-fomit-frame-pointer_-fwrapv_-Qunused-arguments_-fPIC_-fPIE2024042720240425
3222642254 0 126452878 780 2232T:vperm-intrgcc_-march=native_-mtune=native_-O_-fomit-frame-pointer_-fwrapv_-fPIC_-fPIE2024042720240425
3252821607 0 031798 804 888T:opteronclang_-march=native_-Os_-fomit-frame-pointer_-fwrapv_-Qunused-arguments_-fPIC_-fPIE2024042720240425
3256844002 0 126456751 788 2232T:vperm-intrgcc_-march=native_-mtune=native_-O3_-fomit-frame-pointer_-fwrapv_-fPIC_-fPIE2024042720240425
3269222560 0 035376 812 888T:core2duoclang_-mcpu=native_-O3_-fomit-frame-pointer_-fwrapv_-Qunused-arguments_-fPIC_-fPIE2024042720240425
3274922388 0 035840 812 920T:core2duoclang_-march=native_-O2_-fomit-frame-pointer_-fwrapv_-Qunused-arguments_-fPIC_-fPIE2024042720240425
3282022500 0 036032 812 920T:core2duoclang_-march=native_-O3_-fomit-frame-pointer_-fwrapv_-Qunused-arguments_-fPIC_-fPIE2024042720240425
3291421734 0 031958 804 888T:core2duoclang_-march=native_-Os_-fomit-frame-pointer_-fwrapv_-Qunused-arguments_-fPIC_-fPIE2024042720240425
3303543601 0 126454535 788 2232T:vperm-intrgcc_-march=native_-mtune=native_-O2_-fomit-frame-pointer_-fwrapv_-fPIC_-fPIE2024042720240425
3666849969 0 219262915 820 3096T:vperm-intrclang_-march=native_-O3_-fomit-frame-pointer_-fwrapv_-Qunused-arguments_-fPIC_-fPIE2024042720240425
3668349969 0 219262819 820 3096T:vperm-intrclang_-march=native_-O2_-fomit-frame-pointer_-fwrapv_-Qunused-arguments_-fPIC_-fPIE2024042720240425
3676347525 0 219257873 812 3096T:vperm-intrclang_-march=native_-Os_-fomit-frame-pointer_-fwrapv_-Qunused-arguments_-fPIC_-fPIE2024042720240425
4185045158 0 055872 780 952T:sphlibgcc_-march=native_-mtune=native_-O_-fomit-frame-pointer_-fwrapv_-fPIC_-fPIE2024042720240425
4207943738 0 053427 756 920T:sphlib-adaptedgcc_-march=native_-mtune=native_-Os_-fomit-frame-pointer_-fwrapv_-fPIC_-fPIE2024042720240425
4208148288 0 059008 780 952T:sphlib-adaptedgcc_-march=native_-mtune=native_-O_-fomit-frame-pointer_-fwrapv_-fPIC_-fPIE2024042720240425
4223341062 0 050755 756 920T:sphlibgcc_-march=native_-mtune=native_-Os_-fomit-frame-pointer_-fwrapv_-fPIC_-fPIE2024042720240425
4318045615 0 056560 780 952T:sphlibgcc_-march=native_-mtune=native_-O2_-fomit-frame-pointer_-fwrapv_-fPIC_-fPIE2024042720240425
4346150399 0 063136 780 952T:sphlib-adaptedgcc_-march=native_-mtune=native_-O3_-fomit-frame-pointer_-fwrapv_-fPIC_-fPIE2024042720240425
4355750831 0 061776 780 952T:sphlib-adaptedgcc_-march=native_-mtune=native_-O2_-fomit-frame-pointer_-fwrapv_-fPIC_-fPIE2024042720240425
4422653057 0 066000 812 888T:sphlib-adaptedclang_-mcpu=native_-O3_-fomit-frame-pointer_-fwrapv_-Qunused-arguments_-fPIC_-fPIE2024042720240425
4454352225 0 065888 812 920T:sphlib-adaptedclang_-march=native_-O3_-fomit-frame-pointer_-fwrapv_-Qunused-arguments_-fPIC_-fPIE2024042720240425
4464547343 0 060080 780 952T:sphlibgcc_-march=native_-mtune=native_-O3_-fomit-frame-pointer_-fwrapv_-fPIC_-fPIE2024042720240425
4469652225 0 065792 812 920T:sphlib-adaptedclang_-march=native_-O2_-fomit-frame-pointer_-fwrapv_-Qunused-arguments_-fPIC_-fPIE2024042720240425
4520452685 0 063310 804 888T:sphlib-adaptedclang_-march=native_-O_-fomit-frame-pointer_-fwrapv_-Qunused-arguments_-fPIC_-fPIE2024042720240425
4637869778 0 082648 796 952T:mmxgcc_-march=native_-mtune=native_-O3_-fomit-frame-pointer_-fwrapv_-fPIC_-fPIE2024042720240425
4650623135 0 035872 780 952T:sphlib-smallgcc_-march=native_-mtune=native_-O3_-fomit-frame-pointer_-fwrapv_-fPIC_-fPIE2024042720240425
4662465860 0 075651 772 920T:mmxgcc_-march=native_-mtune=native_-Os_-fomit-frame-pointer_-fwrapv_-fPIC_-fPIE2024042720240425
4665167071 0 078120 796 952T:mmxgcc_-march=native_-mtune=native_-O2_-fomit-frame-pointer_-fwrapv_-fPIC_-fPIE2024042720240425
4670121887 0 032832 780 952T:sphlib-smallgcc_-march=native_-mtune=native_-O2_-fomit-frame-pointer_-fwrapv_-fPIC_-fPIE2024042720240425
4762019926 0 030648 780 952T:sphlib-smallgcc_-march=native_-mtune=native_-O_-fomit-frame-pointer_-fwrapv_-fPIC_-fPIE2024042720240425
4793167048 0 077799 788 952T:mmxgcc_-march=native_-mtune=native_-O_-fomit-frame-pointer_-fwrapv_-fPIC_-fPIE2024042720240425
4801668811 0 082630 836 920T:mmxclang_-march=native_-O3_-fomit-frame-pointer_-fwrapv_-Qunused-arguments_-fPIC_-fPIE2024042720240425
4803768179 0 081902 836 920T:mmxclang_-march=native_-O2_-fomit-frame-pointer_-fwrapv_-Qunused-arguments_-fPIC_-fPIE2024042720240425
4835348769 0 062416 812 920T:sphlibclang_-march=native_-O3_-fomit-frame-pointer_-fwrapv_-Qunused-arguments_-fPIC_-fPIE2024042720240425
4836950001 0 062928 812 888T:sphlibclang_-mcpu=native_-O3_-fomit-frame-pointer_-fwrapv_-Qunused-arguments_-fPIC_-fPIE2024042720240425
4844648769 0 062320 812 920T:sphlibclang_-march=native_-O2_-fomit-frame-pointer_-fwrapv_-Qunused-arguments_-fPIC_-fPIE2024042720240425
4874618192 0 027875 756 920T:sphlib-smallgcc_-march=native_-mtune=native_-Os_-fomit-frame-pointer_-fwrapv_-fPIC_-fPIE2024042720240425
4883169291 0 082390 836 888T:mmxclang_-mcpu=native_-O3_-fomit-frame-pointer_-fwrapv_-Qunused-arguments_-fPIC_-fPIE2024042720240425
4946553870 0 064198 804 888T:sphlib-adaptedclang_-march=native_-Os_-fomit-frame-pointer_-fwrapv_-Qunused-arguments_-fPIC_-fPIE2024042720240425
5064164489 0 074886 820 888T:mmxclang_-march=native_-Os_-fomit-frame-pointer_-fwrapv_-Qunused-arguments_-fPIC_-fPIE2024042720240425
5069349677 0 060286 804 888T:sphlibclang_-march=native_-O_-fomit-frame-pointer_-fwrapv_-Qunused-arguments_-fPIC_-fPIE2024042720240425
5106869157 0 079814 820 888T:mmxclang_-march=native_-O_-fomit-frame-pointer_-fwrapv_-Qunused-arguments_-fPIC_-fPIE2024042720240425
5259248846 0 059142 804 888T:sphlibclang_-march=native_-Os_-fomit-frame-pointer_-fwrapv_-Qunused-arguments_-fPIC_-fPIE2024042720240425
5467021473 0 034736 812 920T:sphlib-smallclang_-march=native_-O3_-fomit-frame-pointer_-fwrapv_-Qunused-arguments_-fPIC_-fPIE2024042720240425
5526620155 0 030102 804 888T:sphlib-smallclang_-march=native_-Os_-fomit-frame-pointer_-fwrapv_-Qunused-arguments_-fPIC_-fPIE2024042720240425
5538121473 0 034656 812 920T:sphlib-smallclang_-march=native_-O2_-fomit-frame-pointer_-fwrapv_-Qunused-arguments_-fPIC_-fPIE2024042720240425
6043223441 0 036272 812 888T:sphlib-smallclang_-mcpu=native_-O3_-fomit-frame-pointer_-fwrapv_-Qunused-arguments_-fPIC_-fPIE2024042720240425
6147620429 0 031054 804 888T:sphlib-smallclang_-march=native_-O_-fomit-frame-pointer_-fwrapv_-Qunused-arguments_-fPIC_-fPIE2024042720240425
7847422839 0 035752 796 952T:opt32gcc_-march=native_-mtune=native_-O3_-fomit-frame-pointer_-fwrapv_-fPIC_-fPIE2024042720240425
7984521439 0 032496 796 952T:opt32gcc_-march=native_-mtune=native_-O2_-fomit-frame-pointer_-fwrapv_-fPIC_-fPIE2024042720240425
8001220901 0 031687 788 952T:opt32gcc_-march=native_-mtune=native_-O_-fomit-frame-pointer_-fwrapv_-fPIC_-fPIE2024042720240425
8085820872 0 030707 772 920T:opt32gcc_-march=native_-mtune=native_-Os_-fomit-frame-pointer_-fwrapv_-fPIC_-fPIE2024042720240425
8395226718 0 039902 836 888T:opt32clang_-mcpu=native_-O3_-fomit-frame-pointer_-fwrapv_-Qunused-arguments_-fPIC_-fPIE2024042720240425
8530324597 0 035294 820 888T:opt32clang_-march=native_-O_-fomit-frame-pointer_-fwrapv_-Qunused-arguments_-fPIC_-fPIE2024042720240425
855899286 0 022168 812 888T:32bit-2ktableclang_-mcpu=native_-O3_-fomit-frame-pointer_-fwrapv_-Qunused-arguments_-fPIC_-fPIE2024042720240425
860998541 0 019046 804 888T:32bit-2ktableclang_-march=native_-O_-fomit-frame-pointer_-fwrapv_-Qunused-arguments_-fPIC_-fPIE2024042720240425
8635526486 0 040278 836 920T:opt32clang_-march=native_-O2_-fomit-frame-pointer_-fwrapv_-Qunused-arguments_-fPIC_-fPIE2024042720240425
8670626662 0 040566 836 920T:opt32clang_-march=native_-O3_-fomit-frame-pointer_-fwrapv_-Qunused-arguments_-fPIC_-fPIE2024042720240425
874978473 0 018742 804 888T:32bit-2ktableclang_-march=native_-Os_-fomit-frame-pointer_-fwrapv_-Qunused-arguments_-fPIC_-fPIE2024042720240425
875219112 0 022616 812 920T:32bit-2ktableclang_-march=native_-O2_-fomit-frame-pointer_-fwrapv_-Qunused-arguments_-fPIC_-fPIE2024042720240425
879159208 0 022808 812 920T:32bit-2ktableclang_-march=native_-O3_-fomit-frame-pointer_-fwrapv_-Qunused-arguments_-fPIC_-fPIE2024042720240425
8829224183 0 034638 820 888T:opt32clang_-march=native_-Os_-fomit-frame-pointer_-fwrapv_-Qunused-arguments_-fPIC_-fPIE2024042720240425
112528109017 0 2272119609 812 3160T:vperm-intrclang_-march=native_-O_-fomit-frame-pointer_-fwrapv_-Qunused-arguments_-fPIC_-fPIE2024042720240425
12013011175 0 020803 756 920T:32bit-2ktablegcc_-march=native_-mtune=native_-Os_-fomit-frame-pointer_-fwrapv_-fPIC_-fPIE2024042720240425
13345711257 0 023936 780 952T:32bit-2ktablegcc_-march=native_-mtune=native_-O3_-fomit-frame-pointer_-fwrapv_-fPIC_-fPIE2024042720240425
13461511571 0 022448 780 952T:32bit-2ktablegcc_-march=native_-mtune=native_-O2_-fomit-frame-pointer_-fwrapv_-fPIC_-fPIE2024042720240425
1466326628 0 020240 812 920T:32bit-bytesliced-c-fastclang_-march=native_-O3_-fomit-frame-pointer_-fwrapv_-Qunused-arguments_-fPIC_-fPIE2024042720240425
1471456395 0 019920 812 920T:32bit-bytesliced-c-fastclang_-march=native_-O2_-fomit-frame-pointer_-fwrapv_-Qunused-arguments_-fPIC_-fPIE2024042720240425
1487785729 0 018624 812 888T:32bit-bytesliced-c-fastclang_-mcpu=native_-O3_-fomit-frame-pointer_-fwrapv_-Qunused-arguments_-fPIC_-fPIE2024042720240425
15256410744 0 021319 772 952T:32bit-2ktablegcc_-march=native_-mtune=native_-O_-fomit-frame-pointer_-fwrapv_-fPIC_-fPIE2024042720240425
1773665607 0 018320 780 952T:32bit-bytesliced-c-fastgcc_-march=native_-mtune=native_-O3_-fomit-frame-pointer_-fwrapv_-fPIC_-fPIE2024042720240425
1872444762 0 017600 812 888T:32bit-bytesliced-c-smallclang_-mcpu=native_-O3_-fomit-frame-pointer_-fwrapv_-Qunused-arguments_-fPIC_-fPIE2024042720240425
1897343556 0 014472 780 952T:32bit-bytesliced-c-fastgcc_-march=native_-mtune=native_-O2_-fomit-frame-pointer_-fwrapv_-fPIC_-fPIE2024042720240425
1918213545 0 017032 812 920T:32bit-bytesliced-c-smallclang_-march=native_-O2_-fomit-frame-pointer_-fwrapv_-Qunused-arguments_-fPIC_-fPIE2024042720240425
1939464989 0 015230 804 888T:32bit-bytesliced-c-fastclang_-march=native_-Os_-fomit-frame-pointer_-fwrapv_-Qunused-arguments_-fPIC_-fPIE2024042720240425
1971805188 0 018752 812 920T:32bit-bytesliced-c-smallclang_-march=native_-O3_-fomit-frame-pointer_-fwrapv_-Qunused-arguments_-fPIC_-fPIE2024042720240425
2112434433 0 017056 780 952T:8bit_cgcc_-march=native_-mtune=native_-O3_-fomit-frame-pointer_-fwrapv_-fPIC_-fPIE2024042720240425
2173224523 0 015360 780 952T:8bit_cgcc_-march=native_-mtune=native_-O2_-fomit-frame-pointer_-fwrapv_-fPIC_-fPIE2024042720240425
2184284371 0 014903 772 952T:8bit_cgcc_-march=native_-mtune=native_-O_-fomit-frame-pointer_-fwrapv_-fPIC_-fPIE2024042720240425
2209792580 0 012211 756 920T:32bit-bytesliced-c-fastgcc_-march=native_-mtune=native_-Os_-fomit-frame-pointer_-fwrapv_-fPIC_-fPIE2024042720240425
2222104894 0 017560 780 952T:32bit-bytesliced-c-smallgcc_-march=native_-mtune=native_-O3_-fomit-frame-pointer_-fwrapv_-fPIC_-fPIE2024042720240425
2223094382 0 017200 812 888T:8bit_cclang_-mcpu=native_-O3_-fomit-frame-pointer_-fwrapv_-Qunused-arguments_-fPIC_-fPIE2024042720240425
2227004261 0 017792 812 920T:8bit_cclang_-march=native_-O3_-fomit-frame-pointer_-fwrapv_-Qunused-arguments_-fPIC_-fPIE2024042720240425
2227444261 0 017696 812 920T:8bit_cclang_-march=native_-O2_-fomit-frame-pointer_-fwrapv_-Qunused-arguments_-fPIC_-fPIE2024042720240425
2228123046 0 013566 804 888T:32bit-bytesliced-c-fastclang_-march=native_-O_-fomit-frame-pointer_-fwrapv_-Qunused-arguments_-fPIC_-fPIE2024042720240425
2244192870 0 013495 772 952T:32bit-bytesliced-c-fastgcc_-march=native_-mtune=native_-O_-fomit-frame-pointer_-fwrapv_-fPIC_-fPIE2024042720240425
2289204049 0 014246 804 888T:8bit_cclang_-march=native_-Os_-fomit-frame-pointer_-fwrapv_-Qunused-arguments_-fPIC_-fPIE2024042720240425
2295004233 0 014686 804 888T:8bit_cclang_-march=native_-O_-fomit-frame-pointer_-fwrapv_-Qunused-arguments_-fPIC_-fPIE2024042720240425
2669542043 0 012510 804 888T:32bit-bytesliced-c-smallclang_-march=native_-O_-fomit-frame-pointer_-fwrapv_-Qunused-arguments_-fPIC_-fPIE2024042720240425
2916312726 0 012958 804 888T:32bit-bytesliced-c-smallclang_-march=native_-Os_-fomit-frame-pointer_-fwrapv_-Qunused-arguments_-fPIC_-fPIE2024042720240425
2926781682 0 011275 756 920T:32bit-bytesliced-c-smallgcc_-march=native_-mtune=native_-Os_-fomit-frame-pointer_-fwrapv_-fPIC_-fPIE2024042720240425
2992262142 0 013008 780 952T:32bit-bytesliced-c-smallgcc_-march=native_-mtune=native_-O2_-fomit-frame-pointer_-fwrapv_-fPIC_-fPIE2024042720240425
3195293946 0 013531 756 920T:8bit_cgcc_-march=native_-mtune=native_-Os_-fomit-frame-pointer_-fwrapv_-fPIC_-fPIE2024042720240425
4273352420 0 012983 772 952T:32bit-bytesliced-c-smallgcc_-march=native_-mtune=native_-O_-fomit-frame-pointer_-fwrapv_-fPIC_-fPIE2024042720240425

Test failure

Implementation: T:aesni
Security model: timingleaks
Compiler: gcc -march=native -mtune=native -O2 -fomit-frame-pointer -fwrapv -fPIC -fPIE
error 111

Number of similar (compiler,implementation) pairs: 8, namely:
CompilerImplementations
gcc -march=native -mtune=native -O2 -fomit-frame-pointer -fwrapv -fPIC -fPIE T:aesni
gcc -march=native -mtune=native -O3 -fomit-frame-pointer -fwrapv -fPIC -fPIE T:aesni
gcc -march=native -mtune=native -O -fomit-frame-pointer -fwrapv -fPIC -fPIE T:aesni
gcc -march=native -mtune=native -Os -fomit-frame-pointer -fwrapv -fPIC -fPIE T:aesni
gcc -march=native -mtune=native -O2 -fomit-frame-pointer -fwrapv -fPIC -fPIE T:avx
gcc -march=native -mtune=native -O3 -fomit-frame-pointer -fwrapv -fPIC -fPIE T:avx
gcc -march=native -mtune=native -O -fomit-frame-pointer -fwrapv -fPIC -fPIE T:avx
gcc -march=native -mtune=native -Os -fomit-frame-pointer -fwrapv -fPIC -fPIE T:avx

Compiler output

Implementation: T:aesni
Security model: timingleaks
Compiler: clang -march=native -O2 -fomit-frame-pointer -fwrapv -Qunused-arguments -fPIC -fPIE
hash.c: hash.c:104:12: warning: comparison of array 'ctx->chaining' equal to a null pointer is always false [-Wtautological-pointer-compare]
hash.c: if (ctx->chaining == NULL || ctx->buffer == NULL)
hash.c: ~~~~~^~~~~~~~ ~~~~
hash.c: hash.c:104:37: warning: comparison of array 'ctx->buffer' equal to a null pointer is always false [-Wtautological-pointer-compare]
hash.c: if (ctx->chaining == NULL || ctx->buffer == NULL)
hash.c: ~~~~~^~~~~~ ~~~~
hash.c: In file included from hash.c:13:
hash.c: ./groestl-asm-aes.h:389:8: error: invalid operand for instruction
hash.c: asm ("movaps xmm12, [rdi+0*16]");
hash.c: ^
hash.c: <inline asm>:1:16: note: instantiated into assembly here
hash.c: movaps xmm12, [rdi+0*16]
hash.c: ^~~~~~~~~~
hash.c: In file included from hash.c:13:
hash.c: ./groestl-asm-aes.h:390:8: error: invalid operand for instruction
hash.c: asm ("movaps xmm13, [rdi+1*16]");
hash.c: ^
hash.c: <inline asm>:1:16: note: instantiated into assembly here
hash.c: movaps xmm13, [rdi+1*16]
hash.c: ^~~~~~~~~~
hash.c: In file included from hash.c:13:
hash.c: ./groestl-asm-aes.h:391:8: error: invalid operand for instruction
hash.c: asm ("movaps xmm14, [rdi+2*16]");
hash.c: ^
hash.c: <inline asm>:1:16: note: instantiated into assembly here
hash.c: ...

Number of similar (compiler,implementation) pairs: 5, namely:
CompilerImplementations
clang -march=native -O2 -fomit-frame-pointer -fwrapv -Qunused-arguments -fPIC -fPIE T:aesni
clang -march=native -O3 -fomit-frame-pointer -fwrapv -Qunused-arguments -fPIC -fPIE T:aesni
clang -march=native -O -fomit-frame-pointer -fwrapv -Qunused-arguments -fPIC -fPIE T:aesni
clang -march=native -Os -fomit-frame-pointer -fwrapv -Qunused-arguments -fPIC -fPIE T:aesni
clang -mcpu=native -O3 -fomit-frame-pointer -fwrapv -Qunused-arguments -fPIC -fPIE T:aesni

Compiler output

Implementation: T:aesni-intr
Security model: timingleaks
Compiler: clang -march=native -O2 -fomit-frame-pointer -fwrapv -Qunused-arguments -fPIC -fPIE
hash.c: hash.c:104:12: warning: comparison of array 'ctx->chaining' equal to a null pointer is always false [-Wtautological-pointer-compare]
hash.c: if (ctx->chaining == NULL || ctx->buffer == NULL)
hash.c: ~~~~~^~~~~~~~ ~~~~
hash.c: hash.c:104:37: warning: comparison of array 'ctx->buffer' equal to a null pointer is always false [-Wtautological-pointer-compare]
hash.c: if (ctx->chaining == NULL || ctx->buffer == NULL)
hash.c: ~~~~~^~~~~~ ~~~~
hash.c: 2 warnings generated.

Number of similar (compiler,implementation) pairs: 8, namely:
CompilerImplementations
clang -march=native -O2 -fomit-frame-pointer -fwrapv -Qunused-arguments -fPIC -fPIE T:aesni-intr
clang -march=native -O3 -fomit-frame-pointer -fwrapv -Qunused-arguments -fPIC -fPIE T:aesni-intr
clang -march=native -O -fomit-frame-pointer -fwrapv -Qunused-arguments -fPIC -fPIE T:aesni-intr
clang -march=native -Os -fomit-frame-pointer -fwrapv -Qunused-arguments -fPIC -fPIE T:aesni-intr
clang -march=native -O2 -fomit-frame-pointer -fwrapv -Qunused-arguments -fPIC -fPIE T:vperm-intr
clang -march=native -O3 -fomit-frame-pointer -fwrapv -Qunused-arguments -fPIC -fPIE T:vperm-intr
clang -march=native -O -fomit-frame-pointer -fwrapv -Qunused-arguments -fPIC -fPIE T:vperm-intr
clang -march=native -Os -fomit-frame-pointer -fwrapv -Qunused-arguments -fPIC -fPIE T:vperm-intr

Compiler output

Implementation: T:aesni-intr
Security model: timingleaks
Compiler: clang -mcpu=native -O3 -fomit-frame-pointer -fwrapv -Qunused-arguments -fPIC -fPIE
hash.c: In file included from hash.c:28:
hash.c: ./groestl-intr-aes.h:370:3: error: always_inline function '_mm_shuffle_epi8' requires target feature 'ssse3', but would be inlined into function 'INIT' that is compiled without support for 'ssse3'
hash.c: Matrix_Transpose_A(xmm12, xmm13, xmm14, xmm15, xmm2, xmm6, xmm7, xmm0);
hash.c: ^
hash.c: ./groestl-intr-aes.h:242:8: note: expanded from macro 'Matrix_Transpose_A'
hash.c: i0 = _mm_shuffle_epi8(i0, t0);\
hash.c: ^
hash.c: ./groestl-intr-aes.h:370:3: error: always_inline function '_mm_shuffle_epi8' requires target feature 'ssse3', but would be inlined into function 'INIT' that is compiled without support for 'ssse3'
hash.c: ./groestl-intr-aes.h:243:8: note: expanded from macro 'Matrix_Transpose_A'
hash.c: i1 = _mm_shuffle_epi8(i1, t0);\
hash.c: ^
hash.c: ./groestl-intr-aes.h:370:3: error: always_inline function '_mm_shuffle_epi8' requires target feature 'ssse3', but would be inlined into function 'INIT' that is compiled without support for 'ssse3'
hash.c: ./groestl-intr-aes.h:244:8: note: expanded from macro 'Matrix_Transpose_A'
hash.c: i2 = _mm_shuffle_epi8(i2, t0);\
hash.c: ^
hash.c: ./groestl-intr-aes.h:370:3: error: always_inline function '_mm_shuffle_epi8' requires target feature 'ssse3', but would be inlined into function 'INIT' that is compiled without support for 'ssse3'
hash.c: ./groestl-intr-aes.h:245:8: note: expanded from macro 'Matrix_Transpose_A'
hash.c: i3 = _mm_shuffle_epi8(i3, t0);\
hash.c: ^
hash.c: hash.c:104:12: warning: comparison of array 'ctx->chaining' equal to a null pointer is always false [-Wtautological-pointer-compare]
hash.c: if (ctx->chaining == NULL || ctx->buffer == NULL)
hash.c: ~~~~~^~~~~~~~ ~~~~
hash.c: hash.c:104:37: warning: comparison of array 'ctx->buffer' equal to a null pointer is always false [-Wtautological-pointer-compare]
hash.c: if (ctx->chaining == NULL || ctx->buffer == NULL)
hash.c: ~~~~~^~~~~~ ~~~~
hash.c: ...

Number of similar (compiler,implementation) pairs: 1, namely:
CompilerImplementations
clang -mcpu=native -O3 -fomit-frame-pointer -fwrapv -Qunused-arguments -fPIC -fPIE T:aesni-intr

Compiler output

Implementation: T:avx
Security model: timingleaks
Compiler: clang -march=native -O2 -fomit-frame-pointer -fwrapv -Qunused-arguments -fPIC -fPIE
hash.c: hash.c:69:12: warning: comparison of array 'ctx->chaining' equal to a null pointer is always false [-Wtautological-pointer-compare]
hash.c: if (ctx->chaining == NULL || ctx->buffer == NULL)
hash.c: ~~~~~^~~~~~~~ ~~~~
hash.c: hash.c:69:37: warning: comparison of array 'ctx->buffer' equal to a null pointer is always false [-Wtautological-pointer-compare]
hash.c: if (ctx->chaining == NULL || ctx->buffer == NULL)
hash.c: ~~~~~^~~~~~ ~~~~
hash.c: hash.c:62:3: warning: while loop has empty body [-Wempty-body]
hash.c: SET_CONSTANTS();
hash.c: ^
hash.c: ./groestl-asm-avx.h:62:10: note: expanded from macro 'SET_CONSTANTS'
hash.c: }while(0);
hash.c: ^
hash.c: hash.c:62:3: note: put the semicolon on a separate line to silence this warning
hash.c: ./groestl-asm-avx.h:62:10: note: expanded from macro 'SET_CONSTANTS'
hash.c: }while(0);
hash.c: ^
hash.c: ./groestl-asm-avx.h:377:8: error: invalid operand for instruction
hash.c: asm ("vmovdqa xmm12, [rdi+0*16]");
hash.c: ^
hash.c: <inline asm>:1:17: note: instantiated into assembly here
hash.c: vmovdqa xmm12, [rdi+0*16]
hash.c: ^~~~~~~~~~
hash.c: In file included from hash.c:9:
hash.c: ./groestl-asm-avx.h:378:8: error: invalid operand for instruction
hash.c: asm ("vmovdqa xmm13, [rdi+1*16]");
hash.c: ...

Number of similar (compiler,implementation) pairs: 5, namely:
CompilerImplementations
clang -march=native -O2 -fomit-frame-pointer -fwrapv -Qunused-arguments -fPIC -fPIE T:avx
clang -march=native -O3 -fomit-frame-pointer -fwrapv -Qunused-arguments -fPIC -fPIE T:avx
clang -march=native -O -fomit-frame-pointer -fwrapv -Qunused-arguments -fPIC -fPIE T:avx
clang -march=native -Os -fomit-frame-pointer -fwrapv -Qunused-arguments -fPIC -fPIE T:avx
clang -mcpu=native -O3 -fomit-frame-pointer -fwrapv -Qunused-arguments -fPIC -fPIE T:avx

Compiler output

Implementation: T:avx-intr
Security model: timingleaks
Compiler: clang -march=native -O2 -fomit-frame-pointer -fwrapv -Qunused-arguments -fPIC -fPIE
hash.c: hash.c:69:12: warning: comparison of array 'ctx->chaining' equal to a null pointer is always false [-Wtautological-pointer-compare]
hash.c: if (ctx->chaining == NULL || ctx->buffer == NULL)
hash.c: ~~~~~^~~~~~~~ ~~~~
hash.c: hash.c:69:37: warning: comparison of array 'ctx->buffer' equal to a null pointer is always false [-Wtautological-pointer-compare]
hash.c: if (ctx->chaining == NULL || ctx->buffer == NULL)
hash.c: ~~~~~^~~~~~ ~~~~
hash.c: 2 warnings generated.

Number of similar (compiler,implementation) pairs: 4, namely:
CompilerImplementations
clang -march=native -O2 -fomit-frame-pointer -fwrapv -Qunused-arguments -fPIC -fPIE T:avx-intr
clang -march=native -O3 -fomit-frame-pointer -fwrapv -Qunused-arguments -fPIC -fPIE T:avx-intr
clang -march=native -O -fomit-frame-pointer -fwrapv -Qunused-arguments -fPIC -fPIE T:avx-intr
clang -march=native -Os -fomit-frame-pointer -fwrapv -Qunused-arguments -fPIC -fPIE T:avx-intr

Compiler output

Implementation: T:avx-intr
Security model: timingleaks
Compiler: clang -mcpu=native -O3 -fomit-frame-pointer -fwrapv -Qunused-arguments -fPIC -fPIE
hash.c: In file included from hash.c:9:
hash.c: ./groestl-intr-avx.h:356:3: error: always_inline function '_mm_shuffle_epi8' requires target feature 'ssse3', but would be inlined into function 'INIT' that is compiled without support for 'ssse3'
hash.c: Matrix_Transpose_A(xmm12, xmm13, xmm14, xmm15, xmm2, xmm6, xmm7, xmm0);
hash.c: ^
hash.c: ./groestl-intr-avx.h:249:8: note: expanded from macro 'Matrix_Transpose_A'
hash.c: i0 = _mm_shuffle_epi8(i0, t0);\
hash.c: ^
hash.c: ./groestl-intr-avx.h:356:3: error: always_inline function '_mm_shuffle_epi8' requires target feature 'ssse3', but would be inlined into function 'INIT' that is compiled without support for 'ssse3'
hash.c: ./groestl-intr-avx.h:250:8: note: expanded from macro 'Matrix_Transpose_A'
hash.c: i1 = _mm_shuffle_epi8(i1, t0);\
hash.c: ^
hash.c: ./groestl-intr-avx.h:356:3: error: always_inline function '_mm_shuffle_epi8' requires target feature 'ssse3', but would be inlined into function 'INIT' that is compiled without support for 'ssse3'
hash.c: ./groestl-intr-avx.h:251:8: note: expanded from macro 'Matrix_Transpose_A'
hash.c: i2 = _mm_shuffle_epi8(i2, t0);\
hash.c: ^
hash.c: ./groestl-intr-avx.h:356:3: error: always_inline function '_mm_shuffle_epi8' requires target feature 'ssse3', but would be inlined into function 'INIT' that is compiled without support for 'ssse3'
hash.c: ./groestl-intr-avx.h:252:8: note: expanded from macro 'Matrix_Transpose_A'
hash.c: i3 = _mm_shuffle_epi8(i3, t0);\
hash.c: ^
hash.c: hash.c:69:12: warning: comparison of array 'ctx->chaining' equal to a null pointer is always false [-Wtautological-pointer-compare]
hash.c: if (ctx->chaining == NULL || ctx->buffer == NULL)
hash.c: ~~~~~^~~~~~~~ ~~~~
hash.c: hash.c:69:37: warning: comparison of array 'ctx->buffer' equal to a null pointer is always false [-Wtautological-pointer-compare]
hash.c: if (ctx->chaining == NULL || ctx->buffer == NULL)
hash.c: ~~~~~^~~~~~ ~~~~
hash.c: ...

Number of similar (compiler,implementation) pairs: 1, namely:
CompilerImplementations
clang -mcpu=native -O3 -fomit-frame-pointer -fwrapv -Qunused-arguments -fPIC -fPIE T:avx-intr

Compiler output

Implementation: T:core2duo
Security model: timingleaks
Compiler: clang -march=native -O -fomit-frame-pointer -fwrapv -Qunused-arguments -fPIC -fPIE
try.c: /usr/bin/ld: libcrypto_hash_groestl256.a(hash.o): in function `Transform':
try.c: hash.c:(.text+0x...): undefined reference to `Q512ASM'
try.c: /usr/bin/ld: hash.c:(.text+0x...): undefined reference to `P512ASM'
try.c: /usr/bin/ld: libcrypto_hash_groestl256.a(hash.o): in function `OutputTransformation':
try.c: hash.c:(.text+0x...): undefined reference to `P512ASM'
try.c: clang: error: linker command failed with exit code 1 (use -v to see invocation)

Number of similar (compiler,implementation) pairs: 3, namely:
CompilerImplementations
clang -march=native -O -fomit-frame-pointer -fwrapv -Qunused-arguments -fPIC -fPIE T:core2duo T:opteron T:opteron-unrolled

Compiler output

Implementation: T:core2duo
Security model: timingleaks
Compiler: gcc -march=native -mtune=native -O2 -fomit-frame-pointer -fwrapv -fPIC -fPIE
try.c: /usr/bin/ld: libcrypto_hash_groestl256.a(hash.o): in function `Transform':
try.c: hash.c:(.text+0x...): undefined reference to `Q512ASM'
try.c: /usr/bin/ld: hash.c:(.text+0x...): undefined reference to `P512ASM'
try.c: /usr/bin/ld: libcrypto_hash_groestl256.a(hash.o): in function `OutputTransformation':
try.c: hash.c:(.text+0x...): undefined reference to `P512ASM'
try.c: collect2: error: ld returned 1 exit status

Number of similar (compiler,implementation) pairs: 9, namely:
CompilerImplementations
gcc -march=native -mtune=native -O2 -fomit-frame-pointer -fwrapv -fPIC -fPIE T:core2duo
gcc -march=native -mtune=native -O -fomit-frame-pointer -fwrapv -fPIC -fPIE T:core2duo
gcc -march=native -mtune=native -Os -fomit-frame-pointer -fwrapv -fPIC -fPIE T:core2duo
gcc -march=native -mtune=native -O2 -fomit-frame-pointer -fwrapv -fPIC -fPIE T:opteron
gcc -march=native -mtune=native -O -fomit-frame-pointer -fwrapv -fPIC -fPIE T:opteron
gcc -march=native -mtune=native -Os -fomit-frame-pointer -fwrapv -fPIC -fPIE T:opteron
gcc -march=native -mtune=native -O2 -fomit-frame-pointer -fwrapv -fPIC -fPIE T:opteron-unrolled
gcc -march=native -mtune=native -O -fomit-frame-pointer -fwrapv -fPIC -fPIE T:opteron-unrolled
gcc -march=native -mtune=native -Os -fomit-frame-pointer -fwrapv -fPIC -fPIE T:opteron-unrolled

Compiler output

Implementation: T:core2duo
Security model: timingleaks
Compiler: gcc -march=native -mtune=native -O3 -fomit-frame-pointer -fwrapv -fPIC -fPIE
try.c: /usr/bin/ld: libcrypto_hash_groestl256.a(hash.o): in function `Transform.constprop.0':
try.c: hash.c:(.text+0x...): undefined reference to `Q512ASM'
try.c: /usr/bin/ld: hash.c:(.text+0x...): undefined reference to `P512ASM'
try.c: /usr/bin/ld: libcrypto_hash_groestl256.a(hash.o): in function `Transform':
try.c: hash.c:(.text+0x...): undefined reference to `Q512ASM'
try.c: /usr/bin/ld: hash.c:(.text+0x...): undefined reference to `P512ASM'
try.c: /usr/bin/ld: libcrypto_hash_groestl256.a(hash.o): in function `OutputTransformation':
try.c: hash.c:(.text+0x...): undefined reference to `P512ASM'
try.c: /usr/bin/ld: libcrypto_hash_groestl256.a(hash.o): in function `Final':
try.c: hash.c:(.text+0x...): undefined reference to `P512ASM'
try.c: collect2: error: ld returned 1 exit status

Number of similar (compiler,implementation) pairs: 2, namely:
CompilerImplementations
gcc -march=native -mtune=native -O3 -fomit-frame-pointer -fwrapv -fPIC -fPIE T:core2duo T:opteron-unrolled

Compiler output

Implementation: T:opt64
Security model: timingleaks
Compiler: clang -march=native -O2 -fomit-frame-pointer -fwrapv -Qunused-arguments -fPIC -fPIE
try.c: /usr/bin/ld: libcrypto_hash_groestl256.a(hash.o): in function `Transform':
try.c: hash.c:(.text+0x...): undefined reference to `F512'
try.c: /usr/bin/ld: hash.c:(.text+0x...): undefined reference to `F1024'
try.c: /usr/bin/ld: libcrypto_hash_groestl256.a(hash.o): in function `Update':
try.c: hash.c:(.text+0x...): undefined reference to `F512'
try.c: /usr/bin/ld: hash.c:(.text+0x...): undefined reference to `F1024'
try.c: /usr/bin/ld: hash.c:(.text+0x...): undefined reference to `F512'
try.c: /usr/bin/ld: hash.c:(.text+0x...): undefined reference to `F1024'
try.c: /usr/bin/ld: libcrypto_hash_groestl256.a(hash.o): in function `Final':
try.c: hash.c:(.text+0x...): undefined reference to `F512'
try.c: /usr/bin/ld: hash.c:(.text+0x...): undefined reference to `F1024'
try.c: /usr/bin/ld: hash.c:(.text+0x...): undefined reference to `F512'
try.c: /usr/bin/ld: hash.c:(.text+0x...): undefined reference to `F1024'
try.c: clang: error: linker command failed with exit code 1 (use -v to see invocation)

Number of similar (compiler,implementation) pairs: 3, namely:
CompilerImplementations
clang -march=native -O2 -fomit-frame-pointer -fwrapv -Qunused-arguments -fPIC -fPIE T:opt64
clang -march=native -O3 -fomit-frame-pointer -fwrapv -Qunused-arguments -fPIC -fPIE T:opt64
clang -mcpu=native -O3 -fomit-frame-pointer -fwrapv -Qunused-arguments -fPIC -fPIE T:opt64

Compiler output

Implementation: T:opt64
Security model: timingleaks
Compiler: clang -march=native -O -fomit-frame-pointer -fwrapv -Qunused-arguments -fPIC -fPIE
try.c: /usr/bin/ld: libcrypto_hash_groestl256.a(hash.o): in function `Transform':
try.c: hash.c:(.text+0x...): undefined reference to `F512'
try.c: /usr/bin/ld: hash.c:(.text+0x...): undefined reference to `F1024'
try.c: clang: error: linker command failed with exit code 1 (use -v to see invocation)

Number of similar (compiler,implementation) pairs: 2, namely:
CompilerImplementations
clang -march=native -O -fomit-frame-pointer -fwrapv -Qunused-arguments -fPIC -fPIE T:opt64
clang -march=native -Os -fomit-frame-pointer -fwrapv -Qunused-arguments -fPIC -fPIE T:opt64

Compiler output

Implementation: T:opt64
Security model: timingleaks
Compiler: gcc -march=native -mtune=native -O2 -fomit-frame-pointer -fwrapv -fPIC -fPIE
try.c: /usr/bin/ld: libcrypto_hash_groestl256.a(hash.o): in function `Transform':
try.c: hash.c:(.text+0x...): undefined reference to `F1024'
try.c: /usr/bin/ld: hash.c:(.text+0x...): undefined reference to `F512'
try.c: collect2: error: ld returned 1 exit status

Number of similar (compiler,implementation) pairs: 2, namely:
CompilerImplementations
gcc -march=native -mtune=native -O2 -fomit-frame-pointer -fwrapv -fPIC -fPIE T:opt64
gcc -march=native -mtune=native -O -fomit-frame-pointer -fwrapv -fPIC -fPIE T:opt64

Compiler output

Implementation: T:opt64
Security model: timingleaks
Compiler: gcc -march=native -mtune=native -O3 -fomit-frame-pointer -fwrapv -fPIC -fPIE
try.c: /usr/bin/ld: libcrypto_hash_groestl256.a(hash.o): in function `Transform':
try.c: hash.c:(.text+0x...): undefined reference to `F1024'
try.c: /usr/bin/ld: hash.c:(.text+0x...): undefined reference to `F512'
try.c: /usr/bin/ld: libcrypto_hash_groestl256.a(hash.o): in function `Update':
try.c: hash.c:(.text+0x...): undefined reference to `F1024'
try.c: /usr/bin/ld: hash.c:(.text+0x...): undefined reference to `F512'
try.c: /usr/bin/ld: hash.c:(.text+0x...): undefined reference to `F1024'
try.c: /usr/bin/ld: hash.c:(.text+0x...): undefined reference to `F512'
try.c: /usr/bin/ld: libcrypto_hash_groestl256.a(hash.o): in function `Final':
try.c: hash.c:(.text+0x...): undefined reference to `F1024'
try.c: /usr/bin/ld: hash.c:(.text+0x...): undefined reference to `F1024'
try.c: /usr/bin/ld: hash.c:(.text+0x...): undefined reference to `F512'
try.c: /usr/bin/ld: hash.c:(.text+0x...): undefined reference to `F512'
try.c: collect2: error: ld returned 1 exit status

Number of similar (compiler,implementation) pairs: 1, namely:
CompilerImplementations
gcc -march=native -mtune=native -O3 -fomit-frame-pointer -fwrapv -fPIC -fPIE T:opt64

Compiler output

Implementation: T:opt64
Security model: timingleaks
Compiler: gcc -march=native -mtune=native -Os -fomit-frame-pointer -fwrapv -fPIC -fPIE
try.c: /usr/bin/ld: libcrypto_hash_groestl256.a(hash.o): in function `Transform':
try.c: hash.c:(.text+0x...): undefined reference to `F512'
try.c: /usr/bin/ld: hash.c:(.text+0x...): undefined reference to `F1024'
try.c: collect2: error: ld returned 1 exit status

Number of similar (compiler,implementation) pairs: 1, namely:
CompilerImplementations
gcc -march=native -mtune=native -Os -fomit-frame-pointer -fwrapv -fPIC -fPIE T:opt64

Compiler output

Implementation: T:opteron
Security model: timingleaks
Compiler: gcc -march=native -mtune=native -O3 -fomit-frame-pointer -fwrapv -fPIC -fPIE
try.c: /usr/bin/ld: libcrypto_hash_groestl256.a(hash.o): relocation R_X86_64_32S against symbol `T0' can not be used when making a PIE object; recompile with -fPIE
try.c: collect2: error: ld returned 1 exit status

Number of similar (compiler,implementation) pairs: 1, namely:
CompilerImplementations
gcc -march=native -mtune=native -O3 -fomit-frame-pointer -fwrapv -fPIC -fPIE T:opteron

Compiler output

Implementation: T:vperm
Security model: timingleaks
Compiler: clang -march=native -O2 -fomit-frame-pointer -fwrapv -Qunused-arguments -fPIC -fPIE
hash.c: hash.c:104:12: warning: comparison of array 'ctx->chaining' equal to a null pointer is always false [-Wtautological-pointer-compare]
hash.c: if (ctx->chaining == NULL || ctx->buffer == NULL)
hash.c: ~~~~~^~~~~~~~ ~~~~
hash.c: hash.c:104:37: warning: comparison of array 'ctx->buffer' equal to a null pointer is always false [-Wtautological-pointer-compare]
hash.c: if (ctx->chaining == NULL || ctx->buffer == NULL)
hash.c: ~~~~~^~~~~~ ~~~~
hash.c: In file included from hash.c:19:
hash.c: ./groestl-asm-vperm.h:705:3: error: invalid operand for instruction
hash.c: VPERM_Transform_RoundConst();
hash.c: ^
hash.c: ./groestl-asm-vperm.h:685:8: note: expanded from macro 'VPERM_Transform_RoundConst'
hash.c: asm ("movaps xmm0, [ROUND_CONST_Lx]");\
hash.c: ^
hash.c: <inline asm>:1:15: note: instantiated into assembly here
hash.c: movaps xmm0, [ROUND_CONST_Lx]
hash.c: ^~~~~~~~~~~~~~~~
hash.c: In file included from hash.c:19:
hash.c: ./groestl-asm-vperm.h:705:3: error: invalid operand for instruction
hash.c: VPERM_Transform_RoundConst();
hash.c: ^
hash.c: ./groestl-asm-vperm.h:686:3: note: expanded from macro 'VPERM_Transform_RoundConst'
hash.c: VPERM_Transform(0, 1, VPERM_IPT, 4, 5, 6, 7, 8, 9, 10);\
hash.c: ^
hash.c: ./groestl-asm-vperm.h:142:3: note: expanded from macro 'VPERM_Transform'
hash.c: VPERM_Transform_Set_Const(table, c0, c1, c2);\
hash.c: ...

Number of similar (compiler,implementation) pairs: 5, namely:
CompilerImplementations
clang -march=native -O2 -fomit-frame-pointer -fwrapv -Qunused-arguments -fPIC -fPIE T:vperm
clang -march=native -O3 -fomit-frame-pointer -fwrapv -Qunused-arguments -fPIC -fPIE T:vperm
clang -march=native -O -fomit-frame-pointer -fwrapv -Qunused-arguments -fPIC -fPIE T:vperm
clang -march=native -Os -fomit-frame-pointer -fwrapv -Qunused-arguments -fPIC -fPIE T:vperm
clang -mcpu=native -O3 -fomit-frame-pointer -fwrapv -Qunused-arguments -fPIC -fPIE T:vperm

Compiler output

Implementation: T:vperm
Security model: timingleaks
Compiler: gcc -march=native -mtune=native -O2 -fomit-frame-pointer -fwrapv -fPIC -fPIE
try.c: /usr/bin/ld: libcrypto_hash_groestl256.a(hash.o): relocation R_X86_64_32S against symbol `ROUND_CONST_Lx' can not be used when making a PIE object; recompile with -fPIE
try.c: collect2: error: ld returned 1 exit status

Number of similar (compiler,implementation) pairs: 4, namely:
CompilerImplementations
gcc -march=native -mtune=native -O2 -fomit-frame-pointer -fwrapv -fPIC -fPIE T:vperm
gcc -march=native -mtune=native -O3 -fomit-frame-pointer -fwrapv -fPIC -fPIE T:vperm
gcc -march=native -mtune=native -O -fomit-frame-pointer -fwrapv -fPIC -fPIE T:vperm
gcc -march=native -mtune=native -Os -fomit-frame-pointer -fwrapv -fPIC -fPIE T:vperm

Compiler output

Implementation: T:vperm-intr
Security model: timingleaks
Compiler: clang -mcpu=native -O3 -fomit-frame-pointer -fwrapv -Qunused-arguments -fPIC -fPIE
hash.c: In file included from hash.c:34:
hash.c: ./groestl-intr-vperm.h:653:3: error: always_inline function '_mm_shuffle_epi8' requires target feature 'ssse3', but would be inlined into function 'INIT' that is compiled without support for 'ssse3'
hash.c: VPERM_Transform_RoundConst();
hash.c: ^
hash.c: ./groestl-intr-vperm.h:636:3: note: expanded from macro 'VPERM_Transform_RoundConst'
hash.c: VPERM_Transform(xmm0, xmm1, VPERM_IPT, xmm4, xmm5, xmm6, xmm7, xmm8, xmm9, xmm10);\
hash.c: ^
hash.c: ./groestl-intr-vperm.h:119:3: note: expanded from macro 'VPERM_Transform'
hash.c: VPERM_Transform_No_Const(a0, a1, t0, t1, t2, t3, c0, c1, c2);\
hash.c: ^
hash.c: ./groestl-intr-vperm.h:88:8: note: expanded from macro 'VPERM_Transform_No_Const'
hash.c: t2 = _mm_shuffle_epi8(t2, a0);\
hash.c: ^
hash.c: ./groestl-intr-vperm.h:653:3: error: always_inline function '_mm_shuffle_epi8' requires target feature 'ssse3', but would be inlined into function 'INIT' that is compiled without support for 'ssse3'
hash.c: ./groestl-intr-vperm.h:636:3: note: expanded from macro 'VPERM_Transform_RoundConst'
hash.c: VPERM_Transform(xmm0, xmm1, VPERM_IPT, xmm4, xmm5, xmm6, xmm7, xmm8, xmm9, xmm10);\
hash.c: ^
hash.c: ./groestl-intr-vperm.h:119:3: note: expanded from macro 'VPERM_Transform'
hash.c: VPERM_Transform_No_Const(a0, a1, t0, t1, t2, t3, c0, c1, c2);\
hash.c: ^
hash.c: ./groestl-intr-vperm.h:89:8: note: expanded from macro 'VPERM_Transform_No_Const'
hash.c: t3 = _mm_shuffle_epi8(t3, a1);\
hash.c: ^
hash.c: ./groestl-intr-vperm.h:653:3: error: always_inline function '_mm_shuffle_epi8' requires target feature 'ssse3', but would be inlined into function 'INIT' that is compiled without support for 'ssse3'
hash.c: ./groestl-intr-vperm.h:636:3: note: expanded from macro 'VPERM_Transform_RoundConst'
hash.c: ...

Number of similar (compiler,implementation) pairs: 1, namely:
CompilerImplementations
clang -mcpu=native -O3 -fomit-frame-pointer -fwrapv -Qunused-arguments -fPIC -fPIE T:vperm-intr