Implementation notes: amd64, shoe, crypto_aead/morus640128v1

Computer: shoe
Microarchitecture: amd64; Broadwell+AES (306d4)
Architecture: amd64
CPU ID: GenuineIntel-000306d4-bfebfbff
SUPERCOP version: 20240425
Operation: crypto_aead
Primitive: morus640128v1
TimeObject sizeTest sizeImplementationCompilerBenchmark dateSUPERCOP version
72055621 0 022512 812 1048T:sse2clang_-march=native_-O2_-fomit-frame-pointer_-fwrapv_-Qunused-arguments_-fPIC_-fPIE2024042820240425
72179157 0 026144 812 1048T:sse2clang_-march=native_-O3_-fomit-frame-pointer_-fwrapv_-Qunused-arguments_-fPIC_-fPIE2024042820240425
737410930 0 027200 812 1016T:sse2clang_-mcpu=native_-O3_-fomit-frame-pointer_-fwrapv_-Qunused-arguments_-fPIC_-fPIE2024042820240425
92282908 0 016398 804 1016T:sse2clang_-march=native_-Os_-fomit-frame-pointer_-fwrapv_-Qunused-arguments_-fPIC_-fPIE2024042820240425
99675123 0 021288 780 1080T:sse2gcc_-march=native_-mtune=native_-O3_-fomit-frame-pointer_-fwrapv_-fPIC_-fPIE2024042820240425
100442319 0 016704 780 1080T:sse2gcc_-march=native_-mtune=native_-O2_-fomit-frame-pointer_-fwrapv_-fPIC_-fPIE2024042820240425
100642200 0 016336 780 1080T:sse2gcc_-march=native_-mtune=native_-O_-fomit-frame-pointer_-fwrapv_-fPIC_-fPIE2024042820240425
106171680 0 014603 756 1048T:sse2gcc_-march=native_-mtune=native_-Os_-fomit-frame-pointer_-fwrapv_-fPIC_-fPIE2024042820240425
113722288 0 016142 804 1016T:sse2clang_-march=native_-O_-fomit-frame-pointer_-fwrapv_-Qunused-arguments_-fPIC_-fPIE2024042820240425
2038612169 0 028352 780 1080T:refgcc_-march=native_-mtune=native_-O3_-fomit-frame-pointer_-fwrapv_-fPIC_-fPIE2024042820240425

Compiler output

Implementation: T:ref
Security model: timingleaks
Compiler: clang -march=native -O2 -fomit-frame-pointer -fwrapv -Qunused-arguments -fPIC -fPIE
try.c: /usr/bin/ld: libcrypto_aead_morus640128v1.a(encrypt.o): in function `morus_initialization':
try.c: encrypt.c:(.text+0x...): undefined reference to `morus_stateupdate'
try.c: /usr/bin/ld: encrypt.c:(.text+0x...): undefined reference to `morus_stateupdate'
try.c: /usr/bin/ld: encrypt.c:(.text+0x...): undefined reference to `morus_stateupdate'
try.c: /usr/bin/ld: encrypt.c:(.text+0x...): undefined reference to `morus_stateupdate'
try.c: /usr/bin/ld: encrypt.c:(.text+0x...): undefined reference to `morus_stateupdate'
try.c: /usr/bin/ld: libcrypto_aead_morus640128v1.a(encrypt.o):encrypt.c:(.text+0x...): more undefined references to `morus_stateupdate' follow
try.c: clang: error: linker command failed with exit code 1 (use -v to see invocation)

Number of similar (compiler,implementation) pairs: 3, namely:
CompilerImplementations
clang -march=native -O2 -fomit-frame-pointer -fwrapv -Qunused-arguments -fPIC -fPIE T:ref
clang -march=native -O3 -fomit-frame-pointer -fwrapv -Qunused-arguments -fPIC -fPIE T:ref
clang -mcpu=native -O3 -fomit-frame-pointer -fwrapv -Qunused-arguments -fPIC -fPIE T:ref

Compiler output

Implementation: T:ref
Security model: timingleaks
Compiler: clang -march=native -O -fomit-frame-pointer -fwrapv -Qunused-arguments -fPIC -fPIE
try.c: /usr/bin/ld: libcrypto_aead_morus640128v1.a(encrypt.o): in function `morus_initialization':
try.c: encrypt.c:(.text+0x...): undefined reference to `morus_stateupdate'
try.c: /usr/bin/ld: libcrypto_aead_morus640128v1.a(encrypt.o): in function `morus_tag_generation':
try.c: encrypt.c:(.text+0x...): undefined reference to `morus_stateupdate'
try.c: /usr/bin/ld: libcrypto_aead_morus640128v1.a(encrypt.o): in function `morus_tag_verification':
try.c: encrypt.c:(.text+0x...): undefined reference to `morus_stateupdate'
try.c: /usr/bin/ld: libcrypto_aead_morus640128v1.a(encrypt.o): in function `morus_enc_aut_partialblock':
try.c: encrypt.c:(.text+0x...): undefined reference to `morus_stateupdate'
try.c: /usr/bin/ld: libcrypto_aead_morus640128v1.a(encrypt.o): in function `morus_dec_aut_partialblock':
try.c: encrypt.c:(.text+0x...): undefined reference to `morus_stateupdate'
try.c: /usr/bin/ld: libcrypto_aead_morus640128v1.a(encrypt.o): in function `crypto_aead_morus640128v1_ref_timingleaks_encrypt':
try.c: encrypt.c:(.text+0x...): undefined reference to `morus_enc_aut_step'
try.c: /usr/bin/ld: encrypt.c:(.text+0x...): undefined reference to `morus_enc_aut_step'
try.c: /usr/bin/ld: libcrypto_aead_morus640128v1.a(encrypt.o): in function `crypto_aead_morus640128v1_ref_timingleaks_decrypt':
try.c: encrypt.c:(.text+0x...): undefined reference to `morus_enc_aut_step'
try.c: /usr/bin/ld: encrypt.c:(.text+0x...): undefined reference to `morus_dec_aut_step'
try.c: clang: error: linker command failed with exit code 1 (use -v to see invocation)

Number of similar (compiler,implementation) pairs: 1, namely:
CompilerImplementations
clang -march=native -O -fomit-frame-pointer -fwrapv -Qunused-arguments -fPIC -fPIE T:ref

Compiler output

Implementation: T:ref
Security model: timingleaks
Compiler: clang -march=native -Os -fomit-frame-pointer -fwrapv -Qunused-arguments -fPIC -fPIE
try.c: /usr/bin/ld: libcrypto_aead_morus640128v1.a(encrypt.o): in function `morus_initialization':
try.c: encrypt.c:(.text+0x...): undefined reference to `morus_stateupdate'
try.c: /usr/bin/ld: libcrypto_aead_morus640128v1.a(encrypt.o): in function `morus_tag_generation':
try.c: encrypt.c:(.text+0x...): undefined reference to `morus_stateupdate'
try.c: /usr/bin/ld: libcrypto_aead_morus640128v1.a(encrypt.o): in function `morus_tag_verification':
try.c: encrypt.c:(.text+0x...): undefined reference to `morus_stateupdate'
try.c: /usr/bin/ld: libcrypto_aead_morus640128v1.a(encrypt.o): in function `morus_enc_aut_partialblock':
try.c: encrypt.c:(.text+0x...): undefined reference to `morus_stateupdate'
try.c: /usr/bin/ld: libcrypto_aead_morus640128v1.a(encrypt.o): in function `morus_dec_aut_partialblock':
try.c: encrypt.c:(.text+0x...): undefined reference to `morus_stateupdate'
try.c: /usr/bin/ld: libcrypto_aead_morus640128v1.a(encrypt.o):encrypt.c:(.text+0x...): more undefined references to `morus_stateupdate' follow
try.c: clang: error: linker command failed with exit code 1 (use -v to see invocation)

Number of similar (compiler,implementation) pairs: 1, namely:
CompilerImplementations
clang -march=native -Os -fomit-frame-pointer -fwrapv -Qunused-arguments -fPIC -fPIE T:ref

Compiler output

Implementation: T:ref
Security model: timingleaks
Compiler: gcc -march=native -mtune=native -O2 -fomit-frame-pointer -fwrapv -fPIC -fPIE
try.c: /usr/bin/ld: libcrypto_aead_morus640128v1.a(encrypt.o): in function `morus_initialization':
try.c: encrypt.c:(.text+0x...): undefined reference to `morus_stateupdate'
try.c: /usr/bin/ld: libcrypto_aead_morus640128v1.a(encrypt.o): in function `morus_tag_generation':
try.c: encrypt.c:(.text+0x...): undefined reference to `morus_stateupdate'
try.c: /usr/bin/ld: libcrypto_aead_morus640128v1.a(encrypt.o): in function `morus_tag_verification':
try.c: encrypt.c:(.text+0x...): undefined reference to `morus_stateupdate'
try.c: /usr/bin/ld: libcrypto_aead_morus640128v1.a(encrypt.o): in function `morus_enc_aut_partialblock':
try.c: encrypt.c:(.text+0x...): undefined reference to `morus_stateupdate'
try.c: /usr/bin/ld: libcrypto_aead_morus640128v1.a(encrypt.o): in function `morus_dec_aut_partialblock':
try.c: encrypt.c:(.text+0x...): undefined reference to `morus_stateupdate'
try.c: /usr/bin/ld: libcrypto_aead_morus640128v1.a(encrypt.o):encrypt.c:(.text+0x...): more undefined references to `morus_stateupdate' follow
try.c: collect2: error: ld returned 1 exit status

Number of similar (compiler,implementation) pairs: 2, namely:
CompilerImplementations
gcc -march=native -mtune=native -O2 -fomit-frame-pointer -fwrapv -fPIC -fPIE T:ref
gcc -march=native -mtune=native -O -fomit-frame-pointer -fwrapv -fPIC -fPIE T:ref

Compiler output

Implementation: T:ref
Security model: timingleaks
Compiler: gcc -march=native -mtune=native -Os -fomit-frame-pointer -fwrapv -fPIC -fPIE
try.c: /usr/bin/ld: libcrypto_aead_morus640128v1.a(encrypt.o): in function `morus_initialization':
try.c: encrypt.c:(.text+0x...): undefined reference to `morus_stateupdate'
try.c: /usr/bin/ld: libcrypto_aead_morus640128v1.a(encrypt.o): in function `morus_tag_generation':
try.c: encrypt.c:(.text+0x...): undefined reference to `morus_stateupdate'
try.c: /usr/bin/ld: libcrypto_aead_morus640128v1.a(encrypt.o): in function `morus_tag_verification':
try.c: encrypt.c:(.text+0x...): undefined reference to `morus_stateupdate'
try.c: /usr/bin/ld: libcrypto_aead_morus640128v1.a(encrypt.o): in function `morus_enc_aut_partialblock':
try.c: encrypt.c:(.text+0x...): undefined reference to `morus_stateupdate'
try.c: /usr/bin/ld: libcrypto_aead_morus640128v1.a(encrypt.o): in function `morus_dec_aut_partialblock':
try.c: encrypt.c:(.text+0x...): undefined reference to `morus_stateupdate'
try.c: /usr/bin/ld: libcrypto_aead_morus640128v1.a(encrypt.o): in function `crypto_aead_morus640128v1_ref_timingleaks_encrypt':
try.c: encrypt.c:(.text+0x...): undefined reference to `morus_enc_aut_step'
try.c: /usr/bin/ld: encrypt.c:(.text+0x...): undefined reference to `morus_enc_aut_step'
try.c: /usr/bin/ld: libcrypto_aead_morus640128v1.a(encrypt.o): in function `crypto_aead_morus640128v1_ref_timingleaks_decrypt':
try.c: encrypt.c:(.text+0x...): undefined reference to `morus_enc_aut_step'
try.c: /usr/bin/ld: encrypt.c:(.text+0x...): undefined reference to `morus_dec_aut_step'
try.c: collect2: error: ld returned 1 exit status

Number of similar (compiler,implementation) pairs: 1, namely:
CompilerImplementations
gcc -march=native -mtune=native -Os -fomit-frame-pointer -fwrapv -fPIC -fPIE T:ref