Implementation notes: amd64, samba, crypto_hash/shake256

Computer: samba
Architecture: amd64
CPU ID: GenuineIntel-000506e3-bfebfbff
SUPERCOP version: 20210604
Operation: crypto_hash
Primitive: shake256
TimeObject sizeTest sizeImplementationCompilerBenchmark dateSUPERCOP version
1276098 0 022092 804 888usekcpclang_-mcpu=native_-O3_-fomit-frame-pointer_-fwrapv_-Qunused-arguments_-fPIC_-fPIE2021011420210114
1276998 0 019114 796 888usekcpclang_-march=native_-Os_-fomit-frame-pointer_-fwrapv_-Qunused-arguments_-fPIC_-fPIE2021011420210114
1277398 0 022748 804 920usekcpclang_-march=native_-O2_-fomit-frame-pointer_-fwrapv_-Qunused-arguments_-fPIC_-fPIE2021011420210114
12773100 0 020304 796 952usekcpgcc_-march=native_-mtune=native_-O2_-fomit-frame-pointer_-fwrapv_-fPIC_-fPIE2021011420210114
12773100 0 020200 796 952usekcpgcc_-march=native_-mtune=native_-O_-fomit-frame-pointer_-fwrapv_-fPIC_-fPIE2021011420210114
1277698 0 022796 804 920usekcpclang_-march=native_-O3_-fomit-frame-pointer_-fwrapv_-Qunused-arguments_-fPIC_-fPIE2021011420210114
12780100 0 023537 804 952usekcpgcc_-march=native_-mtune=native_-O3_-fomit-frame-pointer_-fwrapv_-fPIC_-fPIE2021011420210114
12783100 0 019292 780 920usekcpgcc_-march=native_-mtune=native_-Os_-fomit-frame-pointer_-fwrapv_-fPIC_-fPIE2021011420210114
1280098 0 022748 804 920usekcpclang_-march=native_-O_-fomit-frame-pointer_-fwrapv_-Qunused-arguments_-fPIC_-fPIE2021011420210114
14958865 0 036744 812 952oncore64bitsgcc_-march=native_-mtune=native_-O_-fomit-frame-pointer_-fwrapv_-fPIC_-fPIE2021011420210114
14978828 0 036824 812 952oncore64bitsgcc_-march=native_-mtune=native_-O2_-fomit-frame-pointer_-fwrapv_-fPIC_-fPIE2021011420210114
149891875 0 041016 812 952oncore64bitsgcc_-march=native_-mtune=native_-O3_-fomit-frame-pointer_-fwrapv_-fPIC_-fPIE2021011420210114
15017611 0 035688 804 920oncore64bitsgcc_-march=native_-mtune=native_-Os_-fomit-frame-pointer_-fwrapv_-fPIC_-fPIE2021011420210114
150361673 0 040095 812 920oncore64bitsclang_-march=native_-O3_-fomit-frame-pointer_-fwrapv_-Qunused-arguments_-fPIC_-fPIE2021011420210114
150451617 0 040031 812 920oncore64bitsclang_-march=native_-O2_-fomit-frame-pointer_-fwrapv_-Qunused-arguments_-fPIC_-fPIE2021011420210114
150481617 0 040031 812 920oncore64bitsclang_-march=native_-O_-fomit-frame-pointer_-fwrapv_-Qunused-arguments_-fPIC_-fPIE2021011420210114
150601288 0 038975 812 888oncore64bitsclang_-mcpu=native_-O3_-fomit-frame-pointer_-fwrapv_-Qunused-arguments_-fPIC_-fPIE2021011420210114
15077663 0 035429 804 888oncore64bitsclang_-march=native_-Os_-fomit-frame-pointer_-fwrapv_-Qunused-arguments_-fPIC_-fPIE2021011420210114
15959245 0 011859 860 920opensslgcc_-march=native_-mtune=native_-O_-fomit-frame-pointer_-fwrapv_-fPIC_-fPIE2021011420210114
15960201 0 014414 852 920opensslclang_-march=native_-O3_-fomit-frame-pointer_-fwrapv_-Qunused-arguments_-fPIC_-fPIE2021011420210114
15977203 0 010927 844 920opensslgcc_-march=native_-mtune=native_-Os_-fomit-frame-pointer_-fwrapv_-fPIC_-fPIE2021011420210114
15978245 0 011979 860 920opensslgcc_-march=native_-mtune=native_-O2_-fomit-frame-pointer_-fwrapv_-fPIC_-fPIE2021011420210114
15982201 0 013694 852 888opensslclang_-mcpu=native_-O3_-fomit-frame-pointer_-fwrapv_-Qunused-arguments_-fPIC_-fPIE2021011420210114
160004456 0 018857 804 952gil/singlefilegcc_-march=native_-mtune=native_-O3_-fomit-frame-pointer_-fwrapv_-fPIC_-fPIE2021011420210114
16086245 0 015228 868 920opensslgcc_-march=native_-mtune=native_-O3_-fomit-frame-pointer_-fwrapv_-fPIC_-fPIE2021011420210114
16094201 0 014398 852 920opensslclang_-march=native_-O2_-fomit-frame-pointer_-fwrapv_-Qunused-arguments_-fPIC_-fPIE2021011420210114
16173201 0 010748 844 888opensslclang_-march=native_-Os_-fomit-frame-pointer_-fwrapv_-Qunused-arguments_-fPIC_-fPIE2021011420210114
16187201 0 014398 852 920opensslclang_-march=native_-O_-fomit-frame-pointer_-fwrapv_-Qunused-arguments_-fPIC_-fPIE2021011420210114
169862678 0 016340 804 920gil/singlefileclang_-march=native_-O2_-fomit-frame-pointer_-fwrapv_-Qunused-arguments_-fPIC_-fPIE2021011420210114
170132678 0 016340 804 920gil/singlefileclang_-march=native_-O_-fomit-frame-pointer_-fwrapv_-Qunused-arguments_-fPIC_-fPIE2021011420210114
170342710 0 016372 804 920gil/singlefileclang_-march=native_-O3_-fomit-frame-pointer_-fwrapv_-Qunused-arguments_-fPIC_-fPIE2021011420210114
178933958 0 015136 796 952gil/singlefilegcc_-march=native_-mtune=native_-O2_-fomit-frame-pointer_-fwrapv_-fPIC_-fPIE2021011420210114
1805522611 0 037049 804 952gil/singlefile_unrolledgcc_-march=native_-mtune=native_-O3_-fomit-frame-pointer_-fwrapv_-fPIC_-fPIE2021011420210114
184933914 0 014984 796 952gil/singlefilegcc_-march=native_-mtune=native_-O_-fomit-frame-pointer_-fwrapv_-fPIC_-fPIE2021011420210114
192181842 0 011858 796 888gil/singlefileclang_-march=native_-Os_-fomit-frame-pointer_-fwrapv_-Qunused-arguments_-fPIC_-fPIE2021011420210114
196781979 0 012156 780 920gil/singlefilegcc_-march=native_-mtune=native_-Os_-fomit-frame-pointer_-fwrapv_-fPIC_-fPIE2021011420210114
2049822163 0 033352 796 952gil/singlefile_unrolledgcc_-march=native_-mtune=native_-O2_-fomit-frame-pointer_-fwrapv_-fPIC_-fPIE2021011420210114
2088221774 0 032848 796 952gil/singlefile_unrolledgcc_-march=native_-mtune=native_-O_-fomit-frame-pointer_-fwrapv_-fPIC_-fPIE2021011420210114
2159022367 0 032508 780 920gil/singlefile_unrolledgcc_-march=native_-mtune=native_-Os_-fomit-frame-pointer_-fwrapv_-fPIC_-fPIE2021011420210114
227192634 0 015572 804 888gil/singlefileclang_-mcpu=native_-O3_-fomit-frame-pointer_-fwrapv_-Qunused-arguments_-fPIC_-fPIE2021011420210114
2448426743 0 040404 804 920gil/singlefile_unrolledclang_-march=native_-O2_-fomit-frame-pointer_-fwrapv_-Qunused-arguments_-fPIC_-fPIE2021011420210114
2453926743 0 040404 804 920gil/singlefile_unrolledclang_-march=native_-O_-fomit-frame-pointer_-fwrapv_-Qunused-arguments_-fPIC_-fPIE2021011420210114
2493426775 0 040436 804 920gil/singlefile_unrolledclang_-march=native_-O3_-fomit-frame-pointer_-fwrapv_-Qunused-arguments_-fPIC_-fPIE2021011420210114
2592828033 0 040980 804 888gil/singlefile_unrolledclang_-mcpu=native_-O3_-fomit-frame-pointer_-fwrapv_-Qunused-arguments_-fPIC_-fPIE2021011420210114
2647925914 0 035922 796 888gil/singlefile_unrolledclang_-march=native_-Os_-fomit-frame-pointer_-fwrapv_-Qunused-arguments_-fPIC_-fPIE2021011420210114
314843286 0 028855 812 888oncore32bitsclang_-mcpu=native_-O3_-fomit-frame-pointer_-fwrapv_-Qunused-arguments_-fPIC_-fPIE2021011420210114
314883466 0 030671 820 952oncore32bitsgcc_-march=native_-mtune=native_-O3_-fomit-frame-pointer_-fwrapv_-fPIC_-fPIE2021011420210114
324532940 0 029311 812 920oncore32bitsclang_-march=native_-O_-fomit-frame-pointer_-fwrapv_-Qunused-arguments_-fPIC_-fPIE2021011420210114
324993404 0 029759 812 920oncore32bitsclang_-march=native_-O3_-fomit-frame-pointer_-fwrapv_-Qunused-arguments_-fPIC_-fPIE2021011420210114
328472940 0 029311 812 920oncore32bitsclang_-march=native_-O2_-fomit-frame-pointer_-fwrapv_-Qunused-arguments_-fPIC_-fPIE2021011420210114
346221285 0 024029 804 888oncore32bitsclang_-march=native_-Os_-fomit-frame-pointer_-fwrapv_-Qunused-arguments_-fPIC_-fPIE2021011420210114
348552048 0 026127 820 952oncore32bitsgcc_-march=native_-mtune=native_-O2_-fomit-frame-pointer_-fwrapv_-fPIC_-fPIE2021011420210114
352981913 0 025079 812 920oncore32bitsgcc_-march=native_-mtune=native_-Os_-fomit-frame-pointer_-fwrapv_-fPIC_-fPIE2021011420210114
353031985 0 025864 812 952oncore32bitsgcc_-march=native_-mtune=native_-O_-fomit-frame-pointer_-fwrapv_-fPIC_-fPIE2021011420210114

Compiler output

Implementation: kcp/optimized1600ARMv7A
Security model: constbranchindex
Compiler: clang -march=native -O2 -fomit-frame-pointer -fwrapv -Qunused-arguments -fPIC -fPIE
keccak.s: keccak.s:1:1: error: unexpected token at start of statement
keccak.s: @
keccak.s: ^
keccak.s: keccak.s:2:1: error: unexpected token at start of statement
keccak.s: @ Implementation by the Keccak, Keyak and Ketje Teams, namely, Guido Bertoni,
keccak.s: ^
keccak.s: keccak.s:3:1: error: unexpected token at start of statement
keccak.s: @ Joan Daemen, Michaƫl Peeters, Gilles Van Assche and Ronny Van Keer, hereby
keccak.s: keccak.s:4:1: error: unexpected token at start of statement
keccak.s: @ denoted as "the implementer".
keccak.s: ^
keccak.s: keccak.s:5:1: error: unexpected token at start of statement
keccak.s: @
keccak.s: ^
keccak.s: keccak.s:6:1: error: unexpected token at start of statement
keccak.s: @ For more information, feedback or questions, please refer to our websites:
keccak.s: ^
keccak.s: keccak.s:7:1: error: unexpected token at start of statement
keccak.s: @ http://keccak.noekeon.org/
keccak.s: ^
keccak.s: keccak.s:8:1: error: unexpected token at start of statement
keccak.s: @ http://keyak.noekeon.org/
keccak.s: ^
keccak.s: keccak.s:9:1: error: unexpected token at start of statement
keccak.s: @ http://ketje.noekeon.org/
keccak.s: ...

Number of similar (compiler,implementation) pairs: 5, namely:
CompilerImplementations
clang -march=native -O2 -fomit-frame-pointer -fwrapv -Qunused-arguments -fPIC -fPIE kcp/optimized1600ARMv7A
clang -march=native -O3 -fomit-frame-pointer -fwrapv -Qunused-arguments -fPIC -fPIE kcp/optimized1600ARMv7A
clang -march=native -O -fomit-frame-pointer -fwrapv -Qunused-arguments -fPIC -fPIE kcp/optimized1600ARMv7A
clang -march=native -Os -fomit-frame-pointer -fwrapv -Qunused-arguments -fPIC -fPIE kcp/optimized1600ARMv7A
clang -mcpu=native -O3 -fomit-frame-pointer -fwrapv -Qunused-arguments -fPIC -fPIE kcp/optimized1600ARMv7A

Compiler output

Implementation: kcp/optimized1600ARMv7A
Security model: constbranchindex
Compiler: gcc -march=native -mtune=native -O2 -fomit-frame-pointer -fwrapv -fPIC -fPIE
keccak.s: keccak.s: Assembler messages:
keccak.s: keccak.s:1: Error: junk at end of line, first unrecognized character is `@'
keccak.s: keccak.s:2: Error: junk at end of line, first unrecognized character is `@'
keccak.s: keccak.s:3: Error: junk at end of line, first unrecognized character is `@'
keccak.s: keccak.s:4: Error: junk at end of line, first unrecognized character is `@'
keccak.s: keccak.s:5: Error: junk at end of line, first unrecognized character is `@'
keccak.s: keccak.s:6: Error: junk at end of line, first unrecognized character is `@'
keccak.s: keccak.s:7: Error: junk at end of line, first unrecognized character is `@'
keccak.s: keccak.s:8: Error: junk at end of line, first unrecognized character is `@'
keccak.s: keccak.s:9: Error: junk at end of line, first unrecognized character is `@'
keccak.s: keccak.s:10: Error: junk at end of line, first unrecognized character is `@'
keccak.s: keccak.s:11: Error: junk at end of line, first unrecognized character is `@'
keccak.s: keccak.s:12: Error: junk at end of line, first unrecognized character is `@'
keccak.s: keccak.s:13: Error: junk at end of line, first unrecognized character is `@'
keccak.s: keccak.s:14: Error: junk at end of line, first unrecognized character is `@'
keccak.s: keccak.s:16: Error: junk at end of line, first unrecognized character is `@'
keccak.s: keccak.s:17: Error: junk at end of line, first unrecognized character is `@'
keccak.s: keccak.s:18: Error: junk at end of line, first unrecognized character is `@'
keccak.s: keccak.s:21: Error: unknown pseudo-op: `.syntax'
keccak.s: keccak.s:22: Error: unknown pseudo-op: `.fpu'
keccak.s: keccak.s:23: Error: unknown pseudo-op: `.arm'
keccak.s: keccak.s:26: Error: junk at end of line, first unrecognized character is `@'
keccak.s: keccak.s:27: Error: junk at end of line, first unrecognized character is `@'
keccak.s: keccak.s:29: Error: junk at end of line, first unrecognized character is `@'
keccak.s: keccak.s:56: Error: junk at end of line, first unrecognized character is `@'
keccak.s: ...

Number of similar (compiler,implementation) pairs: 4, namely:
CompilerImplementations
gcc -march=native -mtune=native -O2 -fomit-frame-pointer -fwrapv -fPIC -fPIE kcp/optimized1600ARMv7A
gcc -march=native -mtune=native -O3 -fomit-frame-pointer -fwrapv -fPIC -fPIE kcp/optimized1600ARMv7A
gcc -march=native -mtune=native -O -fomit-frame-pointer -fwrapv -fPIC -fPIE kcp/optimized1600ARMv7A
gcc -march=native -mtune=native -Os -fomit-frame-pointer -fwrapv -fPIC -fPIE kcp/optimized1600ARMv7A

Compiler output

Implementation: kcp/optimized1600ARMv8A
Security model: constbranchindex
Compiler: clang -march=native -O2 -fomit-frame-pointer -fwrapv -Qunused-arguments -fPIC -fPIE
keccak.s: keccak.s:258:20: error: unknown token in expression
keccak.s: movi v0.2d, #0
keccak.s: ^
keccak.s: keccak.s:259:20: error: unknown token in expression
keccak.s: movi v1.2d, #0
keccak.s: ^
keccak.s: keccak.s:260:20: error: unknown token in expression
keccak.s: movi v2.2d, #0
keccak.s: ^
keccak.s: keccak.s:261:20: error: unknown token in expression
keccak.s: movi v3.2d, #0
keccak.s: ^
keccak.s: keccak.s:262:13: error: Unexpected '{' in expression
keccak.s: st4 { v0.2d, v1.2d, v2.2d, v3.2d }, [x0], #64 // Clear 8lanes=64 bytes at a time
keccak.s: ^
keccak.s: keccak.s:263:13: error: Unexpected '{' in expression
keccak.s: st4 { v0.2d, v1.2d, v2.2d, v3.2d }, [x0], #64
keccak.s: ^
keccak.s: keccak.s:264:13: error: Unexpected '{' in expression
keccak.s: st4 { v0.2d, v1.2d, v2.2d, v3.2d }, [x0], #64
keccak.s: ^
keccak.s: keccak.s:265:13: error: Unexpected '{' in expression
keccak.s: st1 { v0.d }[0], [x0], #8
keccak.s: ^
keccak.s: keccak.s:276:20: error: expected ']' in brackets expression
keccak.s: ...

Number of similar (compiler,implementation) pairs: 5, namely:
CompilerImplementations
clang -march=native -O2 -fomit-frame-pointer -fwrapv -Qunused-arguments -fPIC -fPIE kcp/optimized1600ARMv8A
clang -march=native -O3 -fomit-frame-pointer -fwrapv -Qunused-arguments -fPIC -fPIE kcp/optimized1600ARMv8A
clang -march=native -O -fomit-frame-pointer -fwrapv -Qunused-arguments -fPIC -fPIE kcp/optimized1600ARMv8A
clang -march=native -Os -fomit-frame-pointer -fwrapv -Qunused-arguments -fPIC -fPIE kcp/optimized1600ARMv8A
clang -mcpu=native -O3 -fomit-frame-pointer -fwrapv -Qunused-arguments -fPIC -fPIE kcp/optimized1600ARMv8A

Compiler output

Implementation: kcp/optimized1600ARMv8A
Security model: constbranchindex
Compiler: gcc -march=native -mtune=native -O2 -fomit-frame-pointer -fwrapv -fPIC -fPIE
keccak.s: keccak.s: Assembler messages:
keccak.s: keccak.s:258: Error: no such instruction: `movi v0.2d,'
keccak.s: keccak.s:259: Error: no such instruction: `movi v1.2d,'
keccak.s: keccak.s:260: Error: no such instruction: `movi v2.2d,'
keccak.s: keccak.s:261: Error: no such instruction: `movi v3.2d,'
keccak.s: keccak.s:262: Error: no such instruction: `st4 { v0.2d,v1.2d,v2.2d,v3.2d },[x0],'
keccak.s: keccak.s:263: Error: no such instruction: `st4 { v0.2d,v1.2d,v2.2d,v3.2d },[x0],'
keccak.s: keccak.s:264: Error: no such instruction: `st4 { v0.2d,v1.2d,v2.2d,v3.2d },[x0],'
keccak.s: keccak.s:265: Error: no such instruction: `st1 { v0.d }[0],[x0],'
keccak.s: keccak.s:276: Error: no such instruction: `ldrb w3,[x0,x2]'
keccak.s: keccak.s:277: Error: no such instruction: `eor w3,w3,w1'
keccak.s: keccak.s:278: Error: invalid char '[' beginning operand 2 `[x0'
keccak.s: keccak.s:289: Error: too many memory references for `add'
keccak.s: keccak.s:290: Error: too many memory references for `sub'
keccak.s: keccak.s:291: Error: no such instruction: `b.cc KeccakP1600_AddBytes_Exit//length 0,move along'
keccak.s: keccak.s:293: Error: too many memory references for `sub'
keccak.s: keccak.s:294: Error: no such instruction: `b.cc KeccakP1600_AddBytes_Lanes//Jump if length is negative'
keccak.s: keccak.s:295: Error: no such instruction: `ld4 { v0.2d,v1.2d,v2.2d,v3.2d },[x0]'
keccak.s: keccak.s:296: Error: no such instruction: `ld4 { v4.2d,v5.2d,v6.2d,v7.2d },[x1],'
keccak.s: keccak.s:297: Error: no such instruction: `eor v0.16b,v0.16b,v4.16b'
keccak.s: keccak.s:298: Error: no such instruction: `eor v1.16b,v1.16b,v5.16b'
keccak.s: keccak.s:299: Error: no such instruction: `eor v2.16b,v2.16b,v6.16b'
keccak.s: keccak.s:300: Error: no such instruction: `eor v3.16b,v3.16b,v7.16b'
keccak.s: keccak.s:301: Error: no such instruction: `st4 { v0.2d,v1.2d,v2.2d,v3.2d },[x0],'
keccak.s: keccak.s:302: Error: no such instruction: `b KeccakP1600_AddBytes_8LanesLoop'
keccak.s: ...

Number of similar (compiler,implementation) pairs: 4, namely:
CompilerImplementations
gcc -march=native -mtune=native -O2 -fomit-frame-pointer -fwrapv -fPIC -fPIE kcp/optimized1600ARMv8A
gcc -march=native -mtune=native -O3 -fomit-frame-pointer -fwrapv -fPIC -fPIE kcp/optimized1600ARMv8A
gcc -march=native -mtune=native -O -fomit-frame-pointer -fwrapv -fPIC -fPIE kcp/optimized1600ARMv8A
gcc -march=native -mtune=native -Os -fomit-frame-pointer -fwrapv -fPIC -fPIE kcp/optimized1600ARMv8A

Compiler output

Implementation: kcp/optimized1600AVX2
Security model: constbranchindex
Compiler: clang -march=native -O2 -fomit-frame-pointer -fwrapv -Qunused-arguments -fPIC -fPIE
try.c: crypto_hash_shake256.a(SHAKE256.o): In function `crypto_hash_shake256_kcp_optimized1600AVX2_constbranchindex':
try.c: SHAKE256.c:(.text+0x...): undefined reference to `KeccakWidth1600_Sponge'
try.c: clang: error: linker command failed with exit code 1 (use -v to see invocation)

Number of similar (compiler,implementation) pairs: 4, namely:
CompilerImplementations
clang -march=native -O2 -fomit-frame-pointer -fwrapv -Qunused-arguments -fPIC -fPIE kcp/optimized1600AVX2
clang -march=native -O3 -fomit-frame-pointer -fwrapv -Qunused-arguments -fPIC -fPIE kcp/optimized1600AVX2
clang -march=native -O -fomit-frame-pointer -fwrapv -Qunused-arguments -fPIC -fPIE kcp/optimized1600AVX2
clang -march=native -Os -fomit-frame-pointer -fwrapv -Qunused-arguments -fPIC -fPIE kcp/optimized1600AVX2

Compiler output

Implementation: kcp/optimized1600AVX2
Security model: constbranchindex
Compiler: clang -mcpu=native -O3 -fomit-frame-pointer -fwrapv -Qunused-arguments -fPIC -fPIE
KeccakP-1600-AVX2.c: KeccakP-1600-AVX2.c:506:13: error: always_inline function '_mm256_loadu_si256' requires target feature 'sse4.2', but would be inlined into function 'crypto_hash_shake256_kcp_optimized1600AVX2_constbranchindex_KeccakP1600_AddBytes' that is compiled without support for 'sse4.2'
KeccakP-1600-AVX2.c: s->a0 = LOAD(t + 0*5);
KeccakP-1600-AVX2.c: ^
KeccakP-1600-AVX2.c: KeccakP-1600-AVX2.c:62:41: note: expanded from macro 'LOAD'
KeccakP-1600-AVX2.c: #define LOAD(p) _mm256_loadu_si256((const __m256i *)(p))
KeccakP-1600-AVX2.c: ^
KeccakP-1600-AVX2.c: KeccakP-1600-AVX2.c:507:13: error: always_inline function '_mm256_loadu_si256' requires target feature 'sse4.2', but would be inlined into function 'crypto_hash_shake256_kcp_optimized1600AVX2_constbranchindex_KeccakP1600_AddBytes' that is compiled without support for 'sse4.2'
KeccakP-1600-AVX2.c: s->a1 = LOAD(t + 1*5);
KeccakP-1600-AVX2.c: ^
KeccakP-1600-AVX2.c: KeccakP-1600-AVX2.c:62:41: note: expanded from macro 'LOAD'
KeccakP-1600-AVX2.c: #define LOAD(p) _mm256_loadu_si256((const __m256i *)(p))
KeccakP-1600-AVX2.c: ^
KeccakP-1600-AVX2.c: KeccakP-1600-AVX2.c:508:13: error: always_inline function '_mm256_loadu_si256' requires target feature 'sse4.2', but would be inlined into function 'crypto_hash_shake256_kcp_optimized1600AVX2_constbranchindex_KeccakP1600_AddBytes' that is compiled without support for 'sse4.2'
KeccakP-1600-AVX2.c: s->a2 = LOAD(t + 2*5);
KeccakP-1600-AVX2.c: ^
KeccakP-1600-AVX2.c: KeccakP-1600-AVX2.c:62:41: note: expanded from macro 'LOAD'
KeccakP-1600-AVX2.c: #define LOAD(p) _mm256_loadu_si256((const __m256i *)(p))
KeccakP-1600-AVX2.c: ^
KeccakP-1600-AVX2.c: KeccakP-1600-AVX2.c:509:13: error: always_inline function '_mm256_loadu_si256' requires target feature 'sse4.2', but would be inlined into function 'crypto_hash_shake256_kcp_optimized1600AVX2_constbranchindex_KeccakP1600_AddBytes' that is compiled without support for 'sse4.2'
KeccakP-1600-AVX2.c: s->a3 = LOAD(t + 3*5);
KeccakP-1600-AVX2.c: ^
KeccakP-1600-AVX2.c: KeccakP-1600-AVX2.c:62:41: note: expanded from macro 'LOAD'
KeccakP-1600-AVX2.c: #define LOAD(p) _mm256_loadu_si256((const __m256i *)(p))
KeccakP-1600-AVX2.c: ^
KeccakP-1600-AVX2.c: KeccakP-1600-AVX2.c:510:13: error: always_inline function '_mm256_loadu_si256' requires target feature 'sse4.2', but would be inlined into function 'crypto_hash_shake256_kcp_optimized1600AVX2_constbranchindex_KeccakP1600_AddBytes' that is compiled without support for 'sse4.2'
KeccakP-1600-AVX2.c: ...

Number of similar (compiler,implementation) pairs: 1, namely:
CompilerImplementations
clang -mcpu=native -O3 -fomit-frame-pointer -fwrapv -Qunused-arguments -fPIC -fPIE kcp/optimized1600AVX2

Compiler output

Implementation: kcp/optimized1600AVX2
Security model: constbranchindex
Compiler: gcc -march=native -mtune=native -O2 -fomit-frame-pointer -fwrapv -fPIC -fPIE
try.c: crypto_hash_shake256.a(SHAKE256.o): In function `crypto_hash_shake256_kcp_optimized1600AVX2_constbranchindex':
try.c: SHAKE256.c:(.text+0x...): undefined reference to `KeccakWidth1600_Sponge'
try.c: collect2: error: ld returned 1 exit status

Number of similar (compiler,implementation) pairs: 4, namely:
CompilerImplementations
gcc -march=native -mtune=native -O2 -fomit-frame-pointer -fwrapv -fPIC -fPIE kcp/optimized1600AVX2
gcc -march=native -mtune=native -O3 -fomit-frame-pointer -fwrapv -fPIC -fPIE kcp/optimized1600AVX2
gcc -march=native -mtune=native -O -fomit-frame-pointer -fwrapv -fPIC -fPIE kcp/optimized1600AVX2
gcc -march=native -mtune=native -Os -fomit-frame-pointer -fwrapv -fPIC -fPIE kcp/optimized1600AVX2

Compiler output

Implementation: kcp/optimized1600AVX512
Security model: constbranchindex
Compiler: clang -march=native -O2 -fomit-frame-pointer -fwrapv -Qunused-arguments -fPIC -fPIE
KeccakP-1600-AVX512.c: KeccakP-1600-AVX512.c:238:9: error: always_inline function '_mm512_mask_storeu_epi64' requires target feature 'avx512f', but would be inlined into function 'KeccakP1600_AddBytes' that is compiled without support for 'avx512f'
KeccakP-1600-AVX512.c: STORE_8Lanes( stateAsLanes, XOR(LOAD_8Lanes(stateAsLanes), LOAD_8Lanes((const UINT64*)data)));
KeccakP-1600-AVX512.c: ^
KeccakP-1600-AVX512.c: KeccakP-1600-AVX512.c:219:37: note: expanded from macro 'STORE_8Lanes'
KeccakP-1600-AVX512.c: #define STORE_8Lanes(a,v) STORE_Lanes(a,0xFF,v)
KeccakP-1600-AVX512.c: ^
KeccakP-1600-AVX512.c: KeccakP-1600-AVX512.c:216:37: note: expanded from macro 'STORE_Lanes'
KeccakP-1600-AVX512.c: #define STORE_Lanes(a,m,v) _mm512_mask_storeu_epi64(a,m,v)
KeccakP-1600-AVX512.c: ^
KeccakP-1600-AVX512.c: KeccakP-1600-AVX512.c:238:37: error: always_inline function '_mm512_xor_si512' requires target feature 'avx512f', but would be inlined into function 'KeccakP1600_AddBytes' that is compiled without support for 'avx512f'
KeccakP-1600-AVX512.c: STORE_8Lanes( stateAsLanes, XOR(LOAD_8Lanes(stateAsLanes), LOAD_8Lanes((const UINT64*)data)));
KeccakP-1600-AVX512.c: ^
KeccakP-1600-AVX512.c: KeccakP-1600-AVX512.c:206:37: note: expanded from macro 'XOR'
KeccakP-1600-AVX512.c: #define XOR(a,b) _mm512_xor_si512(a,b)
KeccakP-1600-AVX512.c: ^
KeccakP-1600-AVX512.c: KeccakP-1600-AVX512.c:238:41: error: always_inline function '_mm512_maskz_loadu_epi64' requires target feature 'avx512f', but would be inlined into function 'KeccakP1600_AddBytes' that is compiled without support for 'avx512f'
KeccakP-1600-AVX512.c: STORE_8Lanes( stateAsLanes, XOR(LOAD_8Lanes(stateAsLanes), LOAD_8Lanes((const UINT64*)data)));
KeccakP-1600-AVX512.c: ^
KeccakP-1600-AVX512.c: KeccakP-1600-AVX512.c:215:37: note: expanded from macro 'LOAD_8Lanes'
KeccakP-1600-AVX512.c: #define LOAD_8Lanes(a) LOAD_Lanes(0xFF,a)
KeccakP-1600-AVX512.c: ^
KeccakP-1600-AVX512.c: KeccakP-1600-AVX512.c:212:37: note: expanded from macro 'LOAD_Lanes'
KeccakP-1600-AVX512.c: #define LOAD_Lanes(m,a) _mm512_maskz_loadu_epi64(m,a)
KeccakP-1600-AVX512.c: ^
KeccakP-1600-AVX512.c: KeccakP-1600-AVX512.c:238:68: error: always_inline function '_mm512_maskz_loadu_epi64' requires target feature 'avx512f', but would be inlined into function 'KeccakP1600_AddBytes' that is compiled without support for 'avx512f'
KeccakP-1600-AVX512.c: ...

Number of similar (compiler,implementation) pairs: 4, namely:
CompilerImplementations
clang -march=native -O2 -fomit-frame-pointer -fwrapv -Qunused-arguments -fPIC -fPIE kcp/optimized1600AVX512
clang -march=native -O3 -fomit-frame-pointer -fwrapv -Qunused-arguments -fPIC -fPIE kcp/optimized1600AVX512
clang -march=native -O -fomit-frame-pointer -fwrapv -Qunused-arguments -fPIC -fPIE kcp/optimized1600AVX512
clang -march=native -Os -fomit-frame-pointer -fwrapv -Qunused-arguments -fPIC -fPIE kcp/optimized1600AVX512

Compiler output

Implementation: kcp/optimized1600AVX512
Security model: constbranchindex
Compiler: clang -mcpu=native -O3 -fomit-frame-pointer -fwrapv -Qunused-arguments -fPIC -fPIE
KeccakP-1600-AVX512.c: KeccakP-1600-AVX512.c:238:9: error: always_inline function '_mm512_mask_storeu_epi64' requires target feature 'avx2', but would be inlined into function 'KeccakP1600_AddBytes' that is compiled without support for 'avx2'
KeccakP-1600-AVX512.c: STORE_8Lanes( stateAsLanes, XOR(LOAD_8Lanes(stateAsLanes), LOAD_8Lanes((const UINT64*)data)));
KeccakP-1600-AVX512.c: ^
KeccakP-1600-AVX512.c: KeccakP-1600-AVX512.c:219:37: note: expanded from macro 'STORE_8Lanes'
KeccakP-1600-AVX512.c: #define STORE_8Lanes(a,v) STORE_Lanes(a,0xFF,v)
KeccakP-1600-AVX512.c: ^
KeccakP-1600-AVX512.c: KeccakP-1600-AVX512.c:216:37: note: expanded from macro 'STORE_Lanes'
KeccakP-1600-AVX512.c: #define STORE_Lanes(a,m,v) _mm512_mask_storeu_epi64(a,m,v)
KeccakP-1600-AVX512.c: ^
KeccakP-1600-AVX512.c: KeccakP-1600-AVX512.c:238:37: error: always_inline function '_mm512_xor_si512' requires target feature 'avx2', but would be inlined into function 'KeccakP1600_AddBytes' that is compiled without support for 'avx2'
KeccakP-1600-AVX512.c: STORE_8Lanes( stateAsLanes, XOR(LOAD_8Lanes(stateAsLanes), LOAD_8Lanes((const UINT64*)data)));
KeccakP-1600-AVX512.c: ^
KeccakP-1600-AVX512.c: KeccakP-1600-AVX512.c:206:37: note: expanded from macro 'XOR'
KeccakP-1600-AVX512.c: #define XOR(a,b) _mm512_xor_si512(a,b)
KeccakP-1600-AVX512.c: ^
KeccakP-1600-AVX512.c: KeccakP-1600-AVX512.c:238:41: error: always_inline function '_mm512_maskz_loadu_epi64' requires target feature 'avx2', but would be inlined into function 'KeccakP1600_AddBytes' that is compiled without support for 'avx2'
KeccakP-1600-AVX512.c: STORE_8Lanes( stateAsLanes, XOR(LOAD_8Lanes(stateAsLanes), LOAD_8Lanes((const UINT64*)data)));
KeccakP-1600-AVX512.c: ^
KeccakP-1600-AVX512.c: KeccakP-1600-AVX512.c:215:37: note: expanded from macro 'LOAD_8Lanes'
KeccakP-1600-AVX512.c: #define LOAD_8Lanes(a) LOAD_Lanes(0xFF,a)
KeccakP-1600-AVX512.c: ^
KeccakP-1600-AVX512.c: KeccakP-1600-AVX512.c:212:37: note: expanded from macro 'LOAD_Lanes'
KeccakP-1600-AVX512.c: #define LOAD_Lanes(m,a) _mm512_maskz_loadu_epi64(m,a)
KeccakP-1600-AVX512.c: ^
KeccakP-1600-AVX512.c: KeccakP-1600-AVX512.c:238:68: error: always_inline function '_mm512_maskz_loadu_epi64' requires target feature 'avx2', but would be inlined into function 'KeccakP1600_AddBytes' that is compiled without support for 'avx2'
KeccakP-1600-AVX512.c: ...

Number of similar (compiler,implementation) pairs: 1, namely:
CompilerImplementations
clang -mcpu=native -O3 -fomit-frame-pointer -fwrapv -Qunused-arguments -fPIC -fPIE kcp/optimized1600AVX512

Compiler output

Implementation: kcp/optimized1600AVX512
Security model: constbranchindex
Compiler: gcc -march=native -mtune=native -O2 -fomit-frame-pointer -fwrapv -fPIC -fPIE
KeccakP-1600-AVX512.c: KeccakP-1600-AVX512.c: In function 'KeccakP1600_AddBytes':
KeccakP-1600-AVX512.c: KeccakP-1600-AVX512.c:216:37: warning: AVX512F vector return without AVX512F enabled changes the ABI [-Wpsabi]
KeccakP-1600-AVX512.c: #define STORE_Lanes(a,m,v) _mm512_mask_storeu_epi64(a,m,v)
KeccakP-1600-AVX512.c: ^~~~~~~~~~~~~~~~~~~~~~~~~~~~~~~
KeccakP-1600-AVX512.c: KeccakP-1600-AVX512.c:219:37: note: in expansion of macro 'STORE_Lanes'
KeccakP-1600-AVX512.c: #define STORE_8Lanes(a,v) STORE_Lanes(a,0xFF,v)
KeccakP-1600-AVX512.c: ^~~~~~~~~~~
KeccakP-1600-AVX512.c: KeccakP-1600-AVX512.c:238:9: note: in expansion of macro 'STORE_8Lanes'
KeccakP-1600-AVX512.c: STORE_8Lanes( stateAsLanes, XOR(LOAD_8Lanes(stateAsLanes), LOAD_8Lanes((const UINT64*)data)));
KeccakP-1600-AVX512.c: ^~~~~~~~~~~~
KeccakP-1600-AVX512.c: In file included from /usr/lib/gcc/x86_64-linux-gnu/7/include/immintrin.h:45:0,
KeccakP-1600-AVX512.c: from KeccakP-1600-AVX512.c:26:
KeccakP-1600-AVX512.c: /usr/lib/gcc/x86_64-linux-gnu/7/include/avx512fintrin.h:5797:1: error: inlining failed in call to always_inline '_mm512_mask_storeu_epi64': target specific option mismatch
KeccakP-1600-AVX512.c: _mm512_mask_storeu_epi64 (void *__P, __mmask8 __U, __m512i __A)
KeccakP-1600-AVX512.c: ^~~~~~~~~~~~~~~~~~~~~~~~
KeccakP-1600-AVX512.c: KeccakP-1600-AVX512.c:216:37: note: called from here
KeccakP-1600-AVX512.c: #define STORE_Lanes(a,m,v) _mm512_mask_storeu_epi64(a,m,v)
KeccakP-1600-AVX512.c: ^~~~~~~~~~~~~~~~~~~~~~~~~~~~~~~
KeccakP-1600-AVX512.c: KeccakP-1600-AVX512.c:219:37: note: in expansion of macro 'STORE_Lanes'
KeccakP-1600-AVX512.c: #define STORE_8Lanes(a,v) STORE_Lanes(a,0xFF,v)
KeccakP-1600-AVX512.c: ^~~~~~~~~~~
KeccakP-1600-AVX512.c: KeccakP-1600-AVX512.c:238:9: note: in expansion of macro 'STORE_8Lanes'
KeccakP-1600-AVX512.c: STORE_8Lanes( stateAsLanes, XOR(LOAD_8Lanes(stateAsLanes), LOAD_8Lanes((const UINT64*)data)));
KeccakP-1600-AVX512.c: ^~~~~~~~~~~~
KeccakP-1600-AVX512.c: In file included from /usr/lib/gcc/x86_64-linux-gnu/7/include/immintrin.h:45:0,
KeccakP-1600-AVX512.c: ...

Number of similar (compiler,implementation) pairs: 4, namely:
CompilerImplementations
gcc -march=native -mtune=native -O2 -fomit-frame-pointer -fwrapv -fPIC -fPIE kcp/optimized1600AVX512
gcc -march=native -mtune=native -O3 -fomit-frame-pointer -fwrapv -fPIC -fPIE kcp/optimized1600AVX512
gcc -march=native -mtune=native -O -fomit-frame-pointer -fwrapv -fPIC -fPIE kcp/optimized1600AVX512
gcc -march=native -mtune=native -Os -fomit-frame-pointer -fwrapv -fPIC -fPIE kcp/optimized1600AVX512