Implementation notes: amd64, samba, crypto_hash/blake3

Computer: samba
Microarchitecture: amd64; Skylake (506e3)
Architecture: amd64
CPU ID: GenuineIntel-000506e3-bfebfbff
SUPERCOP version: 20221122
Operation: crypto_hash
Primitive: blake3
TimeObject sizeTest sizeImplementationCompilerBenchmark dateSUPERCOP version
517213059 0 024262 804 952T:sse41gcc_-march=native_-mtune=native_-O2_-fomit-frame-pointer_-fwrapv_-fPIC_-fPIE2022100620221005
517724015 0 036693 804 888T:avx2clang_-mcpu=native_-O3_-fomit-frame-pointer_-fwrapv_-Qunused-arguments_-fPIC_-fPIE2022100620221005
518214131 0 026773 804 888T:sse41clang_-mcpu=native_-O3_-fomit-frame-pointer_-fwrapv_-Qunused-arguments_-fPIC_-fPIE2022100620221005
518722959 0 034182 804 952T:avx2gcc_-march=native_-mtune=native_-O2_-fomit-frame-pointer_-fwrapv_-fPIC_-fPIE2022100620221005
519523965 0 037959 812 952T:avx2gcc_-march=native_-mtune=native_-O3_-fomit-frame-pointer_-fwrapv_-fPIC_-fPIE2022100620221005
519523094 0 034262 804 952T:avx2gcc_-march=native_-mtune=native_-O_-fomit-frame-pointer_-fwrapv_-fPIC_-fPIE2022100620221005
519512552 0 022858 788 920T:sse41gcc_-march=native_-mtune=native_-Os_-fomit-frame-pointer_-fwrapv_-fPIC_-fPIE2022100620221005
519913206 0 024342 804 952T:sse41gcc_-march=native_-mtune=native_-O_-fomit-frame-pointer_-fwrapv_-fPIC_-fPIE2022100620221005
521113953 0 027911 812 952T:sse41gcc_-march=native_-mtune=native_-O3_-fomit-frame-pointer_-fwrapv_-fPIC_-fPIE2022100620221005
521622436 0 032778 788 920T:avx2gcc_-march=native_-mtune=native_-Os_-fomit-frame-pointer_-fwrapv_-fPIC_-fPIE2022100620221005
522314684 0 027989 804 920T:sse41clang_-march=native_-O3_-fomit-frame-pointer_-fwrapv_-Qunused-arguments_-fPIC_-fPIE2022100620221005
522422451 0 032695 796 888T:avx2clang_-march=native_-Os_-fomit-frame-pointer_-fwrapv_-Qunused-arguments_-fPIC_-fPIE2022100620221005
523224552 0 037973 804 920T:avx2clang_-march=native_-O2_-fomit-frame-pointer_-fwrapv_-Qunused-arguments_-fPIC_-fPIE2022100620221005
523212567 0 022775 796 888T:sse41clang_-march=native_-Os_-fomit-frame-pointer_-fwrapv_-Qunused-arguments_-fPIC_-fPIE2022100620221005
524024552 0 037973 804 920T:avx2clang_-march=native_-O_-fomit-frame-pointer_-fwrapv_-Qunused-arguments_-fPIC_-fPIE2022100620221005
524014668 0 028053 804 920T:sse41clang_-march=native_-O2_-fomit-frame-pointer_-fwrapv_-Qunused-arguments_-fPIC_-fPIE2022100620221005
524124568 0 037909 804 920T:avx2clang_-march=native_-O3_-fomit-frame-pointer_-fwrapv_-Qunused-arguments_-fPIC_-fPIE2022100620221005
524114668 0 028053 804 920T:sse41clang_-march=native_-O_-fomit-frame-pointer_-fwrapv_-Qunused-arguments_-fPIC_-fPIE2022100620221005
739211185 0 025559 812 952T:portablegcc_-march=native_-mtune=native_-O3_-fomit-frame-pointer_-fwrapv_-fPIC_-fPIE2022100620221005
740310299 0 021934 804 952T:portablegcc_-march=native_-mtune=native_-O2_-fomit-frame-pointer_-fwrapv_-fPIC_-fPIE2022100620221005
76559641 0 020338 788 920T:portablegcc_-march=native_-mtune=native_-Os_-fomit-frame-pointer_-fwrapv_-fPIC_-fPIE2022100620221005
766810033 0 022629 804 888T:portableclang_-mcpu=native_-O3_-fomit-frame-pointer_-fwrapv_-Qunused-arguments_-fPIC_-fPIE2022100620221005
77859990 0 020151 796 888T:portableclang_-march=native_-Os_-fomit-frame-pointer_-fwrapv_-Qunused-arguments_-fPIC_-fPIE2022100620221005
779311302 0 024661 804 920T:portableclang_-march=native_-O2_-fomit-frame-pointer_-fwrapv_-Qunused-arguments_-fPIC_-fPIE2022100620221005
779911302 0 024661 804 920T:portableclang_-march=native_-O_-fomit-frame-pointer_-fwrapv_-Qunused-arguments_-fPIC_-fPIE2022100620221005
780611302 0 024565 804 920T:portableclang_-march=native_-O3_-fomit-frame-pointer_-fwrapv_-Qunused-arguments_-fPIC_-fPIE2022100620221005
855511959 0 023526 804 952T:portablegcc_-march=native_-mtune=native_-O_-fomit-frame-pointer_-fwrapv_-fPIC_-fPIE2022100620221005

Test failure

Implementation: T:avx512
Security model: timingleaks
Compiler: clang -march=native -O2 -fomit-frame-pointer -fwrapv -Qunused-arguments -fPIC -fPIE
error 111

Number of similar (compiler,implementation) pairs: 9, namely:
CompilerImplementations
clang -march=native -O2 -fomit-frame-pointer -fwrapv -Qunused-arguments -fPIC -fPIE T:avx512
clang -march=native -O3 -fomit-frame-pointer -fwrapv -Qunused-arguments -fPIC -fPIE T:avx512
clang -march=native -O -fomit-frame-pointer -fwrapv -Qunused-arguments -fPIC -fPIE T:avx512
clang -march=native -Os -fomit-frame-pointer -fwrapv -Qunused-arguments -fPIC -fPIE T:avx512
clang -mcpu=native -O3 -fomit-frame-pointer -fwrapv -Qunused-arguments -fPIC -fPIE T:avx512
gcc -march=native -mtune=native -O2 -fomit-frame-pointer -fwrapv -fPIC -fPIE T:avx512
gcc -march=native -mtune=native -O3 -fomit-frame-pointer -fwrapv -fPIC -fPIE T:avx512
gcc -march=native -mtune=native -O -fomit-frame-pointer -fwrapv -fPIC -fPIE T:avx512
gcc -march=native -mtune=native -Os -fomit-frame-pointer -fwrapv -fPIC -fPIE T:avx512

Compiler output

Implementation: T:neon
Security model: timingleaks
Compiler: clang -march=native -O2 -fomit-frame-pointer -fwrapv -Qunused-arguments -fPIC -fPIE
blake3.c: In file included from blake3.c:12:
blake3.c: ./blake3_static_dispatch.h:17:9: warning: 'MAX_SIMD_DEGREE' macro redefined [-Wmacro-redefined]
blake3.c: #define MAX_SIMD_DEGREE 4
blake3.c: ^
blake3.c: ./blake3_impl.h:49:9: note: previous definition is here
blake3.c: #define MAX_SIMD_DEGREE 16
blake3.c: ^
blake3.c: In file included from blake3.c:12:
blake3.c: ./blake3_static_dispatch.h:18:9: warning: 'MAX_SIMD_DEGREE_OR_2' macro redefined [-Wmacro-redefined]
blake3.c: #define MAX_SIMD_DEGREE_OR_2 4
blake3.c: ^
blake3.c: ./blake3_impl.h:58:9: note: previous definition is here
blake3.c: #define MAX_SIMD_DEGREE_OR_2 (MAX_SIMD_DEGREE > 2 ? MAX_SIMD_DEGREE : 2)
blake3.c: ^
blake3.c: 2 warnings generated.
blake3_neon.c: In file included from blake3_neon.c:3:
blake3_neon.c: /usr/lib/llvm-10/lib/clang/10.0.0/include/arm_neon.h:28:2: error: "NEON support not enabled"
blake3_neon.c: #error "NEON support not enabled"
blake3_neon.c: ^
blake3_neon.c: /usr/lib/llvm-10/lib/clang/10.0.0/include/arm_neon.h:48:24: error: 'neon_vector_type' attribute is not supported for this target
blake3_neon.c: typedef __attribute__((neon_vector_type(8))) int8_t int8x8_t;
blake3_neon.c: ^
blake3_neon.c: /usr/lib/llvm-10/lib/clang/10.0.0/include/arm_neon.h:49:24: error: 'neon_vector_type' attribute is not supported for this target
blake3_neon.c: typedef __attribute__((neon_vector_type(16))) int8_t int8x16_t;
blake3_neon.c: ^
blake3_neon.c: /usr/lib/llvm-10/lib/clang/10.0.0/include/arm_neon.h:50:24: error: 'neon_vector_type' attribute is not supported for this target
blake3_neon.c: typedef __attribute__((neon_vector_type(4))) int16_t int16x4_t;
blake3_neon.c: ^
blake3_neon.c: /usr/lib/llvm-10/lib/clang/10.0.0/include/arm_neon.h:51:24: error: 'neon_vector_type' attribute is not supported for this target
blake3_neon.c: typedef __attribute__((neon_vector_type(8))) int16_t int16x8_t;
blake3_neon.c: ^
blake3_neon.c: /usr/lib/llvm-10/lib/clang/10.0.0/include/arm_neon.h:52:24: error: 'neon_vector_type' attribute is not supported for this target
blake3_neon.c: typedef __attribute__((neon_vector_type(2))) int32_t int32x2_t;
blake3_neon.c: ^
blake3_neon.c: /usr/lib/llvm-10/lib/clang/10.0.0/include/arm_neon.h:53:24: error: 'neon_vector_type' attribute is not supported for this target
blake3_neon.c: typedef __attribute__((neon_vector_type(4))) int32_t int32x4_t;
blake3_neon.c: ^
blake3_neon.c: /usr/lib/llvm-10/lib/clang/10.0.0/include/arm_neon.h:54:24: error: 'neon_vector_type' attribute is not supported for this target
blake3_neon.c: typedef __attribute__((neon_vector_type(1))) int64_t int64x1_t;
blake3_neon.c: ^
blake3_neon.c: ...

Number of similar (compiler,implementation) pairs: 5, namely:
CompilerImplementations
clang -march=native -O2 -fomit-frame-pointer -fwrapv -Qunused-arguments -fPIC -fPIE T:neon
clang -march=native -O3 -fomit-frame-pointer -fwrapv -Qunused-arguments -fPIC -fPIE T:neon
clang -march=native -O -fomit-frame-pointer -fwrapv -Qunused-arguments -fPIC -fPIE T:neon
clang -march=native -Os -fomit-frame-pointer -fwrapv -Qunused-arguments -fPIC -fPIE T:neon
clang -mcpu=native -O3 -fomit-frame-pointer -fwrapv -Qunused-arguments -fPIC -fPIE T:neon

Compiler output

Implementation: T:neon
Security model: timingleaks
Compiler: gcc -march=native -mtune=native -O2 -fomit-frame-pointer -fwrapv -fPIC -fPIE
blake3.c: In file included from blake3.c:12:
blake3.c: blake3_static_dispatch.h:17: warning: "MAX_SIMD_DEGREE" redefined
blake3.c: 17 | #define MAX_SIMD_DEGREE 4
blake3.c: |
blake3.c: In file included from blake3.c:6:
blake3.c: blake3_impl.h:49: note: this is the location of the previous definition
blake3.c: 49 | #define MAX_SIMD_DEGREE 16
blake3.c: |
blake3.c: In file included from blake3.c:12:
blake3.c: blake3_static_dispatch.h:18: warning: "MAX_SIMD_DEGREE_OR_2" redefined
blake3.c: 18 | #define MAX_SIMD_DEGREE_OR_2 4
blake3.c: |
blake3.c: In file included from blake3.c:6:
blake3.c: blake3_impl.h:58: note: this is the location of the previous definition
blake3.c: 58 | #define MAX_SIMD_DEGREE_OR_2 (MAX_SIMD_DEGREE > 2 ? MAX_SIMD_DEGREE : 2)
blake3.c: |
blake3_neon.c: blake3_neon.c:3:10: fatal error: arm_neon.h: No such file or directory
blake3_neon.c: 3 | #include <arm_neon.h>
blake3_neon.c: | ^~~~~~~~~~~~
blake3_neon.c: compilation terminated.

Number of similar (compiler,implementation) pairs: 4, namely:
CompilerImplementations
gcc -march=native -mtune=native -O2 -fomit-frame-pointer -fwrapv -fPIC -fPIE T:neon
gcc -march=native -mtune=native -O3 -fomit-frame-pointer -fwrapv -fPIC -fPIE T:neon
gcc -march=native -mtune=native -O -fomit-frame-pointer -fwrapv -fPIC -fPIE T:neon
gcc -march=native -mtune=native -Os -fomit-frame-pointer -fwrapv -fPIC -fPIE T:neon

Namespace violations

Implementation: T:avx2
Security model: timingleaks
Compiler: clang -march=native -O2 -fomit-frame-pointer -fwrapv -Qunused-arguments -fPIC -fPIE
blake3.o blake3_compress_subtree_wide T
blake3.o blake3_default_hash T
blake3_avx2_x86-64_unix.o _blake3_hash_many_avx2 T
blake3_avx2_x86-64_unix.o blake3_hash_many_avx2 T
blake3_sse41_x86-64_unix.o _blake3_compress_in_place_sse41 T
blake3_sse41_x86-64_unix.o _blake3_compress_xof_sse41 T
blake3_sse41_x86-64_unix.o _blake3_hash_many_sse41 T
blake3_sse41_x86-64_unix.o blake3_compress_in_place_sse41 T
blake3_sse41_x86-64_unix.o blake3_compress_xof_sse41 T
blake3_sse41_x86-64_unix.o blake3_hash_many_sse41 T

Number of similar (compiler,implementation) pairs: 9, namely:
CompilerImplementations
clang -march=native -O2 -fomit-frame-pointer -fwrapv -Qunused-arguments -fPIC -fPIE T:avx2
clang -march=native -O3 -fomit-frame-pointer -fwrapv -Qunused-arguments -fPIC -fPIE T:avx2
clang -march=native -O -fomit-frame-pointer -fwrapv -Qunused-arguments -fPIC -fPIE T:avx2
clang -march=native -Os -fomit-frame-pointer -fwrapv -Qunused-arguments -fPIC -fPIE T:avx2
clang -mcpu=native -O3 -fomit-frame-pointer -fwrapv -Qunused-arguments -fPIC -fPIE T:avx2
gcc -march=native -mtune=native -O2 -fomit-frame-pointer -fwrapv -fPIC -fPIE T:avx2
gcc -march=native -mtune=native -O3 -fomit-frame-pointer -fwrapv -fPIC -fPIE T:avx2
gcc -march=native -mtune=native -O -fomit-frame-pointer -fwrapv -fPIC -fPIE T:avx2
gcc -march=native -mtune=native -Os -fomit-frame-pointer -fwrapv -fPIC -fPIE T:avx2

Namespace violations

Implementation: T:portable
Security model: timingleaks
Compiler: clang -march=native -O2 -fomit-frame-pointer -fwrapv -Qunused-arguments -fPIC -fPIE
blake3.o blake3_compress_subtree_wide T
blake3.o blake3_default_hash T
blake3_portable.o blake3_compress_in_place_portable T
blake3_portable.o blake3_compress_xof_portable T
blake3_portable.o blake3_hash_many_portable T

Number of similar (compiler,implementation) pairs: 9, namely:
CompilerImplementations
clang -march=native -O2 -fomit-frame-pointer -fwrapv -Qunused-arguments -fPIC -fPIE T:portable
clang -march=native -O3 -fomit-frame-pointer -fwrapv -Qunused-arguments -fPIC -fPIE T:portable
clang -march=native -O -fomit-frame-pointer -fwrapv -Qunused-arguments -fPIC -fPIE T:portable
clang -march=native -Os -fomit-frame-pointer -fwrapv -Qunused-arguments -fPIC -fPIE T:portable
clang -mcpu=native -O3 -fomit-frame-pointer -fwrapv -Qunused-arguments -fPIC -fPIE T:portable
gcc -march=native -mtune=native -O2 -fomit-frame-pointer -fwrapv -fPIC -fPIE T:portable
gcc -march=native -mtune=native -O3 -fomit-frame-pointer -fwrapv -fPIC -fPIE T:portable
gcc -march=native -mtune=native -O -fomit-frame-pointer -fwrapv -fPIC -fPIE T:portable
gcc -march=native -mtune=native -Os -fomit-frame-pointer -fwrapv -fPIC -fPIE T:portable

Namespace violations

Implementation: T:sse41
Security model: timingleaks
Compiler: clang -march=native -O2 -fomit-frame-pointer -fwrapv -Qunused-arguments -fPIC -fPIE
blake3.o blake3_compress_subtree_wide T
blake3.o blake3_default_hash T
blake3_sse41_x86-64_unix.o _blake3_compress_in_place_sse41 T
blake3_sse41_x86-64_unix.o _blake3_compress_xof_sse41 T
blake3_sse41_x86-64_unix.o _blake3_hash_many_sse41 T
blake3_sse41_x86-64_unix.o blake3_compress_in_place_sse41 T
blake3_sse41_x86-64_unix.o blake3_compress_xof_sse41 T
blake3_sse41_x86-64_unix.o blake3_hash_many_sse41 T

Number of similar (compiler,implementation) pairs: 9, namely:
CompilerImplementations
clang -march=native -O2 -fomit-frame-pointer -fwrapv -Qunused-arguments -fPIC -fPIE T:sse41
clang -march=native -O3 -fomit-frame-pointer -fwrapv -Qunused-arguments -fPIC -fPIE T:sse41
clang -march=native -O -fomit-frame-pointer -fwrapv -Qunused-arguments -fPIC -fPIE T:sse41
clang -march=native -Os -fomit-frame-pointer -fwrapv -Qunused-arguments -fPIC -fPIE T:sse41
clang -mcpu=native -O3 -fomit-frame-pointer -fwrapv -Qunused-arguments -fPIC -fPIE T:sse41
gcc -march=native -mtune=native -O2 -fomit-frame-pointer -fwrapv -fPIC -fPIE T:sse41
gcc -march=native -mtune=native -O3 -fomit-frame-pointer -fwrapv -fPIC -fPIE T:sse41
gcc -march=native -mtune=native -O -fomit-frame-pointer -fwrapv -fPIC -fPIE T:sse41
gcc -march=native -mtune=native -Os -fomit-frame-pointer -fwrapv -fPIC -fPIE T:sse41