Implementation notes: amd64, rumba5, crypto_aead/morus640128v1

Computer: rumba5
Architecture: amd64
CPU ID: AuthenticAMD-00800f11-178bfbff
SUPERCOP version: 20220506
Operation: crypto_aead
Primitive: morus640128v1
TimeObject sizeTest sizeImplementationCompilerBenchmark dateSUPERCOP version
71146800 0 023084 804 1008T:sse2clang_-mcpu=native_-O3_-fomit-frame-pointer_-fwrapv_-Qunused-arguments_-fPIC_-fPIE2021011520210114
72635799 0 021932 804 1040T:sse2clang_-march=native_-O3_-fomit-frame-pointer_-fwrapv_-Qunused-arguments_-fPIC_-fPIE2021011520210114
73175767 0 021852 804 1040T:sse2clang_-march=native_-O_-fomit-frame-pointer_-fwrapv_-Qunused-arguments_-fPIC_-fPIE2021011520210114
73365767 0 021852 804 1040T:sse2clang_-march=native_-O2_-fomit-frame-pointer_-fwrapv_-Qunused-arguments_-fPIC_-fPIE2021011520210114
107292879 0 016042 796 1008T:sse2clang_-march=native_-Os_-fomit-frame-pointer_-fwrapv_-Qunused-arguments_-fPIC_-fPIE2021011520210114
126522447 0 017200 812 1072T:sse2gcc_-march=native_-mtune=native_-O_-fomit-frame-pointer_-fwrapv_-fPIC_-fPIE2021011520210114
126545874 0 022968 812 1072T:sse2gcc_-march=native_-mtune=native_-O3_-fomit-frame-pointer_-fwrapv_-fPIC_-fPIE2021011520210114
129652406 0 017376 812 1072T:sse2gcc_-march=native_-mtune=native_-O2_-fomit-frame-pointer_-fwrapv_-fPIC_-fPIE2021011520210114
131702009 0 015691 788 1040T:sse2gcc_-march=native_-mtune=native_-Os_-fomit-frame-pointer_-fwrapv_-fPIC_-fPIE2021011520210114
2031711946 0 029032 812 1072T:refgcc_-march=native_-mtune=native_-O3_-fomit-frame-pointer_-fwrapv_-fPIC_-fPIE2021011520210114
2038310759 0 025631 804 1072T:refgcc_-march=native_-mtune=native_-O2_-fomit-frame-pointer_-fwrapv_-fPIC_-fPIE2021011520210114
2098510939 0 025599 804 1072T:refgcc_-march=native_-mtune=native_-O_-fomit-frame-pointer_-fwrapv_-fPIC_-fPIE2021011520210114

Compiler output

Implementation: T:ref
Security model: timingleaks
Compiler: clang -march=native -O2 -fomit-frame-pointer -fwrapv -Qunused-arguments -fPIC -fPIE
try.c: crypto_aead_morus640128v1.a(encrypt.o): In function `morus_initialization':
try.c: encrypt.c:(.text+0x...): undefined reference to `morus_stateupdate'
try.c: encrypt.c:(.text+0x...): undefined reference to `morus_stateupdate'
try.c: encrypt.c:(.text+0x...): undefined reference to `morus_stateupdate'
try.c: encrypt.c:(.text+0x...): undefined reference to `morus_stateupdate'
try.c: encrypt.c:(.text+0x...): undefined reference to `morus_stateupdate'
try.c: crypto_aead_morus640128v1.a(encrypt.o):encrypt.c:(.text+0x...): more undefined references to `morus_stateupdate' follow
try.c: clang: error: linker command failed with exit code 1 (use -v to see invocation)

Number of similar (compiler,implementation) pairs: 4, namely:
CompilerImplementations
clang -march=native -O2 -fomit-frame-pointer -fwrapv -Qunused-arguments -fPIC -fPIE T:ref
clang -march=native -O3 -fomit-frame-pointer -fwrapv -Qunused-arguments -fPIC -fPIE T:ref
clang -march=native -O -fomit-frame-pointer -fwrapv -Qunused-arguments -fPIC -fPIE T:ref
clang -mcpu=native -O3 -fomit-frame-pointer -fwrapv -Qunused-arguments -fPIC -fPIE T:ref

Compiler output

Implementation: T:ref
Security model: timingleaks
Compiler: clang -march=native -Os -fomit-frame-pointer -fwrapv -Qunused-arguments -fPIC -fPIE
try.c: crypto_aead_morus640128v1.a(encrypt.o): In function `morus_initialization':
try.c: encrypt.c:(.text+0x...): undefined reference to `morus_stateupdate'
try.c: crypto_aead_morus640128v1.a(encrypt.o): In function `morus_tag_generation':
try.c: encrypt.c:(.text+0x...): undefined reference to `morus_stateupdate'
try.c: crypto_aead_morus640128v1.a(encrypt.o): In function `morus_tag_verification':
try.c: encrypt.c:(.text+0x...): undefined reference to `morus_stateupdate'
try.c: crypto_aead_morus640128v1.a(encrypt.o): In function `morus_enc_aut_partialblock':
try.c: encrypt.c:(.text+0x...): undefined reference to `morus_stateupdate'
try.c: crypto_aead_morus640128v1.a(encrypt.o): In function `morus_dec_aut_partialblock':
try.c: encrypt.c:(.text+0x...): undefined reference to `morus_stateupdate'
try.c: crypto_aead_morus640128v1.a(encrypt.o):encrypt.c:(.text+0x...): more undefined references to `morus_stateupdate' follow
try.c: clang: error: linker command failed with exit code 1 (use -v to see invocation)

Number of similar (compiler,implementation) pairs: 1, namely:
CompilerImplementations
clang -march=native -Os -fomit-frame-pointer -fwrapv -Qunused-arguments -fPIC -fPIE T:ref

Compiler output

Implementation: T:ref
Security model: timingleaks
Compiler: gcc -march=native -mtune=native -Os -fomit-frame-pointer -fwrapv -fPIC -fPIE
try.c: crypto_aead_morus640128v1.a(encrypt.o): In function `morus_initialization':
try.c: encrypt.c:(.text+0x...): undefined reference to `morus_stateupdate'
try.c: crypto_aead_morus640128v1.a(encrypt.o): In function `morus_tag_generation':
try.c: encrypt.c:(.text+0x...): undefined reference to `morus_stateupdate'
try.c: crypto_aead_morus640128v1.a(encrypt.o): In function `morus_tag_verification':
try.c: encrypt.c:(.text+0x...): undefined reference to `morus_stateupdate'
try.c: crypto_aead_morus640128v1.a(encrypt.o): In function `morus_enc_aut_partialblock':
try.c: encrypt.c:(.text+0x...): undefined reference to `morus_stateupdate'
try.c: crypto_aead_morus640128v1.a(encrypt.o): In function `morus_dec_aut_partialblock':
try.c: encrypt.c:(.text+0x...): undefined reference to `morus_stateupdate'
try.c: crypto_aead_morus640128v1.a(encrypt.o): In function `crypto_aead_morus640128v1_ref_timingleaks_encrypt':
try.c: encrypt.c:(.text+0x...): undefined reference to `morus_enc_aut_step'
try.c: encrypt.c:(.text+0x...): undefined reference to `morus_enc_aut_step'
try.c: crypto_aead_morus640128v1.a(encrypt.o): In function `crypto_aead_morus640128v1_ref_timingleaks_decrypt':
try.c: encrypt.c:(.text+0x...): undefined reference to `morus_enc_aut_step'
try.c: encrypt.c:(.text+0x...): undefined reference to `morus_dec_aut_step'
try.c: collect2: error: ld returned 1 exit status

Number of similar (compiler,implementation) pairs: 1, namely:
CompilerImplementations
gcc -march=native -mtune=native -Os -fomit-frame-pointer -fwrapv -fPIC -fPIE T:ref

Namespace violations

Implementation: T:ref
Security model: timingleaks
Compiler: gcc -march=native -mtune=native -O2 -fomit-frame-pointer -fwrapv -fPIC -fPIE
encrypt.o morus_dec_aut_partialblock T
encrypt.o morus_enc_aut_partialblock T
encrypt.o morus_initialization T
encrypt.o morus_tag_generation T
encrypt.o morus_tag_verification T

Number of similar (compiler,implementation) pairs: 3, namely:
CompilerImplementations
gcc -march=native -mtune=native -O2 -fomit-frame-pointer -fwrapv -fPIC -fPIE T:ref
gcc -march=native -mtune=native -O3 -fomit-frame-pointer -fwrapv -fPIC -fPIE T:ref
gcc -march=native -mtune=native -O -fomit-frame-pointer -fwrapv -fPIC -fPIE T:ref

Namespace violations

Implementation: T:sse2
Security model: timingleaks
Compiler: clang -march=native -O2 -fomit-frame-pointer -fwrapv -Qunused-arguments -fPIC -fPIE
morus640128v1sse2.o morus_dec_aut_partialblock T
morus640128v1sse2.o morus_enc_aut_partialblock T
morus640128v1sse2.o morus_initialization T
morus640128v1sse2.o morus_stateupdate T
morus640128v1sse2.o morus_tag_generation T
morus640128v1sse2.o morus_tag_verification T

Number of similar (compiler,implementation) pairs: 9, namely:
CompilerImplementations
clang -march=native -O2 -fomit-frame-pointer -fwrapv -Qunused-arguments -fPIC -fPIE T:sse2
clang -march=native -O3 -fomit-frame-pointer -fwrapv -Qunused-arguments -fPIC -fPIE T:sse2
clang -march=native -O -fomit-frame-pointer -fwrapv -Qunused-arguments -fPIC -fPIE T:sse2
clang -march=native -Os -fomit-frame-pointer -fwrapv -Qunused-arguments -fPIC -fPIE T:sse2
clang -mcpu=native -O3 -fomit-frame-pointer -fwrapv -Qunused-arguments -fPIC -fPIE T:sse2
gcc -march=native -mtune=native -O2 -fomit-frame-pointer -fwrapv -fPIC -fPIE T:sse2
gcc -march=native -mtune=native -O3 -fomit-frame-pointer -fwrapv -fPIC -fPIE T:sse2
gcc -march=native -mtune=native -O -fomit-frame-pointer -fwrapv -fPIC -fPIE T:sse2
gcc -march=native -mtune=native -Os -fomit-frame-pointer -fwrapv -fPIC -fPIE T:sse2