Implementation notes: amd64, rome0, crypto_aead/omdsha512k512n256tau256v1

Computer: rome0
Microarchitecture: amd64; Zen 2 (830f10)
Architecture: amd64
CPU ID: AuthenticAMD-00830f10-178bfbff
SUPERCOP version: 20240716
Operation: crypto_aead
Primitive: omdsha512k512n256tau256v1
TimeObject sizeTest sizeImplementationCompilerBenchmark dateSUPERCOP version
9835221093 0 044112 780 1080T:refgcc_-march=native_-mtune=native_-O3_-fwrapv_-fPIC_-fPIE_-gdwarf-4_-Wall2024062520240625
11413915537 0 037936 812 1016T:refclang_-mcpu=native_-O3_-fwrapv_-Qunused-arguments_-fPIC_-fPIE_-gdwarf-4_-Wall2024062520240625
11582616276 0 038256 812 1048T:refclang_-march=native_-O3_-fwrapv_-Qunused-arguments_-fPIC_-fPIE_-gdwarf-4_-Wall2024062520240625
1170768961 0 030832 812 1048T:refclang_-march=native_-O2_-fwrapv_-Qunused-arguments_-fPIC_-fPIE_-gdwarf-4_-Wall2024062520240625
1210774961 0 024854 804 1016T:refclang_-march=native_-O_-fwrapv_-Qunused-arguments_-fPIC_-fPIE_-gdwarf-4_-Wall2024062520240625
1263185538 0 025246 804 1016T:refclang_-march=native_-Os_-fwrapv_-Qunused-arguments_-fPIC_-fPIE_-gdwarf-4_-Wall2024062520240625
1329098203 0 029576 780 1080T:refgcc_-march=native_-mtune=native_-O2_-fwrapv_-fPIC_-fPIE_-gdwarf-4_-Wall2024062520240625
1456407083 0 027703 772 1080T:refgcc_-march=native_-mtune=native_-O_-fwrapv_-fPIC_-fPIE_-gdwarf-4_-Wall2024062520240625
1621164608 0 023539 756 1048T:refgcc_-march=native_-mtune=native_-Os_-fwrapv_-fPIC_-fPIE_-gdwarf-4_-Wall2024062520240625

Compiler output


try.c: /usr/bin/ld: libcrypto_aead_omdsha512k512n256tau256v1.a(omdsha512.o):.../supercop-data/rome0/amd64/try/c/clang_-march=native_-O2_-fwrapv_-Qunused-arguments_-fPIC_-fPIE_-gdwarf-4_-Wall/timingleaks/crypto_aead/omdsha512k512n256tau256v1/avx1/work/./omdsha512.h:146: multiple definition of `Hash'; libcrypto_aead_omdsha512k512n256tau256v1.a(encrypt.o):.../supercop-data/rome0/amd64/try/c/clang_-march=native_-O2_-fwrapv_-Qunused-arguments_-fPIC_-fPIE_-gdwarf-4_-Wall/timingleaks/crypto_aead/omdsha512k512n256tau256v1/avx1/work/./omdsha512.h:146: first defined here
try.c: clang: error: linker command failed with exit code 1 (use -v to see invocation)

Number of similar (implementation,compiler) pairs: 1, namely:
ImplementationCompiler
T:avx1clang -march=native -O2 -fwrapv -Qunused-arguments -fPIC -fPIE -gdwarf-4 -Wall (Debian_Clang_11.0.1)

Compiler output


try.c: /usr/bin/ld: libcrypto_aead_omdsha512k512n256tau256v1.a(omdsha512.o):.../supercop-data/rome0/amd64/try/c/clang_-march=native_-O3_-fwrapv_-Qunused-arguments_-fPIC_-fPIE_-gdwarf-4_-Wall/timingleaks/crypto_aead/omdsha512k512n256tau256v1/avx1/work/./omdsha512.h:146: multiple definition of `Hash'; libcrypto_aead_omdsha512k512n256tau256v1.a(encrypt.o):.../supercop-data/rome0/amd64/try/c/clang_-march=native_-O3_-fwrapv_-Qunused-arguments_-fPIC_-fPIE_-gdwarf-4_-Wall/timingleaks/crypto_aead/omdsha512k512n256tau256v1/avx1/work/./omdsha512.h:146: first defined here
try.c: clang: error: linker command failed with exit code 1 (use -v to see invocation)

Number of similar (implementation,compiler) pairs: 1, namely:
ImplementationCompiler
T:avx1clang -march=native -O3 -fwrapv -Qunused-arguments -fPIC -fPIE -gdwarf-4 -Wall (Debian_Clang_11.0.1)

Compiler output


try.c: /usr/bin/ld: libcrypto_aead_omdsha512k512n256tau256v1.a(omdsha512.o):.../supercop-data/rome0/amd64/try/c/clang_-march=native_-O_-fwrapv_-Qunused-arguments_-fPIC_-fPIE_-gdwarf-4_-Wall/timingleaks/crypto_aead/omdsha512k512n256tau256v1/avx1/work/./omdsha512.h:146: multiple definition of `Hash'; libcrypto_aead_omdsha512k512n256tau256v1.a(encrypt.o):.../supercop-data/rome0/amd64/try/c/clang_-march=native_-O_-fwrapv_-Qunused-arguments_-fPIC_-fPIE_-gdwarf-4_-Wall/timingleaks/crypto_aead/omdsha512k512n256tau256v1/avx1/work/./omdsha512.h:146: first defined here
try.c: clang: error: linker command failed with exit code 1 (use -v to see invocation)

Number of similar (implementation,compiler) pairs: 1, namely:
ImplementationCompiler
T:avx1clang -march=native -O -fwrapv -Qunused-arguments -fPIC -fPIE -gdwarf-4 -Wall (Debian_Clang_11.0.1)

Compiler output


try.c: /usr/bin/ld: libcrypto_aead_omdsha512k512n256tau256v1.a(omdsha512.o):.../supercop-data/rome0/amd64/try/c/clang_-march=native_-Os_-fwrapv_-Qunused-arguments_-fPIC_-fPIE_-gdwarf-4_-Wall/timingleaks/crypto_aead/omdsha512k512n256tau256v1/avx1/work/./omdsha512.h:146: multiple definition of `Hash'; libcrypto_aead_omdsha512k512n256tau256v1.a(encrypt.o):.../supercop-data/rome0/amd64/try/c/clang_-march=native_-Os_-fwrapv_-Qunused-arguments_-fPIC_-fPIE_-gdwarf-4_-Wall/timingleaks/crypto_aead/omdsha512k512n256tau256v1/avx1/work/./omdsha512.h:146: first defined here
try.c: clang: error: linker command failed with exit code 1 (use -v to see invocation)

Number of similar (implementation,compiler) pairs: 1, namely:
ImplementationCompiler
T:avx1clang -march=native -Os -fwrapv -Qunused-arguments -fPIC -fPIE -gdwarf-4 -Wall (Debian_Clang_11.0.1)

Compiler output


try.c: /usr/bin/ld: libcrypto_aead_omdsha512k512n256tau256v1.a(omdsha512.o):.../supercop-data/rome0/amd64/try/c/clang_-mcpu=native_-O3_-fwrapv_-Qunused-arguments_-fPIC_-fPIE_-gdwarf-4_-Wall/timingleaks/crypto_aead/omdsha512k512n256tau256v1/avx1/work/./omdsha512.h:146: multiple definition of `Hash'; libcrypto_aead_omdsha512k512n256tau256v1.a(encrypt.o):.../supercop-data/rome0/amd64/try/c/clang_-mcpu=native_-O3_-fwrapv_-Qunused-arguments_-fPIC_-fPIE_-gdwarf-4_-Wall/timingleaks/crypto_aead/omdsha512k512n256tau256v1/avx1/work/./omdsha512.h:146: first defined here
try.c: clang: error: linker command failed with exit code 1 (use -v to see invocation)

Number of similar (implementation,compiler) pairs: 1, namely:
ImplementationCompiler
T:avx1clang -mcpu=native -O3 -fwrapv -Qunused-arguments -fPIC -fPIE -gdwarf-4 -Wall (Debian_Clang_11.0.1)

Compiler output


encrypt.c: /tmp/ccJDojm1.s: Assembler messages:
encrypt.c: /tmp/ccJDojm1.s:10042: Error: can't resolve `.data' {.data section} - `.Ltext0' {.text section}
encrypt.c: /tmp/ccJDojm1.s:10043: Error: can't resolve `.data' {.data section} - `.Ltext0' {.text section}
encrypt.c: /tmp/ccJDojm1.s:10046: Error: can't resolve `.data' {.data section} - `.Ltext0' {.text section}
encrypt.c: /tmp/ccJDojm1.s:10047: Error: can't resolve `.data' {.data section} - `.Ltext0' {.text section}
encrypt.c: /tmp/ccJDojm1.s:10061: Error: can't resolve `.data' {.data section} - `.Ltext0' {.text section}
encrypt.c: /tmp/ccJDojm1.s:10062: Error: can't resolve `.data' {.data section} - `.Ltext0' {.text section}
encrypt.c: /tmp/ccJDojm1.s:10065: Error: can't resolve `.data' {.data section} - `.Ltext0' {.text section}
encrypt.c: /tmp/ccJDojm1.s:10066: Error: can't resolve `.data' {.data section} - `.Ltext0' {.text section}
encrypt.c: /tmp/ccJDojm1.s:10080: Error: can't resolve `.data' {.data section} - `.Ltext0' {.text section}
encrypt.c: /tmp/ccJDojm1.s:10081: Error: can't resolve `.data' {.data section} - `.Ltext0' {.text section}
encrypt.c: /tmp/ccJDojm1.s:10084: Error: can't resolve `.data' {.data section} - `.Ltext0' {.text section}
encrypt.c: /tmp/ccJDojm1.s:10085: Error: can't resolve `.data' {.data section} - `.Ltext0' {.text section}
encrypt.c: /tmp/ccJDojm1.s:10101: Error: can't resolve `.data' {.data section} - `.Ltext0' {.text section}
encrypt.c: /tmp/ccJDojm1.s:10102: Error: can't resolve `.data' {.data section} - `.Ltext0' {.text section}
encrypt.c: /tmp/ccJDojm1.s:10105: Error: can't resolve `.data' {.data section} - `.Ltext0' {.text section}
encrypt.c: /tmp/ccJDojm1.s:10106: Error: can't resolve `.data' {.data section} - `.Ltext0' {.text section}
encrypt.c: /tmp/ccJDojm1.s:10109: Error: can't resolve `.data' {.data section} - `.Ltext0' {.text section}
encrypt.c: /tmp/ccJDojm1.s:10110: Error: can't resolve `.data' {.data section} - `.Ltext0' {.text section}
encrypt.c: /tmp/ccJDojm1.s:10126: Error: can't resolve `.data' {.data section} - `.Ltext0' {.text section}
encrypt.c: /tmp/ccJDojm1.s:10127: Error: can't resolve `.data' {.data section} - `.Ltext0' {.text section}
encrypt.c: /tmp/ccJDojm1.s:10130: Error: can't resolve `.data' {.data section} - `.Ltext0' {.text section}
encrypt.c: /tmp/ccJDojm1.s:10131: Error: can't resolve `.data' {.data section} - `.Ltext0' {.text section}
encrypt.c: /tmp/ccJDojm1.s:10134: Error: can't resolve `.data' {.data section} - `.Ltext0' {.text section}
encrypt.c: /tmp/ccJDojm1.s:10135: Error: can't resolve `.data' {.data section} - `.Ltext0' {.text section}
encrypt.c: ...

Number of similar (implementation,compiler) pairs: 1, namely:
ImplementationCompiler
T:avx1gcc -march=native -mtune=native -O2 -fwrapv -fPIC -fPIE -gdwarf-4 -Wall (10.2.1_20210110)

Compiler output


encrypt.c: /tmp/cc23Sqdc.s: Assembler messages:
encrypt.c: /tmp/cc23Sqdc.s:10042: Error: can't resolve `.data' {.data section} - `.Ltext0' {.text section}
encrypt.c: /tmp/cc23Sqdc.s:10043: Error: can't resolve `.data' {.data section} - `.Ltext0' {.text section}
encrypt.c: /tmp/cc23Sqdc.s:10046: Error: can't resolve `.data' {.data section} - `.Ltext0' {.text section}
encrypt.c: /tmp/cc23Sqdc.s:10047: Error: can't resolve `.data' {.data section} - `.Ltext0' {.text section}
encrypt.c: /tmp/cc23Sqdc.s:10061: Error: can't resolve `.data' {.data section} - `.Ltext0' {.text section}
encrypt.c: /tmp/cc23Sqdc.s:10062: Error: can't resolve `.data' {.data section} - `.Ltext0' {.text section}
encrypt.c: /tmp/cc23Sqdc.s:10065: Error: can't resolve `.data' {.data section} - `.Ltext0' {.text section}
encrypt.c: /tmp/cc23Sqdc.s:10066: Error: can't resolve `.data' {.data section} - `.Ltext0' {.text section}
encrypt.c: /tmp/cc23Sqdc.s:10080: Error: can't resolve `.data' {.data section} - `.Ltext0' {.text section}
encrypt.c: /tmp/cc23Sqdc.s:10081: Error: can't resolve `.data' {.data section} - `.Ltext0' {.text section}
encrypt.c: /tmp/cc23Sqdc.s:10084: Error: can't resolve `.data' {.data section} - `.Ltext0' {.text section}
encrypt.c: /tmp/cc23Sqdc.s:10085: Error: can't resolve `.data' {.data section} - `.Ltext0' {.text section}
encrypt.c: /tmp/cc23Sqdc.s:10101: Error: can't resolve `.data' {.data section} - `.Ltext0' {.text section}
encrypt.c: /tmp/cc23Sqdc.s:10102: Error: can't resolve `.data' {.data section} - `.Ltext0' {.text section}
encrypt.c: /tmp/cc23Sqdc.s:10105: Error: can't resolve `.data' {.data section} - `.Ltext0' {.text section}
encrypt.c: /tmp/cc23Sqdc.s:10106: Error: can't resolve `.data' {.data section} - `.Ltext0' {.text section}
encrypt.c: /tmp/cc23Sqdc.s:10109: Error: can't resolve `.data' {.data section} - `.Ltext0' {.text section}
encrypt.c: /tmp/cc23Sqdc.s:10110: Error: can't resolve `.data' {.data section} - `.Ltext0' {.text section}
encrypt.c: /tmp/cc23Sqdc.s:10126: Error: can't resolve `.data' {.data section} - `.Ltext0' {.text section}
encrypt.c: /tmp/cc23Sqdc.s:10127: Error: can't resolve `.data' {.data section} - `.Ltext0' {.text section}
encrypt.c: /tmp/cc23Sqdc.s:10130: Error: can't resolve `.data' {.data section} - `.Ltext0' {.text section}
encrypt.c: /tmp/cc23Sqdc.s:10131: Error: can't resolve `.data' {.data section} - `.Ltext0' {.text section}
encrypt.c: /tmp/cc23Sqdc.s:10134: Error: can't resolve `.data' {.data section} - `.Ltext0' {.text section}
encrypt.c: /tmp/cc23Sqdc.s:10135: Error: can't resolve `.data' {.data section} - `.Ltext0' {.text section}
encrypt.c: ...

Number of similar (implementation,compiler) pairs: 1, namely:
ImplementationCompiler
T:avx1gcc -march=native -mtune=native -O3 -fwrapv -fPIC -fPIE -gdwarf-4 -Wall (10.2.1_20210110)

Compiler output


encrypt.c: /tmp/ccmIHXDS.s: Assembler messages:
encrypt.c: /tmp/ccmIHXDS.s:10056: Error: can't resolve `.data' {.data section} - `.Ltext0' {.text section}
encrypt.c: /tmp/ccmIHXDS.s:10057: Error: can't resolve `.data' {.data section} - `.Ltext0' {.text section}
encrypt.c: /tmp/ccmIHXDS.s:10060: Error: can't resolve `.data' {.data section} - `.Ltext0' {.text section}
encrypt.c: /tmp/ccmIHXDS.s:10061: Error: can't resolve `.data' {.data section} - `.Ltext0' {.text section}
encrypt.c: /tmp/ccmIHXDS.s:10075: Error: can't resolve `.data' {.data section} - `.Ltext0' {.text section}
encrypt.c: /tmp/ccmIHXDS.s:10076: Error: can't resolve `.data' {.data section} - `.Ltext0' {.text section}
encrypt.c: /tmp/ccmIHXDS.s:10079: Error: can't resolve `.data' {.data section} - `.Ltext0' {.text section}
encrypt.c: /tmp/ccmIHXDS.s:10080: Error: can't resolve `.data' {.data section} - `.Ltext0' {.text section}
encrypt.c: /tmp/ccmIHXDS.s:10094: Error: can't resolve `.data' {.data section} - `.Ltext0' {.text section}
encrypt.c: /tmp/ccmIHXDS.s:10095: Error: can't resolve `.data' {.data section} - `.Ltext0' {.text section}
encrypt.c: /tmp/ccmIHXDS.s:10098: Error: can't resolve `.data' {.data section} - `.Ltext0' {.text section}
encrypt.c: /tmp/ccmIHXDS.s:10099: Error: can't resolve `.data' {.data section} - `.Ltext0' {.text section}
encrypt.c: /tmp/ccmIHXDS.s:10115: Error: can't resolve `.data' {.data section} - `.Ltext0' {.text section}
encrypt.c: /tmp/ccmIHXDS.s:10116: Error: can't resolve `.data' {.data section} - `.Ltext0' {.text section}
encrypt.c: /tmp/ccmIHXDS.s:10119: Error: can't resolve `.data' {.data section} - `.Ltext0' {.text section}
encrypt.c: /tmp/ccmIHXDS.s:10120: Error: can't resolve `.data' {.data section} - `.Ltext0' {.text section}
encrypt.c: /tmp/ccmIHXDS.s:10123: Error: can't resolve `.data' {.data section} - `.Ltext0' {.text section}
encrypt.c: /tmp/ccmIHXDS.s:10124: Error: can't resolve `.data' {.data section} - `.Ltext0' {.text section}
encrypt.c: /tmp/ccmIHXDS.s:10140: Error: can't resolve `.data' {.data section} - `.Ltext0' {.text section}
encrypt.c: /tmp/ccmIHXDS.s:10141: Error: can't resolve `.data' {.data section} - `.Ltext0' {.text section}
encrypt.c: /tmp/ccmIHXDS.s:10144: Error: can't resolve `.data' {.data section} - `.Ltext0' {.text section}
encrypt.c: /tmp/ccmIHXDS.s:10145: Error: can't resolve `.data' {.data section} - `.Ltext0' {.text section}
encrypt.c: /tmp/ccmIHXDS.s:10148: Error: can't resolve `.data' {.data section} - `.Ltext0' {.text section}
encrypt.c: /tmp/ccmIHXDS.s:10149: Error: can't resolve `.data' {.data section} - `.Ltext0' {.text section}
encrypt.c: ...

Number of similar (implementation,compiler) pairs: 1, namely:
ImplementationCompiler
T:avx1gcc -march=native -mtune=native -O -fwrapv -fPIC -fPIE -gdwarf-4 -Wall (10.2.1_20210110)

Compiler output


encrypt.c: /tmp/ccK25Ix6.s: Assembler messages:
encrypt.c: /tmp/ccK25Ix6.s:10040: Error: can't resolve `.data' {.data section} - `.Ltext0' {.text section}
encrypt.c: /tmp/ccK25Ix6.s:10041: Error: can't resolve `.data' {.data section} - `.Ltext0' {.text section}
encrypt.c: /tmp/ccK25Ix6.s:10044: Error: can't resolve `.data' {.data section} - `.Ltext0' {.text section}
encrypt.c: /tmp/ccK25Ix6.s:10045: Error: can't resolve `.data' {.data section} - `.Ltext0' {.text section}
encrypt.c: /tmp/ccK25Ix6.s:10059: Error: can't resolve `.data' {.data section} - `.Ltext0' {.text section}
encrypt.c: /tmp/ccK25Ix6.s:10060: Error: can't resolve `.data' {.data section} - `.Ltext0' {.text section}
encrypt.c: /tmp/ccK25Ix6.s:10063: Error: can't resolve `.data' {.data section} - `.Ltext0' {.text section}
encrypt.c: /tmp/ccK25Ix6.s:10064: Error: can't resolve `.data' {.data section} - `.Ltext0' {.text section}
encrypt.c: /tmp/ccK25Ix6.s:10078: Error: can't resolve `.data' {.data section} - `.Ltext0' {.text section}
encrypt.c: /tmp/ccK25Ix6.s:10079: Error: can't resolve `.data' {.data section} - `.Ltext0' {.text section}
encrypt.c: /tmp/ccK25Ix6.s:10082: Error: can't resolve `.data' {.data section} - `.Ltext0' {.text section}
encrypt.c: /tmp/ccK25Ix6.s:10083: Error: can't resolve `.data' {.data section} - `.Ltext0' {.text section}
encrypt.c: /tmp/ccK25Ix6.s:10099: Error: can't resolve `.data' {.data section} - `.Ltext0' {.text section}
encrypt.c: /tmp/ccK25Ix6.s:10100: Error: can't resolve `.data' {.data section} - `.Ltext0' {.text section}
encrypt.c: /tmp/ccK25Ix6.s:10103: Error: can't resolve `.data' {.data section} - `.Ltext0' {.text section}
encrypt.c: /tmp/ccK25Ix6.s:10104: Error: can't resolve `.data' {.data section} - `.Ltext0' {.text section}
encrypt.c: /tmp/ccK25Ix6.s:10107: Error: can't resolve `.data' {.data section} - `.Ltext0' {.text section}
encrypt.c: /tmp/ccK25Ix6.s:10108: Error: can't resolve `.data' {.data section} - `.Ltext0' {.text section}
encrypt.c: /tmp/ccK25Ix6.s:10124: Error: can't resolve `.data' {.data section} - `.Ltext0' {.text section}
encrypt.c: /tmp/ccK25Ix6.s:10125: Error: can't resolve `.data' {.data section} - `.Ltext0' {.text section}
encrypt.c: /tmp/ccK25Ix6.s:10128: Error: can't resolve `.data' {.data section} - `.Ltext0' {.text section}
encrypt.c: /tmp/ccK25Ix6.s:10129: Error: can't resolve `.data' {.data section} - `.Ltext0' {.text section}
encrypt.c: /tmp/ccK25Ix6.s:10132: Error: can't resolve `.data' {.data section} - `.Ltext0' {.text section}
encrypt.c: /tmp/ccK25Ix6.s:10133: Error: can't resolve `.data' {.data section} - `.Ltext0' {.text section}
encrypt.c: ...

Number of similar (implementation,compiler) pairs: 1, namely:
ImplementationCompiler
T:avx1gcc -march=native -mtune=native -Os -fwrapv -fPIC -fPIE -gdwarf-4 -Wall (10.2.1_20210110)

Compiler output


sha512.c: sha512.c:206:18: warning: incompatible pointer types initializing 'const uint64_t *' (aka 'const unsigned long *') with an expression of type 'const unsigned char *' [-Wincompatible-pointer-types]
sha512.c:         const uint64_t *W=in;
sha512.c:                         ^ ~~
sha512.c: 1 warning generated.

Number of similar (implementation,compiler) pairs: 5, namely:
ImplementationCompiler
T:refclang -march=native -O2 -fwrapv -Qunused-arguments -fPIC -fPIE -gdwarf-4 -Wall (Debian_Clang_11.0.1)
T:refclang -march=native -O3 -fwrapv -Qunused-arguments -fPIC -fPIE -gdwarf-4 -Wall (Debian_Clang_11.0.1)
T:refclang -march=native -O -fwrapv -Qunused-arguments -fPIC -fPIE -gdwarf-4 -Wall (Debian_Clang_11.0.1)
T:refclang -march=native -Os -fwrapv -Qunused-arguments -fPIC -fPIE -gdwarf-4 -Wall (Debian_Clang_11.0.1)
T:refclang -mcpu=native -O3 -fwrapv -Qunused-arguments -fPIC -fPIE -gdwarf-4 -Wall (Debian_Clang_11.0.1)

Compiler output


sha512.c: sha512.c: In function 'sha512_comp':
sha512.c: sha512.c:206:20: warning: initialization of 'const uint64_t *' {aka 'const long unsigned int *'} from incompatible pointer type 'const unsigned char *' [-Wincompatible-pointer-types]
sha512.c:   206 |  const uint64_t *W=in;
sha512.c:       |                    ^~

Number of similar (implementation,compiler) pairs: 4, namely:
ImplementationCompiler
T:refgcc -march=native -mtune=native -O2 -fwrapv -fPIC -fPIE -gdwarf-4 -Wall (10.2.1_20210110)
T:refgcc -march=native -mtune=native -O3 -fwrapv -fPIC -fPIE -gdwarf-4 -Wall (10.2.1_20210110)
T:refgcc -march=native -mtune=native -O -fwrapv -fPIC -fPIE -gdwarf-4 -Wall (10.2.1_20210110)
T:refgcc -march=native -mtune=native -Os -fwrapv -fPIC -fPIE -gdwarf-4 -Wall (10.2.1_20210110)

Compiler output


try.c: /usr/bin/ld: libcrypto_aead_omdsha512k512n256tau256v1.a(omdsha512.o):.../supercop-data/rome0/amd64/try/c/clang_-march=native_-O2_-fwrapv_-Qunused-arguments_-fPIC_-fPIE_-gdwarf-4_-Wall/timingleaks/crypto_aead/omdsha512k512n256tau256v1/sse4/work/./omdsha512.h:146: multiple definition of `Hash'; libcrypto_aead_omdsha512k512n256tau256v1.a(encrypt.o):.../supercop-data/rome0/amd64/try/c/clang_-march=native_-O2_-fwrapv_-Qunused-arguments_-fPIC_-fPIE_-gdwarf-4_-Wall/timingleaks/crypto_aead/omdsha512k512n256tau256v1/sse4/work/./omdsha512.h:146: first defined here
try.c: clang: error: linker command failed with exit code 1 (use -v to see invocation)

Number of similar (implementation,compiler) pairs: 1, namely:
ImplementationCompiler
T:sse4clang -march=native -O2 -fwrapv -Qunused-arguments -fPIC -fPIE -gdwarf-4 -Wall (Debian_Clang_11.0.1)

Compiler output


try.c: /usr/bin/ld: libcrypto_aead_omdsha512k512n256tau256v1.a(omdsha512.o):.../supercop-data/rome0/amd64/try/c/clang_-march=native_-O3_-fwrapv_-Qunused-arguments_-fPIC_-fPIE_-gdwarf-4_-Wall/timingleaks/crypto_aead/omdsha512k512n256tau256v1/sse4/work/./omdsha512.h:146: multiple definition of `Hash'; libcrypto_aead_omdsha512k512n256tau256v1.a(encrypt.o):.../supercop-data/rome0/amd64/try/c/clang_-march=native_-O3_-fwrapv_-Qunused-arguments_-fPIC_-fPIE_-gdwarf-4_-Wall/timingleaks/crypto_aead/omdsha512k512n256tau256v1/sse4/work/./omdsha512.h:146: first defined here
try.c: clang: error: linker command failed with exit code 1 (use -v to see invocation)

Number of similar (implementation,compiler) pairs: 1, namely:
ImplementationCompiler
T:sse4clang -march=native -O3 -fwrapv -Qunused-arguments -fPIC -fPIE -gdwarf-4 -Wall (Debian_Clang_11.0.1)

Compiler output


try.c: /usr/bin/ld: libcrypto_aead_omdsha512k512n256tau256v1.a(omdsha512.o):.../supercop-data/rome0/amd64/try/c/clang_-march=native_-O_-fwrapv_-Qunused-arguments_-fPIC_-fPIE_-gdwarf-4_-Wall/timingleaks/crypto_aead/omdsha512k512n256tau256v1/sse4/work/./omdsha512.h:146: multiple definition of `Hash'; libcrypto_aead_omdsha512k512n256tau256v1.a(encrypt.o):.../supercop-data/rome0/amd64/try/c/clang_-march=native_-O_-fwrapv_-Qunused-arguments_-fPIC_-fPIE_-gdwarf-4_-Wall/timingleaks/crypto_aead/omdsha512k512n256tau256v1/sse4/work/./omdsha512.h:146: first defined here
try.c: clang: error: linker command failed with exit code 1 (use -v to see invocation)

Number of similar (implementation,compiler) pairs: 1, namely:
ImplementationCompiler
T:sse4clang -march=native -O -fwrapv -Qunused-arguments -fPIC -fPIE -gdwarf-4 -Wall (Debian_Clang_11.0.1)

Compiler output


try.c: /usr/bin/ld: libcrypto_aead_omdsha512k512n256tau256v1.a(omdsha512.o):.../supercop-data/rome0/amd64/try/c/clang_-march=native_-Os_-fwrapv_-Qunused-arguments_-fPIC_-fPIE_-gdwarf-4_-Wall/timingleaks/crypto_aead/omdsha512k512n256tau256v1/sse4/work/./omdsha512.h:146: multiple definition of `Hash'; libcrypto_aead_omdsha512k512n256tau256v1.a(encrypt.o):.../supercop-data/rome0/amd64/try/c/clang_-march=native_-Os_-fwrapv_-Qunused-arguments_-fPIC_-fPIE_-gdwarf-4_-Wall/timingleaks/crypto_aead/omdsha512k512n256tau256v1/sse4/work/./omdsha512.h:146: first defined here
try.c: clang: error: linker command failed with exit code 1 (use -v to see invocation)

Number of similar (implementation,compiler) pairs: 1, namely:
ImplementationCompiler
T:sse4clang -march=native -Os -fwrapv -Qunused-arguments -fPIC -fPIE -gdwarf-4 -Wall (Debian_Clang_11.0.1)

Compiler output


try.c: /usr/bin/ld: libcrypto_aead_omdsha512k512n256tau256v1.a(omdsha512.o):.../supercop-data/rome0/amd64/try/c/clang_-mcpu=native_-O3_-fwrapv_-Qunused-arguments_-fPIC_-fPIE_-gdwarf-4_-Wall/timingleaks/crypto_aead/omdsha512k512n256tau256v1/sse4/work/./omdsha512.h:146: multiple definition of `Hash'; libcrypto_aead_omdsha512k512n256tau256v1.a(encrypt.o):.../supercop-data/rome0/amd64/try/c/clang_-mcpu=native_-O3_-fwrapv_-Qunused-arguments_-fPIC_-fPIE_-gdwarf-4_-Wall/timingleaks/crypto_aead/omdsha512k512n256tau256v1/sse4/work/./omdsha512.h:146: first defined here
try.c: clang: error: linker command failed with exit code 1 (use -v to see invocation)

Number of similar (implementation,compiler) pairs: 1, namely:
ImplementationCompiler
T:sse4clang -mcpu=native -O3 -fwrapv -Qunused-arguments -fPIC -fPIE -gdwarf-4 -Wall (Debian_Clang_11.0.1)

Compiler output


encrypt.c: /tmp/cc2n2qlU.s: Assembler messages:
encrypt.c: /tmp/cc2n2qlU.s:9870: Error: can't resolve `.data' {.data section} - `.Ltext0' {.text section}
encrypt.c: /tmp/cc2n2qlU.s:9871: Error: can't resolve `.data' {.data section} - `.Ltext0' {.text section}
encrypt.c: /tmp/cc2n2qlU.s:9874: Error: can't resolve `.data' {.data section} - `.Ltext0' {.text section}
encrypt.c: /tmp/cc2n2qlU.s:9875: Error: can't resolve `.data' {.data section} - `.Ltext0' {.text section}
encrypt.c: /tmp/cc2n2qlU.s:9889: Error: can't resolve `.data' {.data section} - `.Ltext0' {.text section}
encrypt.c: /tmp/cc2n2qlU.s:9890: Error: can't resolve `.data' {.data section} - `.Ltext0' {.text section}
encrypt.c: /tmp/cc2n2qlU.s:9893: Error: can't resolve `.data' {.data section} - `.Ltext0' {.text section}
encrypt.c: /tmp/cc2n2qlU.s:9894: Error: can't resolve `.data' {.data section} - `.Ltext0' {.text section}
encrypt.c: /tmp/cc2n2qlU.s:9908: Error: can't resolve `.data' {.data section} - `.Ltext0' {.text section}
encrypt.c: /tmp/cc2n2qlU.s:9909: Error: can't resolve `.data' {.data section} - `.Ltext0' {.text section}
encrypt.c: /tmp/cc2n2qlU.s:9912: Error: can't resolve `.data' {.data section} - `.Ltext0' {.text section}
encrypt.c: /tmp/cc2n2qlU.s:9913: Error: can't resolve `.data' {.data section} - `.Ltext0' {.text section}
encrypt.c: /tmp/cc2n2qlU.s:9929: Error: can't resolve `.data' {.data section} - `.Ltext0' {.text section}
encrypt.c: /tmp/cc2n2qlU.s:9930: Error: can't resolve `.data' {.data section} - `.Ltext0' {.text section}
encrypt.c: /tmp/cc2n2qlU.s:9933: Error: can't resolve `.data' {.data section} - `.Ltext0' {.text section}
encrypt.c: /tmp/cc2n2qlU.s:9934: Error: can't resolve `.data' {.data section} - `.Ltext0' {.text section}
encrypt.c: /tmp/cc2n2qlU.s:9937: Error: can't resolve `.data' {.data section} - `.Ltext0' {.text section}
encrypt.c: /tmp/cc2n2qlU.s:9938: Error: can't resolve `.data' {.data section} - `.Ltext0' {.text section}
encrypt.c: /tmp/cc2n2qlU.s:9954: Error: can't resolve `.data' {.data section} - `.Ltext0' {.text section}
encrypt.c: /tmp/cc2n2qlU.s:9955: Error: can't resolve `.data' {.data section} - `.Ltext0' {.text section}
encrypt.c: /tmp/cc2n2qlU.s:9958: Error: can't resolve `.data' {.data section} - `.Ltext0' {.text section}
encrypt.c: /tmp/cc2n2qlU.s:9959: Error: can't resolve `.data' {.data section} - `.Ltext0' {.text section}
encrypt.c: /tmp/cc2n2qlU.s:9962: Error: can't resolve `.data' {.data section} - `.Ltext0' {.text section}
encrypt.c: /tmp/cc2n2qlU.s:9963: Error: can't resolve `.data' {.data section} - `.Ltext0' {.text section}
encrypt.c: ...

Number of similar (implementation,compiler) pairs: 1, namely:
ImplementationCompiler
T:sse4gcc -march=native -mtune=native -O2 -fwrapv -fPIC -fPIE -gdwarf-4 -Wall (10.2.1_20210110)

Compiler output


encrypt.c: /tmp/ccGOBl85.s: Assembler messages:
encrypt.c: /tmp/ccGOBl85.s:9870: Error: can't resolve `.data' {.data section} - `.Ltext0' {.text section}
encrypt.c: /tmp/ccGOBl85.s:9871: Error: can't resolve `.data' {.data section} - `.Ltext0' {.text section}
encrypt.c: /tmp/ccGOBl85.s:9874: Error: can't resolve `.data' {.data section} - `.Ltext0' {.text section}
encrypt.c: /tmp/ccGOBl85.s:9875: Error: can't resolve `.data' {.data section} - `.Ltext0' {.text section}
encrypt.c: /tmp/ccGOBl85.s:9889: Error: can't resolve `.data' {.data section} - `.Ltext0' {.text section}
encrypt.c: /tmp/ccGOBl85.s:9890: Error: can't resolve `.data' {.data section} - `.Ltext0' {.text section}
encrypt.c: /tmp/ccGOBl85.s:9893: Error: can't resolve `.data' {.data section} - `.Ltext0' {.text section}
encrypt.c: /tmp/ccGOBl85.s:9894: Error: can't resolve `.data' {.data section} - `.Ltext0' {.text section}
encrypt.c: /tmp/ccGOBl85.s:9908: Error: can't resolve `.data' {.data section} - `.Ltext0' {.text section}
encrypt.c: /tmp/ccGOBl85.s:9909: Error: can't resolve `.data' {.data section} - `.Ltext0' {.text section}
encrypt.c: /tmp/ccGOBl85.s:9912: Error: can't resolve `.data' {.data section} - `.Ltext0' {.text section}
encrypt.c: /tmp/ccGOBl85.s:9913: Error: can't resolve `.data' {.data section} - `.Ltext0' {.text section}
encrypt.c: /tmp/ccGOBl85.s:9929: Error: can't resolve `.data' {.data section} - `.Ltext0' {.text section}
encrypt.c: /tmp/ccGOBl85.s:9930: Error: can't resolve `.data' {.data section} - `.Ltext0' {.text section}
encrypt.c: /tmp/ccGOBl85.s:9933: Error: can't resolve `.data' {.data section} - `.Ltext0' {.text section}
encrypt.c: /tmp/ccGOBl85.s:9934: Error: can't resolve `.data' {.data section} - `.Ltext0' {.text section}
encrypt.c: /tmp/ccGOBl85.s:9937: Error: can't resolve `.data' {.data section} - `.Ltext0' {.text section}
encrypt.c: /tmp/ccGOBl85.s:9938: Error: can't resolve `.data' {.data section} - `.Ltext0' {.text section}
encrypt.c: /tmp/ccGOBl85.s:9954: Error: can't resolve `.data' {.data section} - `.Ltext0' {.text section}
encrypt.c: /tmp/ccGOBl85.s:9955: Error: can't resolve `.data' {.data section} - `.Ltext0' {.text section}
encrypt.c: /tmp/ccGOBl85.s:9958: Error: can't resolve `.data' {.data section} - `.Ltext0' {.text section}
encrypt.c: /tmp/ccGOBl85.s:9959: Error: can't resolve `.data' {.data section} - `.Ltext0' {.text section}
encrypt.c: /tmp/ccGOBl85.s:9962: Error: can't resolve `.data' {.data section} - `.Ltext0' {.text section}
encrypt.c: /tmp/ccGOBl85.s:9963: Error: can't resolve `.data' {.data section} - `.Ltext0' {.text section}
encrypt.c: ...

Number of similar (implementation,compiler) pairs: 1, namely:
ImplementationCompiler
T:sse4gcc -march=native -mtune=native -O3 -fwrapv -fPIC -fPIE -gdwarf-4 -Wall (10.2.1_20210110)

Compiler output


encrypt.c: /tmp/ccSHmATQ.s: Assembler messages:
encrypt.c: /tmp/ccSHmATQ.s:9884: Error: can't resolve `.data' {.data section} - `.Ltext0' {.text section}
encrypt.c: /tmp/ccSHmATQ.s:9885: Error: can't resolve `.data' {.data section} - `.Ltext0' {.text section}
encrypt.c: /tmp/ccSHmATQ.s:9888: Error: can't resolve `.data' {.data section} - `.Ltext0' {.text section}
encrypt.c: /tmp/ccSHmATQ.s:9889: Error: can't resolve `.data' {.data section} - `.Ltext0' {.text section}
encrypt.c: /tmp/ccSHmATQ.s:9903: Error: can't resolve `.data' {.data section} - `.Ltext0' {.text section}
encrypt.c: /tmp/ccSHmATQ.s:9904: Error: can't resolve `.data' {.data section} - `.Ltext0' {.text section}
encrypt.c: /tmp/ccSHmATQ.s:9907: Error: can't resolve `.data' {.data section} - `.Ltext0' {.text section}
encrypt.c: /tmp/ccSHmATQ.s:9908: Error: can't resolve `.data' {.data section} - `.Ltext0' {.text section}
encrypt.c: /tmp/ccSHmATQ.s:9922: Error: can't resolve `.data' {.data section} - `.Ltext0' {.text section}
encrypt.c: /tmp/ccSHmATQ.s:9923: Error: can't resolve `.data' {.data section} - `.Ltext0' {.text section}
encrypt.c: /tmp/ccSHmATQ.s:9926: Error: can't resolve `.data' {.data section} - `.Ltext0' {.text section}
encrypt.c: /tmp/ccSHmATQ.s:9927: Error: can't resolve `.data' {.data section} - `.Ltext0' {.text section}
encrypt.c: /tmp/ccSHmATQ.s:9943: Error: can't resolve `.data' {.data section} - `.Ltext0' {.text section}
encrypt.c: /tmp/ccSHmATQ.s:9944: Error: can't resolve `.data' {.data section} - `.Ltext0' {.text section}
encrypt.c: /tmp/ccSHmATQ.s:9947: Error: can't resolve `.data' {.data section} - `.Ltext0' {.text section}
encrypt.c: /tmp/ccSHmATQ.s:9948: Error: can't resolve `.data' {.data section} - `.Ltext0' {.text section}
encrypt.c: /tmp/ccSHmATQ.s:9951: Error: can't resolve `.data' {.data section} - `.Ltext0' {.text section}
encrypt.c: /tmp/ccSHmATQ.s:9952: Error: can't resolve `.data' {.data section} - `.Ltext0' {.text section}
encrypt.c: /tmp/ccSHmATQ.s:9968: Error: can't resolve `.data' {.data section} - `.Ltext0' {.text section}
encrypt.c: /tmp/ccSHmATQ.s:9969: Error: can't resolve `.data' {.data section} - `.Ltext0' {.text section}
encrypt.c: /tmp/ccSHmATQ.s:9972: Error: can't resolve `.data' {.data section} - `.Ltext0' {.text section}
encrypt.c: /tmp/ccSHmATQ.s:9973: Error: can't resolve `.data' {.data section} - `.Ltext0' {.text section}
encrypt.c: /tmp/ccSHmATQ.s:9976: Error: can't resolve `.data' {.data section} - `.Ltext0' {.text section}
encrypt.c: /tmp/ccSHmATQ.s:9977: Error: can't resolve `.data' {.data section} - `.Ltext0' {.text section}
encrypt.c: ...

Number of similar (implementation,compiler) pairs: 1, namely:
ImplementationCompiler
T:sse4gcc -march=native -mtune=native -O -fwrapv -fPIC -fPIE -gdwarf-4 -Wall (10.2.1_20210110)

Compiler output


encrypt.c: /tmp/cc4aqTo2.s: Assembler messages:
encrypt.c: /tmp/cc4aqTo2.s:9868: Error: can't resolve `.data' {.data section} - `.Ltext0' {.text section}
encrypt.c: /tmp/cc4aqTo2.s:9869: Error: can't resolve `.data' {.data section} - `.Ltext0' {.text section}
encrypt.c: /tmp/cc4aqTo2.s:9872: Error: can't resolve `.data' {.data section} - `.Ltext0' {.text section}
encrypt.c: /tmp/cc4aqTo2.s:9873: Error: can't resolve `.data' {.data section} - `.Ltext0' {.text section}
encrypt.c: /tmp/cc4aqTo2.s:9887: Error: can't resolve `.data' {.data section} - `.Ltext0' {.text section}
encrypt.c: /tmp/cc4aqTo2.s:9888: Error: can't resolve `.data' {.data section} - `.Ltext0' {.text section}
encrypt.c: /tmp/cc4aqTo2.s:9891: Error: can't resolve `.data' {.data section} - `.Ltext0' {.text section}
encrypt.c: /tmp/cc4aqTo2.s:9892: Error: can't resolve `.data' {.data section} - `.Ltext0' {.text section}
encrypt.c: /tmp/cc4aqTo2.s:9906: Error: can't resolve `.data' {.data section} - `.Ltext0' {.text section}
encrypt.c: /tmp/cc4aqTo2.s:9907: Error: can't resolve `.data' {.data section} - `.Ltext0' {.text section}
encrypt.c: /tmp/cc4aqTo2.s:9910: Error: can't resolve `.data' {.data section} - `.Ltext0' {.text section}
encrypt.c: /tmp/cc4aqTo2.s:9911: Error: can't resolve `.data' {.data section} - `.Ltext0' {.text section}
encrypt.c: /tmp/cc4aqTo2.s:9927: Error: can't resolve `.data' {.data section} - `.Ltext0' {.text section}
encrypt.c: /tmp/cc4aqTo2.s:9928: Error: can't resolve `.data' {.data section} - `.Ltext0' {.text section}
encrypt.c: /tmp/cc4aqTo2.s:9931: Error: can't resolve `.data' {.data section} - `.Ltext0' {.text section}
encrypt.c: /tmp/cc4aqTo2.s:9932: Error: can't resolve `.data' {.data section} - `.Ltext0' {.text section}
encrypt.c: /tmp/cc4aqTo2.s:9935: Error: can't resolve `.data' {.data section} - `.Ltext0' {.text section}
encrypt.c: /tmp/cc4aqTo2.s:9936: Error: can't resolve `.data' {.data section} - `.Ltext0' {.text section}
encrypt.c: /tmp/cc4aqTo2.s:9952: Error: can't resolve `.data' {.data section} - `.Ltext0' {.text section}
encrypt.c: /tmp/cc4aqTo2.s:9953: Error: can't resolve `.data' {.data section} - `.Ltext0' {.text section}
encrypt.c: /tmp/cc4aqTo2.s:9956: Error: can't resolve `.data' {.data section} - `.Ltext0' {.text section}
encrypt.c: /tmp/cc4aqTo2.s:9957: Error: can't resolve `.data' {.data section} - `.Ltext0' {.text section}
encrypt.c: /tmp/cc4aqTo2.s:9960: Error: can't resolve `.data' {.data section} - `.Ltext0' {.text section}
encrypt.c: /tmp/cc4aqTo2.s:9961: Error: can't resolve `.data' {.data section} - `.Ltext0' {.text section}
encrypt.c: ...

Number of similar (implementation,compiler) pairs: 1, namely:
ImplementationCompiler
T:sse4gcc -march=native -mtune=native -Os -fwrapv -fPIC -fPIE -gdwarf-4 -Wall (10.2.1_20210110)