Implementation notes: amd64, r24000, crypto_hash/luffa256

Computer: r24000
Architecture: amd64
CPU ID: GenuineIntel-000906ea-bfebfbff
SUPERCOP version: 20211108
Operation: crypto_hash
Primitive: luffa256
TimeObject sizeTest sizeImplementationCompilerBenchmark dateSUPERCOP version
1745310435 0 023717 804 1472T:sse2clang_-march=native_-O2_-fomit-frame-pointer_-fwrapv_-Qunused-arguments_-fPIC_-fPIE2021050720210423
1745910435 0 023717 804 1472T:sse2clang_-march=native_-O_-fomit-frame-pointer_-fwrapv_-Qunused-arguments_-fPIC_-fPIE2021050720210423
1747110483 0 023661 804 1472T:sse2clang_-march=native_-O3_-fomit-frame-pointer_-fwrapv_-Qunused-arguments_-fPIC_-fPIE2021050720210423
1761511407 0 023941 804 1440T:sse2clang_-mcpu=native_-O3_-fomit-frame-pointer_-fwrapv_-Qunused-arguments_-fPIC_-fPIE2021050720210423
1795410022 0 024376 804 1520T:sse2gcc_-march=native_-mtune=native_-O3_-fomit-frame-pointer_-fwrapv_-fPIC_-fPIE2021050720210423
179567907 0 018087 796 1440T:sse2clang_-march=native_-Os_-fomit-frame-pointer_-fwrapv_-Qunused-arguments_-fPIC_-fPIE2021050720210423
179749345 0 020959 796 1520T:sse2gcc_-march=native_-mtune=native_-O2_-fomit-frame-pointer_-fwrapv_-fPIC_-fPIE2021050720210423
182718690 0 019363 780 1488T:sse2gcc_-march=native_-mtune=native_-Os_-fomit-frame-pointer_-fwrapv_-fPIC_-fPIE2021050720210423
1932710041 0 021599 796 1520T:sse2gcc_-march=native_-mtune=native_-O_-fomit-frame-pointer_-fwrapv_-fPIC_-fPIE2021050720210423
2646228123 0 039888 804 952T:sphlibgcc_-march=native_-mtune=native_-O2_-fomit-frame-pointer_-fwrapv_-fPIC_-fPIE2021050720210423
2659528032 0 042488 804 952T:sphlibgcc_-march=native_-mtune=native_-O3_-fomit-frame-pointer_-fwrapv_-fPIC_-fPIE2021050720210423
2696227210 0 038936 804 952T:sphlibgcc_-march=native_-mtune=native_-O_-fomit-frame-pointer_-fwrapv_-fPIC_-fPIE2021050720210423
2891926736 0 037023 796 888T:sphlibclang_-march=native_-Os_-fomit-frame-pointer_-fwrapv_-Qunused-arguments_-fPIC_-fPIE2021050720210423
2951127091 0 040653 804 920T:sphlibclang_-march=native_-O2_-fomit-frame-pointer_-fwrapv_-Qunused-arguments_-fPIC_-fPIE2021050720210423
2962527091 0 040653 804 920T:sphlibclang_-march=native_-O_-fomit-frame-pointer_-fwrapv_-Qunused-arguments_-fPIC_-fPIE2021050720210423
2974627123 0 040573 804 920T:sphlibclang_-march=native_-O3_-fomit-frame-pointer_-fwrapv_-Qunused-arguments_-fPIC_-fPIE2021050720210423
298703341 0 9616029 804 984T:thomaz/basicclang_-mcpu=native_-O3_-fomit-frame-pointer_-fwrapv_-Qunused-arguments_-fPIC_-fPIE2021050720210423
3004423515 0 034275 780 920T:sphlibgcc_-march=native_-mtune=native_-Os_-fomit-frame-pointer_-fwrapv_-fPIC_-fPIE2021050720210423
3058719495 320 033944 1132 952T:opt32gcc_-march=native_-mtune=native_-O3_-fomit-frame-pointer_-fwrapv_-fPIC_-fPIE2021050720210423
3141019907 320 032525 1132 888T:opt32clang_-mcpu=native_-O3_-fomit-frame-pointer_-fwrapv_-Qunused-arguments_-fPIC_-fPIE2021050720210423
3225926469 0 039261 804 888T:sphlibclang_-mcpu=native_-O3_-fomit-frame-pointer_-fwrapv_-Qunused-arguments_-fPIC_-fPIE2021050720210423
3444911065 320 022751 1124 952T:opt32gcc_-march=native_-mtune=native_-O2_-fomit-frame-pointer_-fwrapv_-fPIC_-fPIE2021050720210423
353639699 320 020443 1108 920T:opt32gcc_-march=native_-mtune=native_-Os_-fomit-frame-pointer_-fwrapv_-fPIC_-fPIE2021050720210423
3715510990 320 022615 1124 952T:opt32gcc_-march=native_-mtune=native_-O_-fomit-frame-pointer_-fwrapv_-fPIC_-fPIE2021050720210423
599184076 0 9617405 804 1016T:thomaz/basicclang_-march=native_-O3_-fomit-frame-pointer_-fwrapv_-Qunused-arguments_-fPIC_-fPIE2021050720210423
599194076 0 9617533 804 1016T:thomaz/basicclang_-march=native_-O_-fomit-frame-pointer_-fwrapv_-Qunused-arguments_-fPIC_-fPIE2021050720210423
599224076 0 9617533 804 1016T:thomaz/basicclang_-march=native_-O2_-fomit-frame-pointer_-fwrapv_-Qunused-arguments_-fPIC_-fPIE2021050720210423
6110421748 320 034925 1132 920T:opt32clang_-march=native_-O_-fomit-frame-pointer_-fwrapv_-Qunused-arguments_-fPIC_-fPIE2021050720210423
6118221748 320 034925 1132 920T:opt32clang_-march=native_-O2_-fomit-frame-pointer_-fwrapv_-Qunused-arguments_-fPIC_-fPIE2021050720210423
6250623268 320 036061 1132 920T:opt32clang_-march=native_-O3_-fomit-frame-pointer_-fwrapv_-Qunused-arguments_-fPIC_-fPIE2021050720210423
6549412090 320 022063 1124 888T:opt32clang_-march=native_-Os_-fomit-frame-pointer_-fwrapv_-Qunused-arguments_-fPIC_-fPIE2021050720210423
804753072 0 9617424 804 1048T:thomaz/basicgcc_-march=native_-mtune=native_-O3_-fomit-frame-pointer_-fwrapv_-fPIC_-fPIE2021050720210423
823522445 0 9614055 796 1048T:thomaz/basicgcc_-march=native_-mtune=native_-O2_-fomit-frame-pointer_-fwrapv_-fPIC_-fPIE2021050720210423
1075411982 0 9612175 796 984T:thomaz/basicclang_-march=native_-Os_-fomit-frame-pointer_-fwrapv_-Qunused-arguments_-fPIC_-fPIE2021050720210423
1123402012 0 9613591 796 1048T:thomaz/basicgcc_-march=native_-mtune=native_-O_-fomit-frame-pointer_-fwrapv_-fPIC_-fPIE2021050720210423
1178671847 0 9612555 780 1016T:thomaz/basicgcc_-march=native_-mtune=native_-Os_-fomit-frame-pointer_-fwrapv_-fPIC_-fPIE2021050720210423

Compiler output

Implementation: T:sse2_x64asm
Security model: timingleaks
Compiler: clang -march=native -O2 -fomit-frame-pointer -fwrapv -Qunused-arguments -fPIC -fPIE
luffa_x64asm.s: luffa_x64asm.s:780:13: error: unknown token in expression
luffa_x64asm.s: movaps %xmm0, [IV ]
luffa_x64asm.s: ^
luffa_x64asm.s: luffa_x64asm.s:781:13: error: unknown token in expression
luffa_x64asm.s: movaps %xmm1, [IV+16]
luffa_x64asm.s: ^
luffa_x64asm.s: luffa_x64asm.s:782:13: error: unknown token in expression
luffa_x64asm.s: movaps %xmm2, [IV+32]
luffa_x64asm.s: ^
luffa_x64asm.s: luffa_x64asm.s:783:13: error: unknown token in expression
luffa_x64asm.s: movaps %xmm3, [IV+48]
luffa_x64asm.s: ^
luffa_x64asm.s: luffa_x64asm.s:784:13: error: unknown token in expression
luffa_x64asm.s: movaps %xmm4, [IV+64]
luffa_x64asm.s: ^
luffa_x64asm.s: luffa_x64asm.s:785:13: error: unknown token in expression
luffa_x64asm.s: movaps %xmm5, [IV+80]
luffa_x64asm.s: ^
luffa_x64asm.s: luffa_x64asm.s:786:14: error: unknown token in expression
luffa_x64asm.s: movups [%rdi ], %xmm0
luffa_x64asm.s: ^
luffa_x64asm.s: luffa_x64asm.s:787:14: error: unknown token in expression
luffa_x64asm.s: movups [%rdi+16], %xmm1
luffa_x64asm.s: ^
luffa_x64asm.s: luffa_x64asm.s:788:14: error: unknown token in expression
luffa_x64asm.s: ...

Number of similar (compiler,implementation) pairs: 10, namely:
CompilerImplementations
clang -march=native -O2 -fomit-frame-pointer -fwrapv -Qunused-arguments -fPIC -fPIE T:sse2_x64asm
clang -march=native -O3 -fomit-frame-pointer -fwrapv -Qunused-arguments -fPIC -fPIE T:sse2_x64asm
clang -march=native -O -fomit-frame-pointer -fwrapv -Qunused-arguments -fPIC -fPIE T:sse2_x64asm
clang -march=native -Os -fomit-frame-pointer -fwrapv -Qunused-arguments -fPIC -fPIE T:sse2_x64asm
clang -mcpu=native -O3 -fomit-frame-pointer -fwrapv -Qunused-arguments -fPIC -fPIE T:sse2_x64asm
clang -march=native -O2 -fomit-frame-pointer -fwrapv -Qunused-arguments -fPIC -fPIE T:ssse3_x64asm
clang -march=native -O3 -fomit-frame-pointer -fwrapv -Qunused-arguments -fPIC -fPIE T:ssse3_x64asm
clang -march=native -O -fomit-frame-pointer -fwrapv -Qunused-arguments -fPIC -fPIE T:ssse3_x64asm
clang -march=native -Os -fomit-frame-pointer -fwrapv -Qunused-arguments -fPIC -fPIE T:ssse3_x64asm
clang -mcpu=native -O3 -fomit-frame-pointer -fwrapv -Qunused-arguments -fPIC -fPIE T:ssse3_x64asm

Compiler output

Implementation: T:sse2_x64asm
Security model: timingleaks
Compiler: gcc -march=native -mtune=native -O2 -fomit-frame-pointer -fwrapv -fPIC -fPIE
try.c: /usr/bin/ld: libcrypto_hash_luffa256.a(luffa_x64asm.o): relocation R_X86_64_32S against symbol `IV' can not be used when making a PIE object; recompile with -fPIE
try.c: collect2: error: ld returned 1 exit status

Number of similar (compiler,implementation) pairs: 16, namely:
CompilerImplementations
gcc -march=native -mtune=native -O2 -fomit-frame-pointer -fwrapv -fPIC -fPIE T:sse2_x64asm
gcc -march=native -mtune=native -O3 -fomit-frame-pointer -fwrapv -fPIC -fPIE T:sse2_x64asm
gcc -march=native -mtune=native -O -fomit-frame-pointer -fwrapv -fPIC -fPIE T:sse2_x64asm
gcc -march=native -mtune=native -Os -fomit-frame-pointer -fwrapv -fPIC -fPIE T:sse2_x64asm
gcc -march=native -mtune=native -O2 -fomit-frame-pointer -fwrapv -fPIC -fPIE T:sse2_x64asm-2
gcc -march=native -mtune=native -O3 -fomit-frame-pointer -fwrapv -fPIC -fPIE T:sse2_x64asm-2
gcc -march=native -mtune=native -O -fomit-frame-pointer -fwrapv -fPIC -fPIE T:sse2_x64asm-2
gcc -march=native -mtune=native -Os -fomit-frame-pointer -fwrapv -fPIC -fPIE T:sse2_x64asm-2
gcc -march=native -mtune=native -O2 -fomit-frame-pointer -fwrapv -fPIC -fPIE T:ssse3_x64asm
gcc -march=native -mtune=native -O3 -fomit-frame-pointer -fwrapv -fPIC -fPIE T:ssse3_x64asm
gcc -march=native -mtune=native -O -fomit-frame-pointer -fwrapv -fPIC -fPIE T:ssse3_x64asm
gcc -march=native -mtune=native -Os -fomit-frame-pointer -fwrapv -fPIC -fPIE T:ssse3_x64asm
gcc -march=native -mtune=native -O2 -fomit-frame-pointer -fwrapv -fPIC -fPIE T:ssse3_x64asm-2
gcc -march=native -mtune=native -O3 -fomit-frame-pointer -fwrapv -fPIC -fPIE T:ssse3_x64asm-2
gcc -march=native -mtune=native -O -fomit-frame-pointer -fwrapv -fPIC -fPIE T:ssse3_x64asm-2
gcc -march=native -mtune=native -Os -fomit-frame-pointer -fwrapv -fPIC -fPIE T:ssse3_x64asm-2

Compiler output

Implementation: T:sse2_x64asm-2
Security model: timingleaks
Compiler: clang -march=native -O2 -fomit-frame-pointer -fwrapv -Qunused-arguments -fPIC -fPIE
luffa_x64asm.s: luffa_x64asm.s:780:13: error: unknown token in expression
luffa_x64asm.s: movdqa %xmm0, [IV ]
luffa_x64asm.s: ^
luffa_x64asm.s: luffa_x64asm.s:781:13: error: unknown token in expression
luffa_x64asm.s: movdqa %xmm1, [IV+16]
luffa_x64asm.s: ^
luffa_x64asm.s: luffa_x64asm.s:782:13: error: unknown token in expression
luffa_x64asm.s: movdqa %xmm2, [IV+32]
luffa_x64asm.s: ^
luffa_x64asm.s: luffa_x64asm.s:783:13: error: unknown token in expression
luffa_x64asm.s: movdqa %xmm3, [IV+48]
luffa_x64asm.s: ^
luffa_x64asm.s: luffa_x64asm.s:784:13: error: unknown token in expression
luffa_x64asm.s: movdqa %xmm4, [IV+64]
luffa_x64asm.s: ^
luffa_x64asm.s: luffa_x64asm.s:785:13: error: unknown token in expression
luffa_x64asm.s: movdqa %xmm5, [IV+80]
luffa_x64asm.s: ^
luffa_x64asm.s: luffa_x64asm.s:786:14: error: unknown token in expression
luffa_x64asm.s: movups [%rdi ], %xmm0
luffa_x64asm.s: ^
luffa_x64asm.s: luffa_x64asm.s:787:14: error: unknown token in expression
luffa_x64asm.s: movups [%rdi+16], %xmm1
luffa_x64asm.s: ^
luffa_x64asm.s: luffa_x64asm.s:788:14: error: unknown token in expression
luffa_x64asm.s: ...

Number of similar (compiler,implementation) pairs: 10, namely:
CompilerImplementations
clang -march=native -O2 -fomit-frame-pointer -fwrapv -Qunused-arguments -fPIC -fPIE T:sse2_x64asm-2
clang -march=native -O3 -fomit-frame-pointer -fwrapv -Qunused-arguments -fPIC -fPIE T:sse2_x64asm-2
clang -march=native -O -fomit-frame-pointer -fwrapv -Qunused-arguments -fPIC -fPIE T:sse2_x64asm-2
clang -march=native -Os -fomit-frame-pointer -fwrapv -Qunused-arguments -fPIC -fPIE T:sse2_x64asm-2
clang -mcpu=native -O3 -fomit-frame-pointer -fwrapv -Qunused-arguments -fPIC -fPIE T:sse2_x64asm-2
clang -march=native -O2 -fomit-frame-pointer -fwrapv -Qunused-arguments -fPIC -fPIE T:ssse3_x64asm-2
clang -march=native -O3 -fomit-frame-pointer -fwrapv -Qunused-arguments -fPIC -fPIE T:ssse3_x64asm-2
clang -march=native -O -fomit-frame-pointer -fwrapv -Qunused-arguments -fPIC -fPIE T:ssse3_x64asm-2
clang -march=native -Os -fomit-frame-pointer -fwrapv -Qunused-arguments -fPIC -fPIE T:ssse3_x64asm-2
clang -mcpu=native -O3 -fomit-frame-pointer -fwrapv -Qunused-arguments -fPIC -fPIE T:ssse3_x64asm-2

Compiler output

Implementation: T:ssse3_x64asm-PS
Security model: timingleaks
Compiler: clang -march=native -O2 -fomit-frame-pointer -fwrapv -Qunused-arguments -fPIC -fPIE
luffa256_x64asm.s: luffa256_x64asm.s:297:9: error: unknown token in expression
luffa256_x64asm.s: movaps %xmm0, [IV ]
luffa256_x64asm.s: ^
luffa256_x64asm.s: luffa256_x64asm.s:298:9: error: unknown token in expression
luffa256_x64asm.s: movaps %xmm1, [IV+16]
luffa256_x64asm.s: ^
luffa256_x64asm.s: luffa256_x64asm.s:299:9: error: unknown token in expression
luffa256_x64asm.s: movaps %xmm2, [IV+32]
luffa256_x64asm.s: ^
luffa256_x64asm.s: luffa256_x64asm.s:300:9: error: unknown token in expression
luffa256_x64asm.s: movaps %xmm3, [IV+48]
luffa256_x64asm.s: ^
luffa256_x64asm.s: luffa256_x64asm.s:301:9: error: unknown token in expression
luffa256_x64asm.s: movaps %xmm4, [IV+64]
luffa256_x64asm.s: ^
luffa256_x64asm.s: luffa256_x64asm.s:302:9: error: unknown token in expression
luffa256_x64asm.s: movaps %xmm5, [IV+80]
luffa256_x64asm.s: ^
luffa256_x64asm.s: luffa256_x64asm.s:303:10: error: unknown token in expression
luffa256_x64asm.s: movups [%rdi ], %xmm0
luffa256_x64asm.s: ^
luffa256_x64asm.s: luffa256_x64asm.s:304:10: error: unknown token in expression
luffa256_x64asm.s: movups [%rdi+16], %xmm1
luffa256_x64asm.s: ^
luffa256_x64asm.s: luffa256_x64asm.s:305:10: error: unknown token in expression
luffa256_x64asm.s: ...

Number of similar (compiler,implementation) pairs: 5, namely:
CompilerImplementations
clang -march=native -O2 -fomit-frame-pointer -fwrapv -Qunused-arguments -fPIC -fPIE T:ssse3_x64asm-PS
clang -march=native -O3 -fomit-frame-pointer -fwrapv -Qunused-arguments -fPIC -fPIE T:ssse3_x64asm-PS
clang -march=native -O -fomit-frame-pointer -fwrapv -Qunused-arguments -fPIC -fPIE T:ssse3_x64asm-PS
clang -march=native -Os -fomit-frame-pointer -fwrapv -Qunused-arguments -fPIC -fPIE T:ssse3_x64asm-PS
clang -mcpu=native -O3 -fomit-frame-pointer -fwrapv -Qunused-arguments -fPIC -fPIE T:ssse3_x64asm-PS

Compiler output

Implementation: T:ssse3_x64asm-PS
Security model: timingleaks
Compiler: gcc -march=native -mtune=native -O2 -fomit-frame-pointer -fwrapv -fPIC -fPIE
try.c: /usr/bin/ld: libcrypto_hash_luffa256.a(luffa256_x64asm.o): relocation R_X86_64_32S against `.rodata' can not be used when making a PIE object; recompile with -fPIE
try.c: /usr/bin/ld: libcrypto_hash_luffa256.a(luffa384_x64asm.o): relocation R_X86_64_32S against `.rodata' can not be used when making a PIE object; recompile with -fPIE
try.c: /usr/bin/ld: libcrypto_hash_luffa256.a(luffa512_x64asm.o): relocation R_X86_64_32S against `.rodata' can not be used when making a PIE object; recompile with -fPIE
try.c: collect2: error: ld returned 1 exit status

Number of similar (compiler,implementation) pairs: 8, namely:
CompilerImplementations
gcc -march=native -mtune=native -O2 -fomit-frame-pointer -fwrapv -fPIC -fPIE T:ssse3_x64asm-PS
gcc -march=native -mtune=native -O3 -fomit-frame-pointer -fwrapv -fPIC -fPIE T:ssse3_x64asm-PS
gcc -march=native -mtune=native -O -fomit-frame-pointer -fwrapv -fPIC -fPIE T:ssse3_x64asm-PS
gcc -march=native -mtune=native -Os -fomit-frame-pointer -fwrapv -fPIC -fPIE T:ssse3_x64asm-PS
gcc -march=native -mtune=native -O2 -fomit-frame-pointer -fwrapv -fPIC -fPIE T:ssse3_x64asm-PS-2
gcc -march=native -mtune=native -O3 -fomit-frame-pointer -fwrapv -fPIC -fPIE T:ssse3_x64asm-PS-2
gcc -march=native -mtune=native -O -fomit-frame-pointer -fwrapv -fPIC -fPIE T:ssse3_x64asm-PS-2
gcc -march=native -mtune=native -Os -fomit-frame-pointer -fwrapv -fPIC -fPIE T:ssse3_x64asm-PS-2

Compiler output

Implementation: T:ssse3_x64asm-PS-2
Security model: timingleaks
Compiler: clang -march=native -O2 -fomit-frame-pointer -fwrapv -Qunused-arguments -fPIC -fPIE
luffa256_x64asm.s: luffa256_x64asm.s:297:9: error: unknown token in expression
luffa256_x64asm.s: movdqa %xmm0, [IV ]
luffa256_x64asm.s: ^
luffa256_x64asm.s: luffa256_x64asm.s:298:9: error: unknown token in expression
luffa256_x64asm.s: movdqa %xmm1, [IV+16]
luffa256_x64asm.s: ^
luffa256_x64asm.s: luffa256_x64asm.s:299:9: error: unknown token in expression
luffa256_x64asm.s: movdqa %xmm2, [IV+32]
luffa256_x64asm.s: ^
luffa256_x64asm.s: luffa256_x64asm.s:300:9: error: unknown token in expression
luffa256_x64asm.s: movdqa %xmm3, [IV+48]
luffa256_x64asm.s: ^
luffa256_x64asm.s: luffa256_x64asm.s:301:9: error: unknown token in expression
luffa256_x64asm.s: movdqa %xmm4, [IV+64]
luffa256_x64asm.s: ^
luffa256_x64asm.s: luffa256_x64asm.s:302:9: error: unknown token in expression
luffa256_x64asm.s: movdqa %xmm5, [IV+80]
luffa256_x64asm.s: ^
luffa256_x64asm.s: luffa256_x64asm.s:303:10: error: unknown token in expression
luffa256_x64asm.s: movdqu [%rdi ], %xmm0
luffa256_x64asm.s: ^
luffa256_x64asm.s: luffa256_x64asm.s:304:10: error: unknown token in expression
luffa256_x64asm.s: movdqu [%rdi+16], %xmm1
luffa256_x64asm.s: ^
luffa256_x64asm.s: luffa256_x64asm.s:305:10: error: unknown token in expression
luffa256_x64asm.s: ...

Number of similar (compiler,implementation) pairs: 5, namely:
CompilerImplementations
clang -march=native -O2 -fomit-frame-pointer -fwrapv -Qunused-arguments -fPIC -fPIE T:ssse3_x64asm-PS-2
clang -march=native -O3 -fomit-frame-pointer -fwrapv -Qunused-arguments -fPIC -fPIE T:ssse3_x64asm-PS-2
clang -march=native -O -fomit-frame-pointer -fwrapv -Qunused-arguments -fPIC -fPIE T:ssse3_x64asm-PS-2
clang -march=native -Os -fomit-frame-pointer -fwrapv -Qunused-arguments -fPIC -fPIE T:ssse3_x64asm-PS-2
clang -mcpu=native -O3 -fomit-frame-pointer -fwrapv -Qunused-arguments -fPIC -fPIE T:ssse3_x64asm-PS-2

Compiler output

Implementation: T:thomaz/asm-PS
Security model: timingleaks
Compiler: clang -march=native -O2 -fomit-frame-pointer -fwrapv -Qunused-arguments -fPIC -fPIE
hash.c: hash.c:32:12: warning: passing 'const unsigned char *' to parameter of type 'unsigned char *' discards qualifiers [-Wincompatible-pointer-types-discards-qualifiers]
hash.c: fLuffa256(in, out, inlen);
hash.c: ^~
hash.c: hash.c:29:31: note: passing argument to parameter 'input' here
hash.c: void fLuffa256(unsigned char *input, unsigned char *output, int len);
hash.c: ^
hash.c: 1 warning generated.
luffa_256.s: <instantiation>:1:8: error: unknown token in expression
luffa_256.s: pshufb %xmm6, %xmm12
luffa_256.s: ^
luffa_256.s: <instantiation>:1:1: note: while in macro instantiation
luffa_256.s: mPSSTEPI %xmm6, %xmm7, %xmm12
luffa_256.s: ^
luffa_256.s: luffa_256.s:232:2: note: while in macro instantiation
luffa_256.s: mPS %xmm6, %xmm7, %xmm8, %xmm9, %xmm10, %xmm11
luffa_256.s: ^
luffa_256.s: <instantiation>:2:9: error: unknown token in expression
luffa_256.s: pshufb %xmm7, %xmm12
luffa_256.s: ^
luffa_256.s: <instantiation>:1:1: note: while in macro instantiation
luffa_256.s: mPSSTEPI %xmm6, %xmm7, %xmm12
luffa_256.s: ^
luffa_256.s: luffa_256.s:232:2: note: while in macro instantiation
luffa_256.s: mPS %xmm6, %xmm7, %xmm8, %xmm9, %xmm10, %xmm11
luffa_256.s: ^
luffa_256.s: <instantiation>:1:8: error: unknown token in expression
luffa_256.s: movaps %xmm8, %xmm6
luffa_256.s: ^
luffa_256.s: <instantiation>:2:2: note: while in macro instantiation
luffa_256.s: mPSSTEPII %xmm6, %xmm7, %xmm8, %xmm9, %xmm10, %xmm11
luffa_256.s: ^
luffa_256.s: luffa_256.s:232:2: note: while in macro instantiation
luffa_256.s: ...

Number of similar (compiler,implementation) pairs: 10, namely:
CompilerImplementations
clang -march=native -O2 -fomit-frame-pointer -fwrapv -Qunused-arguments -fPIC -fPIE T:thomaz/asm-PS
clang -march=native -O3 -fomit-frame-pointer -fwrapv -Qunused-arguments -fPIC -fPIE T:thomaz/asm-PS
clang -march=native -O -fomit-frame-pointer -fwrapv -Qunused-arguments -fPIC -fPIE T:thomaz/asm-PS
clang -march=native -Os -fomit-frame-pointer -fwrapv -Qunused-arguments -fPIC -fPIE T:thomaz/asm-PS
clang -mcpu=native -O3 -fomit-frame-pointer -fwrapv -Qunused-arguments -fPIC -fPIE T:thomaz/asm-PS
clang -march=native -O2 -fomit-frame-pointer -fwrapv -Qunused-arguments -fPIC -fPIE T:thomaz/asm-PS-v2-FP
clang -march=native -O3 -fomit-frame-pointer -fwrapv -Qunused-arguments -fPIC -fPIE T:thomaz/asm-PS-v2-FP
clang -march=native -O -fomit-frame-pointer -fwrapv -Qunused-arguments -fPIC -fPIE T:thomaz/asm-PS-v2-FP
clang -march=native -Os -fomit-frame-pointer -fwrapv -Qunused-arguments -fPIC -fPIE T:thomaz/asm-PS-v2-FP
clang -mcpu=native -O3 -fomit-frame-pointer -fwrapv -Qunused-arguments -fPIC -fPIE T:thomaz/asm-PS-v2-FP

Compiler output

Implementation: T:thomaz/asm-PS
Security model: timingleaks
Compiler: gcc -march=native -mtune=native -O2 -fomit-frame-pointer -fwrapv -fPIC -fPIE
hash.c: hash.c: In function 'crypto_hash_luffa256_thomaz_asm_PS_timingleaks':
hash.c: hash.c:32:12: warning: passing argument 1 of 'fLuffa256' discards 'const' qualifier from pointer target type [-Wdiscarded-qualifiers]
hash.c: 32 | fLuffa256(in, out, inlen);
hash.c: | ^~
hash.c: hash.c:29:31: note: expected 'unsigned char *' but argument is of type 'const unsigned char *'
hash.c: 29 | void fLuffa256(unsigned char *input, unsigned char *output, int len);
hash.c: | ~~~~~~~~~~~~~~~^~~~~
try.c: /usr/bin/ld: libcrypto_hash_luffa256.a(luffa_256.o): relocation R_X86_64_32S against `.rodata' can not be used when making a PIE object; recompile with -fPIE
try.c: collect2: error: ld returned 1 exit status

Number of similar (compiler,implementation) pairs: 4, namely:
CompilerImplementations
gcc -march=native -mtune=native -O2 -fomit-frame-pointer -fwrapv -fPIC -fPIE T:thomaz/asm-PS
gcc -march=native -mtune=native -O3 -fomit-frame-pointer -fwrapv -fPIC -fPIE T:thomaz/asm-PS
gcc -march=native -mtune=native -O -fomit-frame-pointer -fwrapv -fPIC -fPIE T:thomaz/asm-PS
gcc -march=native -mtune=native -Os -fomit-frame-pointer -fwrapv -fPIC -fPIE T:thomaz/asm-PS

Compiler output

Implementation: T:thomaz/asm-PS-v2-FP
Security model: timingleaks
Compiler: gcc -march=native -mtune=native -O2 -fomit-frame-pointer -fwrapv -fPIC -fPIE
hash.c: hash.c: In function 'crypto_hash_luffa256_thomaz_asm_PS_v2_FP_timingleaks':
hash.c: hash.c:32:12: warning: passing argument 1 of 'fLuffa256' discards 'const' qualifier from pointer target type [-Wdiscarded-qualifiers]
hash.c: 32 | fLuffa256(in, out, inlen);
hash.c: | ^~
hash.c: hash.c:29:31: note: expected 'unsigned char *' but argument is of type 'const unsigned char *'
hash.c: 29 | void fLuffa256(unsigned char *input, unsigned char *output, int len);
hash.c: | ~~~~~~~~~~~~~~~^~~~~
try.c: /usr/bin/ld: libcrypto_hash_luffa256.a(luffa_256.o): relocation R_X86_64_32S against `.rodata' can not be used when making a PIE object; recompile with -fPIE
try.c: collect2: error: ld returned 1 exit status

Number of similar (compiler,implementation) pairs: 4, namely:
CompilerImplementations
gcc -march=native -mtune=native -O2 -fomit-frame-pointer -fwrapv -fPIC -fPIE T:thomaz/asm-PS-v2-FP
gcc -march=native -mtune=native -O3 -fomit-frame-pointer -fwrapv -fPIC -fPIE T:thomaz/asm-PS-v2-FP
gcc -march=native -mtune=native -O -fomit-frame-pointer -fwrapv -fPIC -fPIE T:thomaz/asm-PS-v2-FP
gcc -march=native -mtune=native -Os -fomit-frame-pointer -fwrapv -fPIC -fPIE T:thomaz/asm-PS-v2-FP

Compiler output

Implementation: T:thomaz/asm-PS-v2-INT
Security model: timingleaks
Compiler: clang -march=native -O2 -fomit-frame-pointer -fwrapv -Qunused-arguments -fPIC -fPIE
hash.c: hash.c:32:12: warning: passing 'const unsigned char *' to parameter of type 'unsigned char *' discards qualifiers [-Wincompatible-pointer-types-discards-qualifiers]
hash.c: fLuffa256(in, out, inlen);
hash.c: ^~
hash.c: hash.c:29:31: note: passing argument to parameter 'input' here
hash.c: void fLuffa256(unsigned char *input, unsigned char *output, int len);
hash.c: ^
hash.c: 1 warning generated.
luffa_256.s: <instantiation>:1:8: error: unknown token in expression
luffa_256.s: pshufb %xmm6, %xmm12
luffa_256.s: ^
luffa_256.s: <instantiation>:1:1: note: while in macro instantiation
luffa_256.s: mPSSTEPI %xmm6, %xmm7, %xmm12
luffa_256.s: ^
luffa_256.s: luffa_256.s:232:2: note: while in macro instantiation
luffa_256.s: mPS %xmm6, %xmm7, %xmm8, %xmm9, %xmm10, %xmm11
luffa_256.s: ^
luffa_256.s: <instantiation>:2:9: error: unknown token in expression
luffa_256.s: pshufb %xmm7, %xmm12
luffa_256.s: ^
luffa_256.s: <instantiation>:1:1: note: while in macro instantiation
luffa_256.s: mPSSTEPI %xmm6, %xmm7, %xmm12
luffa_256.s: ^
luffa_256.s: luffa_256.s:232:2: note: while in macro instantiation
luffa_256.s: mPS %xmm6, %xmm7, %xmm8, %xmm9, %xmm10, %xmm11
luffa_256.s: ^
luffa_256.s: <instantiation>:1:8: error: unknown token in expression
luffa_256.s: movdqa %xmm8, %xmm6
luffa_256.s: ^
luffa_256.s: <instantiation>:2:2: note: while in macro instantiation
luffa_256.s: mPSSTEPII %xmm6, %xmm7, %xmm8, %xmm9, %xmm10, %xmm11
luffa_256.s: ^
luffa_256.s: luffa_256.s:232:2: note: while in macro instantiation
luffa_256.s: ...

Number of similar (compiler,implementation) pairs: 5, namely:
CompilerImplementations
clang -march=native -O2 -fomit-frame-pointer -fwrapv -Qunused-arguments -fPIC -fPIE T:thomaz/asm-PS-v2-INT
clang -march=native -O3 -fomit-frame-pointer -fwrapv -Qunused-arguments -fPIC -fPIE T:thomaz/asm-PS-v2-INT
clang -march=native -O -fomit-frame-pointer -fwrapv -Qunused-arguments -fPIC -fPIE T:thomaz/asm-PS-v2-INT
clang -march=native -Os -fomit-frame-pointer -fwrapv -Qunused-arguments -fPIC -fPIE T:thomaz/asm-PS-v2-INT
clang -mcpu=native -O3 -fomit-frame-pointer -fwrapv -Qunused-arguments -fPIC -fPIE T:thomaz/asm-PS-v2-INT

Compiler output

Implementation: T:thomaz/asm-PS-v2-INT
Security model: timingleaks
Compiler: gcc -march=native -mtune=native -O2 -fomit-frame-pointer -fwrapv -fPIC -fPIE
hash.c: hash.c: In function 'crypto_hash_luffa256_thomaz_asm_PS_v2_INT_timingleaks':
hash.c: hash.c:32:12: warning: passing argument 1 of 'fLuffa256' discards 'const' qualifier from pointer target type [-Wdiscarded-qualifiers]
hash.c: 32 | fLuffa256(in, out, inlen);
hash.c: | ^~
hash.c: hash.c:29:31: note: expected 'unsigned char *' but argument is of type 'const unsigned char *'
hash.c: 29 | void fLuffa256(unsigned char *input, unsigned char *output, int len);
hash.c: | ~~~~~~~~~~~~~~~^~~~~
try.c: /usr/bin/ld: libcrypto_hash_luffa256.a(luffa_256.o): relocation R_X86_64_32S against `.rodata' can not be used when making a PIE object; recompile with -fPIE
try.c: collect2: error: ld returned 1 exit status

Number of similar (compiler,implementation) pairs: 4, namely:
CompilerImplementations
gcc -march=native -mtune=native -O2 -fomit-frame-pointer -fwrapv -fPIC -fPIE T:thomaz/asm-PS-v2-INT
gcc -march=native -mtune=native -O3 -fomit-frame-pointer -fwrapv -fPIC -fPIE T:thomaz/asm-PS-v2-INT
gcc -march=native -mtune=native -O -fomit-frame-pointer -fwrapv -fPIC -fPIE T:thomaz/asm-PS-v2-INT
gcc -march=native -mtune=native -Os -fomit-frame-pointer -fwrapv -fPIC -fPIE T:thomaz/asm-PS-v2-INT

Compiler output

Implementation: T:thomaz/asm-PSPar-v2-FP
Security model: timingleaks
Compiler: clang -march=native -O2 -fomit-frame-pointer -fwrapv -Qunused-arguments -fPIC -fPIE
hash.c: hash.c:32:12: warning: passing 'const unsigned char *' to parameter of type 'unsigned char *' discards qualifiers [-Wincompatible-pointer-types-discards-qualifiers]
hash.c: fLuffa256(in, out, inlen);
hash.c: ^~
hash.c: hash.c:29:31: note: passing argument to parameter 'input' here
hash.c: void fLuffa256(unsigned char *input, unsigned char *output, int len);
hash.c: ^
hash.c: 1 warning generated.
luffa256.s: <instantiation>:1:8: error: unknown token in expression
luffa256.s: pshufb %xmm6, maskShufLittleEndian
luffa256.s: ^
luffa256.s: <instantiation>:1:1: note: while in macro instantiation
luffa256.s: mPSSTEPI %xmm6, %xmm7, maskShufLittleEndian
luffa256.s: ^
luffa256.s: luffa256.s:445:2: note: while in macro instantiation
luffa256.s: mPS %xmm6, %xmm7, %xmm8, %xmm9, %xmm10, %xmm11
luffa256.s: ^
luffa256.s: <instantiation>:2:9: error: unknown token in expression
luffa256.s: pshufb %xmm7, maskShufLittleEndian
luffa256.s: ^
luffa256.s: <instantiation>:1:1: note: while in macro instantiation
luffa256.s: mPSSTEPI %xmm6, %xmm7, maskShufLittleEndian
luffa256.s: ^
luffa256.s: luffa256.s:445:2: note: while in macro instantiation
luffa256.s: mPS %xmm6, %xmm7, %xmm8, %xmm9, %xmm10, %xmm11
luffa256.s: ^
luffa256.s: <instantiation>:1:8: error: unknown token in expression
luffa256.s: movaps %xmm8, %xmm6
luffa256.s: ^
luffa256.s: <instantiation>:2:2: note: while in macro instantiation
luffa256.s: mPSSTEPII %xmm6, %xmm7, %xmm8, %xmm9, %xmm10, %xmm11
luffa256.s: ^
luffa256.s: luffa256.s:445:2: note: while in macro instantiation
luffa256.s: ...

Number of similar (compiler,implementation) pairs: 5, namely:
CompilerImplementations
clang -march=native -O2 -fomit-frame-pointer -fwrapv -Qunused-arguments -fPIC -fPIE T:thomaz/asm-PSPar-v2-FP
clang -march=native -O3 -fomit-frame-pointer -fwrapv -Qunused-arguments -fPIC -fPIE T:thomaz/asm-PSPar-v2-FP
clang -march=native -O -fomit-frame-pointer -fwrapv -Qunused-arguments -fPIC -fPIE T:thomaz/asm-PSPar-v2-FP
clang -march=native -Os -fomit-frame-pointer -fwrapv -Qunused-arguments -fPIC -fPIE T:thomaz/asm-PSPar-v2-FP
clang -mcpu=native -O3 -fomit-frame-pointer -fwrapv -Qunused-arguments -fPIC -fPIE T:thomaz/asm-PSPar-v2-FP

Compiler output

Implementation: T:thomaz/asm-PSPar-v2-FP
Security model: timingleaks
Compiler: gcc -march=native -mtune=native -O2 -fomit-frame-pointer -fwrapv -fPIC -fPIE
hash.c: hash.c: In function 'crypto_hash_luffa256_thomaz_asm_PSPar_v2_FP_timingleaks':
hash.c: hash.c:32:12: warning: passing argument 1 of 'fLuffa256' discards 'const' qualifier from pointer target type [-Wdiscarded-qualifiers]
hash.c: 32 | fLuffa256(in, out, inlen);
hash.c: | ^~
hash.c: hash.c:29:31: note: expected 'unsigned char *' but argument is of type 'const unsigned char *'
hash.c: 29 | void fLuffa256(unsigned char *input, unsigned char *output, int len);
hash.c: | ~~~~~~~~~~~~~~~^~~~~
try.c: /usr/bin/ld: libcrypto_hash_luffa256.a(luffa256.o): relocation R_X86_64_32S against `.rodata' can not be used when making a PIE object; recompile with -fPIE
try.c: collect2: error: ld returned 1 exit status

Number of similar (compiler,implementation) pairs: 4, namely:
CompilerImplementations
gcc -march=native -mtune=native -O2 -fomit-frame-pointer -fwrapv -fPIC -fPIE T:thomaz/asm-PSPar-v2-FP
gcc -march=native -mtune=native -O3 -fomit-frame-pointer -fwrapv -fPIC -fPIE T:thomaz/asm-PSPar-v2-FP
gcc -march=native -mtune=native -O -fomit-frame-pointer -fwrapv -fPIC -fPIE T:thomaz/asm-PSPar-v2-FP
gcc -march=native -mtune=native -Os -fomit-frame-pointer -fwrapv -fPIC -fPIE T:thomaz/asm-PSPar-v2-FP

Compiler output

Implementation: T:thomaz/asm-PSPar-v2-INT
Security model: timingleaks
Compiler: clang -march=native -O2 -fomit-frame-pointer -fwrapv -Qunused-arguments -fPIC -fPIE
hash.c: hash.c:32:12: warning: passing 'const unsigned char *' to parameter of type 'unsigned char *' discards qualifiers [-Wincompatible-pointer-types-discards-qualifiers]
hash.c: fLuffa256(in, out, inlen);
hash.c: ^~
hash.c: hash.c:29:31: note: passing argument to parameter 'input' here
hash.c: void fLuffa256(unsigned char *input, unsigned char *output, int len);
hash.c: ^
hash.c: 1 warning generated.
luffa256.s: <instantiation>:1:8: error: unknown token in expression
luffa256.s: pshufb %xmm6, maskShufLittleEndian
luffa256.s: ^
luffa256.s: <instantiation>:1:1: note: while in macro instantiation
luffa256.s: mPSSTEPI %xmm6, %xmm7, maskShufLittleEndian
luffa256.s: ^
luffa256.s: luffa256.s:445:2: note: while in macro instantiation
luffa256.s: mPS %xmm6, %xmm7, %xmm8, %xmm9, %xmm10, %xmm11
luffa256.s: ^
luffa256.s: <instantiation>:2:9: error: unknown token in expression
luffa256.s: pshufb %xmm7, maskShufLittleEndian
luffa256.s: ^
luffa256.s: <instantiation>:1:1: note: while in macro instantiation
luffa256.s: mPSSTEPI %xmm6, %xmm7, maskShufLittleEndian
luffa256.s: ^
luffa256.s: luffa256.s:445:2: note: while in macro instantiation
luffa256.s: mPS %xmm6, %xmm7, %xmm8, %xmm9, %xmm10, %xmm11
luffa256.s: ^
luffa256.s: <instantiation>:1:8: error: unknown token in expression
luffa256.s: movdqa %xmm8, %xmm6
luffa256.s: ^
luffa256.s: <instantiation>:2:2: note: while in macro instantiation
luffa256.s: mPSSTEPII %xmm6, %xmm7, %xmm8, %xmm9, %xmm10, %xmm11
luffa256.s: ^
luffa256.s: luffa256.s:445:2: note: while in macro instantiation
luffa256.s: ...

Number of similar (compiler,implementation) pairs: 5, namely:
CompilerImplementations
clang -march=native -O2 -fomit-frame-pointer -fwrapv -Qunused-arguments -fPIC -fPIE T:thomaz/asm-PSPar-v2-INT
clang -march=native -O3 -fomit-frame-pointer -fwrapv -Qunused-arguments -fPIC -fPIE T:thomaz/asm-PSPar-v2-INT
clang -march=native -O -fomit-frame-pointer -fwrapv -Qunused-arguments -fPIC -fPIE T:thomaz/asm-PSPar-v2-INT
clang -march=native -Os -fomit-frame-pointer -fwrapv -Qunused-arguments -fPIC -fPIE T:thomaz/asm-PSPar-v2-INT
clang -mcpu=native -O3 -fomit-frame-pointer -fwrapv -Qunused-arguments -fPIC -fPIE T:thomaz/asm-PSPar-v2-INT

Compiler output

Implementation: T:thomaz/asm-PSPar-v2-INT
Security model: timingleaks
Compiler: gcc -march=native -mtune=native -O2 -fomit-frame-pointer -fwrapv -fPIC -fPIE
hash.c: hash.c: In function 'crypto_hash_luffa256_thomaz_asm_PSPar_v2_INT_timingleaks':
hash.c: hash.c:32:12: warning: passing argument 1 of 'fLuffa256' discards 'const' qualifier from pointer target type [-Wdiscarded-qualifiers]
hash.c: 32 | fLuffa256(in, out, inlen);
hash.c: | ^~
hash.c: hash.c:29:31: note: expected 'unsigned char *' but argument is of type 'const unsigned char *'
hash.c: 29 | void fLuffa256(unsigned char *input, unsigned char *output, int len);
hash.c: | ~~~~~~~~~~~~~~~^~~~~
try.c: /usr/bin/ld: libcrypto_hash_luffa256.a(luffa256.o): relocation R_X86_64_32S against `.rodata' can not be used when making a PIE object; recompile with -fPIE
try.c: collect2: error: ld returned 1 exit status

Number of similar (compiler,implementation) pairs: 4, namely:
CompilerImplementations
gcc -march=native -mtune=native -O2 -fomit-frame-pointer -fwrapv -fPIC -fPIE T:thomaz/asm-PSPar-v2-INT
gcc -march=native -mtune=native -O3 -fomit-frame-pointer -fwrapv -fPIC -fPIE T:thomaz/asm-PSPar-v2-INT
gcc -march=native -mtune=native -O -fomit-frame-pointer -fwrapv -fPIC -fPIE T:thomaz/asm-PSPar-v2-INT
gcc -march=native -mtune=native -Os -fomit-frame-pointer -fwrapv -fPIC -fPIE T:thomaz/asm-PSPar-v2-INT

Namespace violations

Implementation: T:opt32
Security model: timingleaks
Compiler: clang -march=native -O2 -fomit-frame-pointer -fwrapv -Qunused-arguments -fPIC -fPIE
luffa_for_32.o CNS D
luffa_for_32.o Final T
luffa_for_32.o Hash T
luffa_for_32.o IV R
luffa_for_32.o Init T
luffa_for_32.o Update T
luffa_for_32.o Update256 T
luffa_for_32.o Update384 T
luffa_for_32.o Update512 T
luffa_for_32.o finalization224 T
luffa_for_32.o finalization256 T
luffa_for_32.o finalization384 T
luffa_for_32.o finalization512 T
luffa_for_32.o process_last_msgs256 T
luffa_for_32.o process_last_msgs384 T
luffa_for_32.o process_last_msgs512 T
luffa_for_32.o rnd256 T
luffa_for_32.o rnd384 T
luffa_for_32.o rnd512 T

Number of similar (compiler,implementation) pairs: 9, namely:
CompilerImplementations
clang -march=native -O2 -fomit-frame-pointer -fwrapv -Qunused-arguments -fPIC -fPIE T:opt32
clang -march=native -O3 -fomit-frame-pointer -fwrapv -Qunused-arguments -fPIC -fPIE T:opt32
clang -march=native -O -fomit-frame-pointer -fwrapv -Qunused-arguments -fPIC -fPIE T:opt32
clang -march=native -Os -fomit-frame-pointer -fwrapv -Qunused-arguments -fPIC -fPIE T:opt32
clang -mcpu=native -O3 -fomit-frame-pointer -fwrapv -Qunused-arguments -fPIC -fPIE T:opt32
gcc -march=native -mtune=native -O2 -fomit-frame-pointer -fwrapv -fPIC -fPIE T:opt32
gcc -march=native -mtune=native -O3 -fomit-frame-pointer -fwrapv -fPIC -fPIE T:opt32
gcc -march=native -mtune=native -O -fomit-frame-pointer -fwrapv -fPIC -fPIE T:opt32
gcc -march=native -mtune=native -Os -fomit-frame-pointer -fwrapv -fPIC -fPIE T:opt32

Namespace violations

Implementation: T:sphlib
Security model: timingleaks
Compiler: clang -march=native -O2 -fomit-frame-pointer -fwrapv -Qunused-arguments -fPIC -fPIE
luffa.o sph_luffa224 T
luffa.o sph_luffa224_addbits_and_close T
luffa.o sph_luffa224_close T
luffa.o sph_luffa224_init T
luffa.o sph_luffa256 T
luffa.o sph_luffa256_addbits_and_close T
luffa.o sph_luffa256_close T
luffa.o sph_luffa256_init T
luffa.o sph_luffa384 T
luffa.o sph_luffa384_addbits_and_close T
luffa.o sph_luffa384_close T
luffa.o sph_luffa384_init T
luffa.o sph_luffa512 T
luffa.o sph_luffa512_addbits_and_close T
luffa.o sph_luffa512_close T
luffa.o sph_luffa512_init T

Number of similar (compiler,implementation) pairs: 9, namely:
CompilerImplementations
clang -march=native -O2 -fomit-frame-pointer -fwrapv -Qunused-arguments -fPIC -fPIE T:sphlib
clang -march=native -O3 -fomit-frame-pointer -fwrapv -Qunused-arguments -fPIC -fPIE T:sphlib
clang -march=native -O -fomit-frame-pointer -fwrapv -Qunused-arguments -fPIC -fPIE T:sphlib
clang -march=native -Os -fomit-frame-pointer -fwrapv -Qunused-arguments -fPIC -fPIE T:sphlib
clang -mcpu=native -O3 -fomit-frame-pointer -fwrapv -Qunused-arguments -fPIC -fPIE T:sphlib
gcc -march=native -mtune=native -O2 -fomit-frame-pointer -fwrapv -fPIC -fPIE T:sphlib
gcc -march=native -mtune=native -O3 -fomit-frame-pointer -fwrapv -fPIC -fPIE T:sphlib
gcc -march=native -mtune=native -O -fomit-frame-pointer -fwrapv -fPIC -fPIE T:sphlib
gcc -march=native -mtune=native -Os -fomit-frame-pointer -fwrapv -fPIC -fPIE T:sphlib

Namespace violations

Implementation: T:sse2
Security model: timingleaks
Compiler: clang -march=native -O2 -fomit-frame-pointer -fwrapv -Qunused-arguments -fPIC -fPIE
luffa_for_sse2.o ALLONE C
luffa_for_sse2.o CNS128 C
luffa_for_sse2.o Final T
luffa_for_sse2.o Hash T
luffa_for_sse2.o Init T
luffa_for_sse2.o MASK C
luffa_for_sse2.o Update T

Number of similar (compiler,implementation) pairs: 9, namely:
CompilerImplementations
clang -march=native -O2 -fomit-frame-pointer -fwrapv -Qunused-arguments -fPIC -fPIE T:sse2
clang -march=native -O3 -fomit-frame-pointer -fwrapv -Qunused-arguments -fPIC -fPIE T:sse2
clang -march=native -O -fomit-frame-pointer -fwrapv -Qunused-arguments -fPIC -fPIE T:sse2
clang -march=native -Os -fomit-frame-pointer -fwrapv -Qunused-arguments -fPIC -fPIE T:sse2
clang -mcpu=native -O3 -fomit-frame-pointer -fwrapv -Qunused-arguments -fPIC -fPIE T:sse2
gcc -march=native -mtune=native -O2 -fomit-frame-pointer -fwrapv -fPIC -fPIE T:sse2
gcc -march=native -mtune=native -O3 -fomit-frame-pointer -fwrapv -fPIC -fPIE T:sse2
gcc -march=native -mtune=native -O -fomit-frame-pointer -fwrapv -fPIC -fPIE T:sse2
gcc -march=native -mtune=native -Os -fomit-frame-pointer -fwrapv -fPIC -fPIE T:sse2