Implementation notes: amd64, r24000, crypto_hash/groestl512

Computer: r24000
Architecture: amd64
CPU ID: GenuineIntel-000906ea-bfebfbff
SUPERCOP version: 20211108
Operation: crypto_hash
Primitive: groestl512
TimeObject sizeTest sizeImplementationCompilerBenchmark dateSUPERCOP version
206229878 0 25624471 812 2208T:aesni-intrgcc_-march=native_-mtune=native_-O3_-fomit-frame-pointer_-fwrapv_-fPIC_-fPIE2021050720210423
209768982 0 25620806 804 2208T:aesni-intrgcc_-march=native_-mtune=native_-O2_-fomit-frame-pointer_-fwrapv_-fPIC_-fPIE2021050720210423
210628603 0 25620286 804 2208T:aesni-intrgcc_-march=native_-mtune=native_-O_-fomit-frame-pointer_-fwrapv_-fPIC_-fPIE2021050720210423
216448351 0 24018718 804 2112T:aesni-intrclang_-march=native_-Os_-fomit-frame-pointer_-fwrapv_-Qunused-arguments_-fPIC_-fPIE2021050720210423
216529876 0 24023508 812 2112T:aesni-intrclang_-march=native_-O_-fomit-frame-pointer_-fwrapv_-Qunused-arguments_-fPIC_-fPIE2021050720210423
216619876 0 24023508 812 2112T:aesni-intrclang_-march=native_-O2_-fomit-frame-pointer_-fwrapv_-Qunused-arguments_-fPIC_-fPIE2021050720210423
218109876 0 24023396 812 2112T:aesni-intrclang_-march=native_-O3_-fomit-frame-pointer_-fwrapv_-Qunused-arguments_-fPIC_-fPIE2021050720210423
222818654 0 64023247 812 2592T:avx-intrgcc_-march=native_-mtune=native_-O3_-fomit-frame-pointer_-fwrapv_-fPIC_-fPIE2021050720210423
225657417 0 64019102 804 2592T:avx-intrgcc_-march=native_-mtune=native_-O_-fomit-frame-pointer_-fwrapv_-fPIC_-fPIE2021050720210423
226498585 0 25619386 788 2176T:aesni-intrgcc_-march=native_-mtune=native_-Os_-fomit-frame-pointer_-fwrapv_-fPIC_-fPIE2021050720210423
228207758 0 64019582 804 2592T:avx-intrgcc_-march=native_-mtune=native_-O2_-fomit-frame-pointer_-fwrapv_-fPIC_-fPIE2021050720210423
228899276 0 80022900 812 2704T:avx-intrclang_-march=native_-O2_-fomit-frame-pointer_-fwrapv_-Qunused-arguments_-fPIC_-fPIE2021050720210423
229887762 0 80018126 804 2672T:avx-intrclang_-march=native_-Os_-fomit-frame-pointer_-fwrapv_-Qunused-arguments_-fPIC_-fPIE2021050720210423
230629276 0 80022772 812 2704T:avx-intrclang_-march=native_-O3_-fomit-frame-pointer_-fwrapv_-Qunused-arguments_-fPIC_-fPIE2021050720210423
236667323 0 64018122 788 2560T:avx-intrgcc_-march=native_-mtune=native_-Os_-fomit-frame-pointer_-fwrapv_-fPIC_-fPIE2021050720210423
238429276 0 80022900 812 2704T:avx-intrclang_-march=native_-O_-fomit-frame-pointer_-fwrapv_-Qunused-arguments_-fPIC_-fPIE2021050720210423
4353819382 0 25633975 812 2496T:vperm-intrgcc_-march=native_-mtune=native_-O3_-fomit-frame-pointer_-fwrapv_-fPIC_-fPIE2021050720210423
4381318398 0 25630078 804 2496T:vperm-intrgcc_-march=native_-mtune=native_-O_-fomit-frame-pointer_-fwrapv_-fPIC_-fPIE2021050720210423
4393118486 0 25630310 804 2496T:vperm-intrgcc_-march=native_-mtune=native_-O2_-fomit-frame-pointer_-fwrapv_-fPIC_-fPIE2021050720210423
4475527120 0 040525 804 920T:opteronclang_-march=native_-O3_-fomit-frame-pointer_-fwrapv_-Qunused-arguments_-fPIC_-fPIE2021050720210423
4477927120 0 040637 804 920T:opteronclang_-march=native_-O_-fomit-frame-pointer_-fwrapv_-Qunused-arguments_-fPIC_-fPIE2021050720210423
4480427120 0 040637 804 920T:opteronclang_-march=native_-O2_-fomit-frame-pointer_-fwrapv_-Qunused-arguments_-fPIC_-fPIE2021050720210423
4488427278 0 039941 804 888T:opteronclang_-mcpu=native_-O3_-fomit-frame-pointer_-fwrapv_-Qunused-arguments_-fPIC_-fPIE2021050720210423
4536225987 0 036215 796 888T:opteronclang_-march=native_-Os_-fomit-frame-pointer_-fwrapv_-Qunused-arguments_-fPIC_-fPIE2021050720210423
4602318818 0 25629626 788 2464T:vperm-intrgcc_-march=native_-mtune=native_-Os_-fomit-frame-pointer_-fwrapv_-fPIC_-fPIE2021050720210423
4854919792 0 107230158 804 3216T:vperm-intrclang_-march=native_-Os_-fomit-frame-pointer_-fwrapv_-Qunused-arguments_-fPIC_-fPIE2021050720210423
4864024771 0 107236716 812 3216T:vperm-intrclang_-march=native_-O_-fomit-frame-pointer_-fwrapv_-Qunused-arguments_-fPIC_-fPIE2021050720210423
4871124771 0 107236604 812 3216T:vperm-intrclang_-march=native_-O3_-fomit-frame-pointer_-fwrapv_-Qunused-arguments_-fPIC_-fPIE2021050720210423
4876224771 0 107236716 812 3216T:vperm-intrclang_-march=native_-O2_-fomit-frame-pointer_-fwrapv_-Qunused-arguments_-fPIC_-fPIE2021050720210423
5541427846 0 040509 804 888T:core2duoclang_-mcpu=native_-O3_-fomit-frame-pointer_-fwrapv_-Qunused-arguments_-fPIC_-fPIE2021050720210423
5550327648 0 041053 804 920T:core2duoclang_-march=native_-O3_-fomit-frame-pointer_-fwrapv_-Qunused-arguments_-fPIC_-fPIE2021050720210423
5550927648 0 041181 804 920T:core2duoclang_-march=native_-O_-fomit-frame-pointer_-fwrapv_-Qunused-arguments_-fPIC_-fPIE2021050720210423
5551527648 0 041181 804 920T:core2duoclang_-march=native_-O2_-fomit-frame-pointer_-fwrapv_-Qunused-arguments_-fPIC_-fPIE2021050720210423
5560826493 0 036759 796 888T:core2duoclang_-march=native_-Os_-fomit-frame-pointer_-fwrapv_-Qunused-arguments_-fPIC_-fPIE2021050720210423
5641149546 0 064167 812 952T:sphlib-adaptedgcc_-march=native_-mtune=native_-O3_-fomit-frame-pointer_-fwrapv_-fPIC_-fPIE2021050720210423
5701044831 0 055698 788 920T:sphlib-adaptedgcc_-march=native_-mtune=native_-Os_-fomit-frame-pointer_-fwrapv_-fPIC_-fPIE2021050720210423
5824742144 0 053010 788 920T:sphlibgcc_-march=native_-mtune=native_-Os_-fomit-frame-pointer_-fwrapv_-fPIC_-fPIE2021050720210423
5960448902 0 060654 804 952T:sphlib-adaptedgcc_-march=native_-mtune=native_-O_-fomit-frame-pointer_-fwrapv_-fPIC_-fPIE2021050720210423
6065645498 0 057246 804 952T:sphlibgcc_-march=native_-mtune=native_-O_-fomit-frame-pointer_-fwrapv_-fPIC_-fPIE2021050720210423
6123951690 0 063574 804 952T:sphlib-adaptedgcc_-march=native_-mtune=native_-O2_-fomit-frame-pointer_-fwrapv_-fPIC_-fPIE2021050720210423
6342346938 0 061559 812 952T:sphlibgcc_-march=native_-mtune=native_-O3_-fomit-frame-pointer_-fwrapv_-fPIC_-fPIE2021050720210423
6362946298 0 058182 804 952T:sphlibgcc_-march=native_-mtune=native_-O2_-fomit-frame-pointer_-fwrapv_-fPIC_-fPIE2021050720210423
7356561141 0 072959 812 952T:mmxgcc_-march=native_-mtune=native_-O_-fomit-frame-pointer_-fwrapv_-fPIC_-fPIE2021050720210423
7385965328 0 080056 820 952T:mmxgcc_-march=native_-mtune=native_-O3_-fomit-frame-pointer_-fwrapv_-fPIC_-fPIE2021050720210423
7427662157 0 074119 812 952T:mmxgcc_-march=native_-mtune=native_-O2_-fomit-frame-pointer_-fwrapv_-fPIC_-fPIE2021050720210423
7527852337 0 065965 804 920T:sphlib-adaptedclang_-march=native_-O2_-fomit-frame-pointer_-fwrapv_-Qunused-arguments_-fPIC_-fPIE2021050720210423
7530152337 0 065965 804 920T:sphlib-adaptedclang_-march=native_-O_-fomit-frame-pointer_-fwrapv_-Qunused-arguments_-fPIC_-fPIE2021050720210423
7536752337 0 065853 804 920T:sphlib-adaptedclang_-march=native_-O3_-fomit-frame-pointer_-fwrapv_-Qunused-arguments_-fPIC_-fPIE2021050720210423
7551561762 0 072707 796 920T:mmxgcc_-march=native_-mtune=native_-Os_-fomit-frame-pointer_-fwrapv_-fPIC_-fPIE2021050720210423
7678948881 0 062493 804 920T:sphlibclang_-march=native_-O2_-fomit-frame-pointer_-fwrapv_-Qunused-arguments_-fPIC_-fPIE2021050720210423
7680048881 0 062493 804 920T:sphlibclang_-march=native_-O_-fomit-frame-pointer_-fwrapv_-Qunused-arguments_-fPIC_-fPIE2021050720210423
7681748881 0 062381 804 920T:sphlibclang_-march=native_-O3_-fomit-frame-pointer_-fwrapv_-Qunused-arguments_-fPIC_-fPIE2021050720210423
7694449969 0 062733 804 888T:sphlibclang_-mcpu=native_-O3_-fomit-frame-pointer_-fwrapv_-Qunused-arguments_-fPIC_-fPIE2021050720210423
7734252993 0 065773 804 888T:sphlib-adaptedclang_-mcpu=native_-O3_-fomit-frame-pointer_-fwrapv_-Qunused-arguments_-fPIC_-fPIE2021050720210423
7877221457 0 034701 804 920T:sphlib-smallclang_-march=native_-O2_-fomit-frame-pointer_-fwrapv_-Qunused-arguments_-fPIC_-fPIE2021050720210423
7935121457 0 034701 804 920T:sphlib-smallclang_-march=native_-O_-fomit-frame-pointer_-fwrapv_-Qunused-arguments_-fPIC_-fPIE2021050720210423
7936521457 0 034573 804 920T:sphlib-smallclang_-march=native_-O3_-fomit-frame-pointer_-fwrapv_-Qunused-arguments_-fPIC_-fPIE2021050720210423
7971170267 0 083191 828 888T:mmxclang_-mcpu=native_-O3_-fomit-frame-pointer_-fwrapv_-Qunused-arguments_-fPIC_-fPIE2021050720210423
7988269123 0 082895 828 920T:mmxclang_-march=native_-O2_-fomit-frame-pointer_-fwrapv_-Qunused-arguments_-fPIC_-fPIE2021050720210423
7988969931 0 083591 828 920T:mmxclang_-march=native_-O3_-fomit-frame-pointer_-fwrapv_-Qunused-arguments_-fPIC_-fPIE2021050720210423
7994669123 0 082895 828 920T:mmxclang_-march=native_-O_-fomit-frame-pointer_-fwrapv_-Qunused-arguments_-fPIC_-fPIE2021050720210423
8177249533 0 059855 796 888T:sphlibclang_-march=native_-Os_-fomit-frame-pointer_-fwrapv_-Qunused-arguments_-fPIC_-fPIE2021050720210423
8391566106 0 076519 812 888T:mmxclang_-march=native_-Os_-fomit-frame-pointer_-fwrapv_-Qunused-arguments_-fPIC_-fPIE2021050720210423
8412820570 0 030527 796 888T:sphlib-smallclang_-march=native_-Os_-fomit-frame-pointer_-fwrapv_-Qunused-arguments_-fPIC_-fPIE2021050720210423
8708320825 0 032574 804 952T:sphlib-smallgcc_-march=native_-mtune=native_-O_-fomit-frame-pointer_-fwrapv_-fPIC_-fPIE2021050720210423
8781253652 0 064015 796 888T:sphlib-adaptedclang_-march=native_-Os_-fomit-frame-pointer_-fwrapv_-Qunused-arguments_-fPIC_-fPIE2021050720210423
9033122618 0 034502 804 952T:sphlib-smallgcc_-march=native_-mtune=native_-O2_-fomit-frame-pointer_-fwrapv_-fPIC_-fPIE2021050720210423
9468418923 0 029794 788 920T:sphlib-smallgcc_-march=native_-mtune=native_-Os_-fomit-frame-pointer_-fwrapv_-fPIC_-fPIE2021050720210423
9487224074 0 038695 812 952T:sphlib-smallgcc_-march=native_-mtune=native_-O3_-fomit-frame-pointer_-fwrapv_-fPIC_-fPIE2021050720210423
9848424465 0 037133 804 888T:sphlib-smallclang_-mcpu=native_-O3_-fomit-frame-pointer_-fwrapv_-Qunused-arguments_-fPIC_-fPIE2021050720210423
10989321048 0 032903 812 952T:opt32gcc_-march=native_-mtune=native_-O_-fomit-frame-pointer_-fwrapv_-fPIC_-fPIE2021050720210423
11019821253 0 033247 812 952T:opt32gcc_-march=native_-mtune=native_-O2_-fomit-frame-pointer_-fwrapv_-fPIC_-fPIE2021050720210423
11040823988 0 038744 820 952T:opt32gcc_-march=native_-mtune=native_-O3_-fomit-frame-pointer_-fwrapv_-fPIC_-fPIE2021050720210423
11091821037 0 032011 796 920T:opt32gcc_-march=native_-mtune=native_-Os_-fomit-frame-pointer_-fwrapv_-fPIC_-fPIE2021050720210423
11295026454 0 040295 828 920T:opt32clang_-march=native_-O_-fomit-frame-pointer_-fwrapv_-Qunused-arguments_-fPIC_-fPIE2021050720210423
11297926630 0 040375 828 920T:opt32clang_-march=native_-O3_-fomit-frame-pointer_-fwrapv_-Qunused-arguments_-fPIC_-fPIE2021050720210423
11298126454 0 040295 828 920T:opt32clang_-march=native_-O2_-fomit-frame-pointer_-fwrapv_-Qunused-arguments_-fPIC_-fPIE2021050720210423
11490826998 0 040007 828 888T:opt32clang_-mcpu=native_-O3_-fomit-frame-pointer_-fwrapv_-Qunused-arguments_-fPIC_-fPIE2021050720210423
11907323901 0 034367 812 888T:opt32clang_-march=native_-Os_-fomit-frame-pointer_-fwrapv_-Qunused-arguments_-fPIC_-fPIE2021050720210423
2538565541 0 018213 804 888T:32bit-bytesliced-c-smallclang_-mcpu=native_-O3_-fomit-frame-pointer_-fwrapv_-Qunused-arguments_-fPIC_-fPIE2021050720210423
2601705485 0 018909 804 920T:32bit-bytesliced-c-smallclang_-march=native_-O3_-fomit-frame-pointer_-fwrapv_-Qunused-arguments_-fPIC_-fPIE2021050720210423
2629363977 0 017525 804 920T:32bit-bytesliced-c-smallclang_-march=native_-O2_-fomit-frame-pointer_-fwrapv_-Qunused-arguments_-fPIC_-fPIE2021050720210423
2648633977 0 017525 804 920T:32bit-bytesliced-c-smallclang_-march=native_-O_-fomit-frame-pointer_-fwrapv_-Qunused-arguments_-fPIC_-fPIE2021050720210423
2941535130 0 019624 804 952T:32bit-bytesliced-c-smallgcc_-march=native_-mtune=native_-O3_-fomit-frame-pointer_-fwrapv_-fPIC_-fPIE2021050720210423
3964042038 0 012303 796 888T:32bit-bytesliced-c-smallclang_-march=native_-Os_-fomit-frame-pointer_-fwrapv_-Qunused-arguments_-fPIC_-fPIE2021050720210423
4591792345 0 014095 796 952T:32bit-bytesliced-c-smallgcc_-march=native_-mtune=native_-O2_-fomit-frame-pointer_-fwrapv_-fPIC_-fPIE2021050720210423
4745521951 0 012651 780 920T:32bit-bytesliced-c-smallgcc_-march=native_-mtune=native_-Os_-fomit-frame-pointer_-fwrapv_-fPIC_-fPIE2021050720210423
6838342721 0 014327 796 952T:32bit-bytesliced-c-smallgcc_-march=native_-mtune=native_-O_-fomit-frame-pointer_-fwrapv_-fPIC_-fPIE2021050720210423

Compiler output

Implementation: T:aesni
Security model: timingleaks
Compiler: clang -march=native -O2 -fomit-frame-pointer -fwrapv -Qunused-arguments -fPIC -fPIE
hash.c: hash.c:104:12: warning: comparison of array 'ctx->chaining' equal to a null pointer is always false [-Wtautological-pointer-compare]
hash.c: if (ctx->chaining == NULL || ctx->buffer == NULL)
hash.c: ~~~~~^~~~~~~~ ~~~~
hash.c: hash.c:104:37: warning: comparison of array 'ctx->buffer' equal to a null pointer is always false [-Wtautological-pointer-compare]
hash.c: if (ctx->chaining == NULL || ctx->buffer == NULL)
hash.c: ~~~~~^~~~~~ ~~~~
hash.c: In file included from hash.c:13:
hash.c: ./groestl-asm-aes.h:851:8: error: invalid operand for instruction
hash.c: asm ("movaps xmm8, [rdi+0*16]");
hash.c: ^
hash.c: <inline asm>:1:16: note: instantiated into assembly here
hash.c: movaps xmm8, [rdi+0*16]
hash.c: ^~~~~~~~~~
hash.c: In file included from hash.c:13:
hash.c: ./groestl-asm-aes.h:852:8: error: invalid operand for instruction
hash.c: asm ("movaps xmm9, [rdi+1*16]");
hash.c: ^
hash.c: <inline asm>:1:16: note: instantiated into assembly here
hash.c: movaps xmm9, [rdi+1*16]
hash.c: ^~~~~~~~~~
hash.c: In file included from hash.c:13:
hash.c: ./groestl-asm-aes.h:853:8: error: invalid operand for instruction
hash.c: asm ("movaps xmm10, [rdi+2*16]");
hash.c: ^
hash.c: <inline asm>:1:16: note: instantiated into assembly here
hash.c: ...

Number of similar (compiler,implementation) pairs: 5, namely:
CompilerImplementations
clang -march=native -O2 -fomit-frame-pointer -fwrapv -Qunused-arguments -fPIC -fPIE T:aesni
clang -march=native -O3 -fomit-frame-pointer -fwrapv -Qunused-arguments -fPIC -fPIE T:aesni
clang -march=native -O -fomit-frame-pointer -fwrapv -Qunused-arguments -fPIC -fPIE T:aesni
clang -march=native -Os -fomit-frame-pointer -fwrapv -Qunused-arguments -fPIC -fPIE T:aesni
clang -mcpu=native -O3 -fomit-frame-pointer -fwrapv -Qunused-arguments -fPIC -fPIE T:aesni

Compiler output

Implementation: T:aesni
Security model: timingleaks
Compiler: gcc -march=native -mtune=native -O2 -fomit-frame-pointer -fwrapv -fPIC -fPIE
try.c: /usr/bin/ld: libcrypto_hash_groestl512.a(hash.o): relocation R_X86_64_32S against symbol `TRANSP_MASK' can not be used when making a PIE object; recompile with -fPIE
try.c: collect2: error: ld returned 1 exit status

Number of similar (compiler,implementation) pairs: 8, namely:
CompilerImplementations
gcc -march=native -mtune=native -O2 -fomit-frame-pointer -fwrapv -fPIC -fPIE T:aesni
gcc -march=native -mtune=native -O3 -fomit-frame-pointer -fwrapv -fPIC -fPIE T:aesni
gcc -march=native -mtune=native -O -fomit-frame-pointer -fwrapv -fPIC -fPIE T:aesni
gcc -march=native -mtune=native -Os -fomit-frame-pointer -fwrapv -fPIC -fPIE T:aesni
gcc -march=native -mtune=native -O2 -fomit-frame-pointer -fwrapv -fPIC -fPIE T:avx
gcc -march=native -mtune=native -O3 -fomit-frame-pointer -fwrapv -fPIC -fPIE T:avx
gcc -march=native -mtune=native -O -fomit-frame-pointer -fwrapv -fPIC -fPIE T:avx
gcc -march=native -mtune=native -Os -fomit-frame-pointer -fwrapv -fPIC -fPIE T:avx

Compiler output

Implementation: T:aesni-intr
Security model: timingleaks
Compiler: clang -march=native -O2 -fomit-frame-pointer -fwrapv -Qunused-arguments -fPIC -fPIE
hash.c: hash.c:104:12: warning: comparison of array 'ctx->chaining' equal to a null pointer is always false [-Wtautological-pointer-compare]
hash.c: if (ctx->chaining == NULL || ctx->buffer == NULL)
hash.c: ~~~~~^~~~~~~~ ~~~~
hash.c: hash.c:104:37: warning: comparison of array 'ctx->buffer' equal to a null pointer is always false [-Wtautological-pointer-compare]
hash.c: if (ctx->chaining == NULL || ctx->buffer == NULL)
hash.c: ~~~~~^~~~~~ ~~~~
hash.c: 2 warnings generated.

Number of similar (compiler,implementation) pairs: 12, namely:
CompilerImplementations
clang -march=native -O2 -fomit-frame-pointer -fwrapv -Qunused-arguments -fPIC -fPIE T:aesni-intr
clang -march=native -O3 -fomit-frame-pointer -fwrapv -Qunused-arguments -fPIC -fPIE T:aesni-intr
clang -march=native -O -fomit-frame-pointer -fwrapv -Qunused-arguments -fPIC -fPIE T:aesni-intr
clang -march=native -Os -fomit-frame-pointer -fwrapv -Qunused-arguments -fPIC -fPIE T:aesni-intr
clang -march=native -O2 -fomit-frame-pointer -fwrapv -Qunused-arguments -fPIC -fPIE T:avx-intr
clang -march=native -O3 -fomit-frame-pointer -fwrapv -Qunused-arguments -fPIC -fPIE T:avx-intr
clang -march=native -O -fomit-frame-pointer -fwrapv -Qunused-arguments -fPIC -fPIE T:avx-intr
clang -march=native -Os -fomit-frame-pointer -fwrapv -Qunused-arguments -fPIC -fPIE T:avx-intr
clang -march=native -O2 -fomit-frame-pointer -fwrapv -Qunused-arguments -fPIC -fPIE T:vperm-intr
clang -march=native -O3 -fomit-frame-pointer -fwrapv -Qunused-arguments -fPIC -fPIE T:vperm-intr
clang -march=native -O -fomit-frame-pointer -fwrapv -Qunused-arguments -fPIC -fPIE T:vperm-intr
clang -march=native -Os -fomit-frame-pointer -fwrapv -Qunused-arguments -fPIC -fPIE T:vperm-intr

Compiler output

Implementation: T:aesni-intr
Security model: timingleaks
Compiler: clang -mcpu=native -O3 -fomit-frame-pointer -fwrapv -Qunused-arguments -fPIC -fPIE
hash.c: In file included from hash.c:28:
hash.c: ./groestl-intr-aes.h:786:3: error: always_inline function '_mm_shuffle_epi8' requires target feature 'ssse3', but would be inlined into function 'INIT' that is compiled without support for 'ssse3'
hash.c: Matrix_Transpose(xmm8, xmm9, xmm10, xmm11, xmm12, xmm13, xmm14, xmm15, xmm0, xmm1, xmm2, xmm3, xmm4, xmm5, xmm6, xmm7);
hash.c: ^
hash.c: ./groestl-intr-aes.h:631:8: note: expanded from macro 'Matrix_Transpose'
hash.c: i6 = _mm_shuffle_epi8(i6, t0);\
hash.c: ^
hash.c: ./groestl-intr-aes.h:786:3: error: always_inline function '_mm_shuffle_epi8' requires target feature 'ssse3', but would be inlined into function 'INIT' that is compiled without support for 'ssse3'
hash.c: ./groestl-intr-aes.h:632:8: note: expanded from macro 'Matrix_Transpose'
hash.c: i0 = _mm_shuffle_epi8(i0, t0);\
hash.c: ^
hash.c: ./groestl-intr-aes.h:786:3: error: always_inline function '_mm_shuffle_epi8' requires target feature 'ssse3', but would be inlined into function 'INIT' that is compiled without support for 'ssse3'
hash.c: ./groestl-intr-aes.h:633:8: note: expanded from macro 'Matrix_Transpose'
hash.c: i1 = _mm_shuffle_epi8(i1, t0);\
hash.c: ^
hash.c: ./groestl-intr-aes.h:786:3: error: always_inline function '_mm_shuffle_epi8' requires target feature 'ssse3', but would be inlined into function 'INIT' that is compiled without support for 'ssse3'
hash.c: ./groestl-intr-aes.h:634:8: note: expanded from macro 'Matrix_Transpose'
hash.c: i2 = _mm_shuffle_epi8(i2, t0);\
hash.c: ^
hash.c: ./groestl-intr-aes.h:786:3: error: always_inline function '_mm_shuffle_epi8' requires target feature 'ssse3', but would be inlined into function 'INIT' that is compiled without support for 'ssse3'
hash.c: ./groestl-intr-aes.h:635:8: note: expanded from macro 'Matrix_Transpose'
hash.c: i3 = _mm_shuffle_epi8(i3, t0);\
hash.c: ^
hash.c: ./groestl-intr-aes.h:786:3: error: always_inline function '_mm_shuffle_epi8' requires target feature 'ssse3', but would be inlined into function 'INIT' that is compiled without support for 'ssse3'
hash.c: ./groestl-intr-aes.h:637:8: note: expanded from macro 'Matrix_Transpose'
hash.c: ...

Number of similar (compiler,implementation) pairs: 1, namely:
CompilerImplementations
clang -mcpu=native -O3 -fomit-frame-pointer -fwrapv -Qunused-arguments -fPIC -fPIE T:aesni-intr

Compiler output

Implementation: T:avx
Security model: timingleaks
Compiler: clang -march=native -O2 -fomit-frame-pointer -fwrapv -Qunused-arguments -fPIC -fPIE
hash.c: hash.c:104:12: warning: comparison of array 'ctx->chaining' equal to a null pointer is always false [-Wtautological-pointer-compare]
hash.c: if (ctx->chaining == NULL || ctx->buffer == NULL)
hash.c: ~~~~~^~~~~~~~ ~~~~
hash.c: hash.c:104:37: warning: comparison of array 'ctx->buffer' equal to a null pointer is always false [-Wtautological-pointer-compare]
hash.c: if (ctx->chaining == NULL || ctx->buffer == NULL)
hash.c: ~~~~~^~~~~~ ~~~~
hash.c: In file included from hash.c:16:
hash.c: ./groestl-asm-avx.h:925:8: error: invalid operand for instruction
hash.c: asm ("vmovaps xmm8, [rdi+0*16]");
hash.c: ^
hash.c: <inline asm>:1:17: note: instantiated into assembly here
hash.c: vmovaps xmm8, [rdi+0*16]
hash.c: ^~~~~~~~~~
hash.c: In file included from hash.c:16:
hash.c: ./groestl-asm-avx.h:926:8: error: invalid operand for instruction
hash.c: asm ("vmovaps xmm9, [rdi+1*16]");
hash.c: ^
hash.c: <inline asm>:1:17: note: instantiated into assembly here
hash.c: vmovaps xmm9, [rdi+1*16]
hash.c: ^~~~~~~~~~
hash.c: In file included from hash.c:16:
hash.c: ./groestl-asm-avx.h:927:8: error: invalid operand for instruction
hash.c: asm ("vmovaps xmm10, [rdi+2*16]");
hash.c: ^
hash.c: <inline asm>:1:17: note: instantiated into assembly here
hash.c: ...

Number of similar (compiler,implementation) pairs: 5, namely:
CompilerImplementations
clang -march=native -O2 -fomit-frame-pointer -fwrapv -Qunused-arguments -fPIC -fPIE T:avx
clang -march=native -O3 -fomit-frame-pointer -fwrapv -Qunused-arguments -fPIC -fPIE T:avx
clang -march=native -O -fomit-frame-pointer -fwrapv -Qunused-arguments -fPIC -fPIE T:avx
clang -march=native -Os -fomit-frame-pointer -fwrapv -Qunused-arguments -fPIC -fPIE T:avx
clang -mcpu=native -O3 -fomit-frame-pointer -fwrapv -Qunused-arguments -fPIC -fPIE T:avx

Compiler output

Implementation: T:avx-intr
Security model: timingleaks
Compiler: clang -mcpu=native -O3 -fomit-frame-pointer -fwrapv -Qunused-arguments -fPIC -fPIE
hash.c: In file included from hash.c:31:
hash.c: ./groestl-intr-avx.h:851:3: error: always_inline function '_mm_shuffle_epi8' requires target feature 'ssse3', but would be inlined into function 'INIT' that is compiled without support for 'ssse3'
hash.c: Matrix_Transpose(xmm8, xmm9, xmm10, xmm11, xmm12, xmm13, xmm14, xmm15, xmm0, xmm1, xmm2, xmm3, xmm4, xmm5, xmm6, xmm7);
hash.c: ^
hash.c: ./groestl-intr-avx.h:725:8: note: expanded from macro 'Matrix_Transpose'
hash.c: i6 = _mm_shuffle_epi8(i6, t0);\
hash.c: ^
hash.c: ./groestl-intr-avx.h:851:3: error: always_inline function '_mm_shuffle_epi8' requires target feature 'ssse3', but would be inlined into function 'INIT' that is compiled without support for 'ssse3'
hash.c: ./groestl-intr-avx.h:726:8: note: expanded from macro 'Matrix_Transpose'
hash.c: i0 = _mm_shuffle_epi8(i0, t0);\
hash.c: ^
hash.c: ./groestl-intr-avx.h:851:3: error: always_inline function '_mm_shuffle_epi8' requires target feature 'ssse3', but would be inlined into function 'INIT' that is compiled without support for 'ssse3'
hash.c: ./groestl-intr-avx.h:727:8: note: expanded from macro 'Matrix_Transpose'
hash.c: i1 = _mm_shuffle_epi8(i1, t0);\
hash.c: ^
hash.c: ./groestl-intr-avx.h:851:3: error: always_inline function '_mm_shuffle_epi8' requires target feature 'ssse3', but would be inlined into function 'INIT' that is compiled without support for 'ssse3'
hash.c: ./groestl-intr-avx.h:728:8: note: expanded from macro 'Matrix_Transpose'
hash.c: i2 = _mm_shuffle_epi8(i2, t0);\
hash.c: ^
hash.c: ./groestl-intr-avx.h:851:3: error: always_inline function '_mm_shuffle_epi8' requires target feature 'ssse3', but would be inlined into function 'INIT' that is compiled without support for 'ssse3'
hash.c: ./groestl-intr-avx.h:729:8: note: expanded from macro 'Matrix_Transpose'
hash.c: i3 = _mm_shuffle_epi8(i3, t0);\
hash.c: ^
hash.c: ./groestl-intr-avx.h:851:3: error: always_inline function '_mm_shuffle_epi8' requires target feature 'ssse3', but would be inlined into function 'INIT' that is compiled without support for 'ssse3'
hash.c: ./groestl-intr-avx.h:730:8: note: expanded from macro 'Matrix_Transpose'
hash.c: ...

Number of similar (compiler,implementation) pairs: 1, namely:
CompilerImplementations
clang -mcpu=native -O3 -fomit-frame-pointer -fwrapv -Qunused-arguments -fPIC -fPIE T:avx-intr

Compiler output

Implementation: T:core2duo
Security model: timingleaks
Compiler: gcc -march=native -mtune=native -O2 -fomit-frame-pointer -fwrapv -fPIC -fPIE
try.c: /usr/bin/ld: libcrypto_hash_groestl512.a(hash.o): in function `Transform':
try.c: hash.c:(.text+0x...): undefined reference to `Q1024ASM'
try.c: /usr/bin/ld: hash.c:(.text+0x...): undefined reference to `P1024ASM'
try.c: /usr/bin/ld: libcrypto_hash_groestl512.a(hash.o): in function `OutputTransformation':
try.c: hash.c:(.text+0x...): undefined reference to `P1024ASM'
try.c: collect2: error: ld returned 1 exit status

Number of similar (compiler,implementation) pairs: 6, namely:
CompilerImplementations
gcc -march=native -mtune=native -O2 -fomit-frame-pointer -fwrapv -fPIC -fPIE T:core2duo
gcc -march=native -mtune=native -O -fomit-frame-pointer -fwrapv -fPIC -fPIE T:core2duo
gcc -march=native -mtune=native -Os -fomit-frame-pointer -fwrapv -fPIC -fPIE T:core2duo
gcc -march=native -mtune=native -O2 -fomit-frame-pointer -fwrapv -fPIC -fPIE T:opteron
gcc -march=native -mtune=native -O -fomit-frame-pointer -fwrapv -fPIC -fPIE T:opteron
gcc -march=native -mtune=native -Os -fomit-frame-pointer -fwrapv -fPIC -fPIE T:opteron

Compiler output

Implementation: T:core2duo
Security model: timingleaks
Compiler: gcc -march=native -mtune=native -O3 -fomit-frame-pointer -fwrapv -fPIC -fPIE
try.c: /usr/bin/ld: libcrypto_hash_groestl512.a(hash.o): in function `Transform.constprop.0':
try.c: hash.c:(.text+0x...): undefined reference to `Q1024ASM'
try.c: /usr/bin/ld: hash.c:(.text+0x...): undefined reference to `P1024ASM'
try.c: /usr/bin/ld: libcrypto_hash_groestl512.a(hash.o): in function `Transform':
try.c: hash.c:(.text+0x...): undefined reference to `Q1024ASM'
try.c: /usr/bin/ld: hash.c:(.text+0x...): undefined reference to `P1024ASM'
try.c: /usr/bin/ld: libcrypto_hash_groestl512.a(hash.o): in function `OutputTransformation':
try.c: hash.c:(.text+0x...): undefined reference to `P1024ASM'
try.c: /usr/bin/ld: libcrypto_hash_groestl512.a(hash.o): in function `Final':
try.c: hash.c:(.text+0x...): undefined reference to `P1024ASM'
try.c: collect2: error: ld returned 1 exit status

Number of similar (compiler,implementation) pairs: 2, namely:
CompilerImplementations
gcc -march=native -mtune=native -O3 -fomit-frame-pointer -fwrapv -fPIC -fPIE T:core2duo T:opteron

Compiler output

Implementation: T:opt64
Security model: timingleaks
Compiler: clang -march=native -O2 -fomit-frame-pointer -fwrapv -Qunused-arguments -fPIC -fPIE
hash.c: hash.c:191:3: warning: non-constant static local variable in inline function may be different in different files [-Wstatic-local-in-inline]
hash.c: static u64 y[COLS1024] __attribute__((aligned(16)));
hash.c: ^
hash.c: hash.c:190:1: note: use 'static' to give inline function 'F1024' internal linkage
hash.c: inline void F1024(u64 *h, const u64 *m) {
hash.c: ^
hash.c: static
hash.c: hash.c:192:3: warning: non-constant static local variable in inline function may be different in different files [-Wstatic-local-in-inline]
hash.c: static u64 z[COLS1024] __attribute__((aligned(16)));
hash.c: ^
hash.c: hash.c:190:1: note: use 'static' to give inline function 'F1024' internal linkage
hash.c: inline void F1024(u64 *h, const u64 *m) {
hash.c: ^
hash.c: static
hash.c: hash.c:193:3: warning: non-constant static local variable in inline function may be different in different files [-Wstatic-local-in-inline]
hash.c: static u64 outQ[COLS1024] __attribute__((aligned(16)));
hash.c: ^
hash.c: hash.c:190:1: note: use 'static' to give inline function 'F1024' internal linkage
hash.c: inline void F1024(u64 *h, const u64 *m) {
hash.c: ^
hash.c: static
hash.c: hash.c:194:3: warning: non-constant static local variable in inline function may be different in different files [-Wstatic-local-in-inline]
hash.c: static u64 inP[COLS1024] __attribute__((aligned(16)));
hash.c: ^
hash.c: hash.c:190:1: note: use 'static' to give inline function 'F1024' internal linkage
hash.c: ...

Number of similar (compiler,implementation) pairs: 5, namely:
CompilerImplementations
clang -march=native -O2 -fomit-frame-pointer -fwrapv -Qunused-arguments -fPIC -fPIE T:opt64
clang -march=native -O3 -fomit-frame-pointer -fwrapv -Qunused-arguments -fPIC -fPIE T:opt64
clang -march=native -O -fomit-frame-pointer -fwrapv -Qunused-arguments -fPIC -fPIE T:opt64
clang -march=native -Os -fomit-frame-pointer -fwrapv -Qunused-arguments -fPIC -fPIE T:opt64
clang -mcpu=native -O3 -fomit-frame-pointer -fwrapv -Qunused-arguments -fPIC -fPIE T:opt64

Compiler output

Implementation: T:opt64
Security model: timingleaks
Compiler: gcc -march=native -mtune=native -O2 -fomit-frame-pointer -fwrapv -fPIC -fPIE
hash.c: hash.c:194:14: warning: 'inP' is static but declared in inline function 'F1024' which is not static
hash.c: 194 | static u64 inP[COLS1024] __attribute__((aligned(16)));
hash.c: | ^~~
hash.c: hash.c:193:14: warning: 'outQ' is static but declared in inline function 'F1024' which is not static
hash.c: 193 | static u64 outQ[COLS1024] __attribute__((aligned(16)));
hash.c: | ^~~~
hash.c: hash.c:192:14: warning: 'z' is static but declared in inline function 'F1024' which is not static
hash.c: 192 | static u64 z[COLS1024] __attribute__((aligned(16)));
hash.c: | ^
hash.c: hash.c:191:14: warning: 'y' is static but declared in inline function 'F1024' which is not static
hash.c: 191 | static u64 y[COLS1024] __attribute__((aligned(16)));
hash.c: | ^
try.c: /usr/bin/ld: libcrypto_hash_groestl512.a(hash.o): in function `Transform':
try.c: hash.c:(.text+0x...): undefined reference to `F1024'
try.c: /usr/bin/ld: hash.c:(.text+0x...): undefined reference to `F512'
try.c: collect2: error: ld returned 1 exit status

Number of similar (compiler,implementation) pairs: 2, namely:
CompilerImplementations
gcc -march=native -mtune=native -O2 -fomit-frame-pointer -fwrapv -fPIC -fPIE T:opt64
gcc -march=native -mtune=native -O -fomit-frame-pointer -fwrapv -fPIC -fPIE T:opt64

Compiler output

Implementation: T:opt64
Security model: timingleaks
Compiler: gcc -march=native -mtune=native -O3 -fomit-frame-pointer -fwrapv -fPIC -fPIE
hash.c: hash.c:194:14: warning: 'inP' is static but declared in inline function 'F1024' which is not static
hash.c: 194 | static u64 inP[COLS1024] __attribute__((aligned(16)));
hash.c: | ^~~
hash.c: hash.c:193:14: warning: 'outQ' is static but declared in inline function 'F1024' which is not static
hash.c: 193 | static u64 outQ[COLS1024] __attribute__((aligned(16)));
hash.c: | ^~~~
hash.c: hash.c:192:14: warning: 'z' is static but declared in inline function 'F1024' which is not static
hash.c: 192 | static u64 z[COLS1024] __attribute__((aligned(16)));
hash.c: | ^
hash.c: hash.c:191:14: warning: 'y' is static but declared in inline function 'F1024' which is not static
hash.c: 191 | static u64 y[COLS1024] __attribute__((aligned(16)));
hash.c: | ^
try.c: /usr/bin/ld: libcrypto_hash_groestl512.a(hash.o): in function `Transform':
try.c: hash.c:(.text+0x...): undefined reference to `F1024'
try.c: /usr/bin/ld: hash.c:(.text+0x...): undefined reference to `F512'
try.c: /usr/bin/ld: libcrypto_hash_groestl512.a(hash.o): in function `Update':
try.c: hash.c:(.text+0x...): undefined reference to `F1024'
try.c: /usr/bin/ld: hash.c:(.text+0x...): undefined reference to `F512'
try.c: /usr/bin/ld: hash.c:(.text+0x...): undefined reference to `F1024'
try.c: /usr/bin/ld: hash.c:(.text+0x...): undefined reference to `F512'
try.c: /usr/bin/ld: libcrypto_hash_groestl512.a(hash.o): in function `Final':
try.c: hash.c:(.text+0x...): undefined reference to `F1024'
try.c: /usr/bin/ld: hash.c:(.text+0x...): undefined reference to `F1024'
try.c: /usr/bin/ld: hash.c:(.text+0x...): undefined reference to `F512'
try.c: /usr/bin/ld: hash.c:(.text+0x...): undefined reference to `F512'
try.c: collect2: error: ld returned 1 exit status

Number of similar (compiler,implementation) pairs: 1, namely:
CompilerImplementations
gcc -march=native -mtune=native -O3 -fomit-frame-pointer -fwrapv -fPIC -fPIE T:opt64

Compiler output

Implementation: T:opt64
Security model: timingleaks
Compiler: gcc -march=native -mtune=native -Os -fomit-frame-pointer -fwrapv -fPIC -fPIE
hash.c: hash.c:194:14: warning: 'inP' is static but declared in inline function 'F1024' which is not static
hash.c: 194 | static u64 inP[COLS1024] __attribute__((aligned(16)));
hash.c: | ^~~
hash.c: hash.c:193:14: warning: 'outQ' is static but declared in inline function 'F1024' which is not static
hash.c: 193 | static u64 outQ[COLS1024] __attribute__((aligned(16)));
hash.c: | ^~~~
hash.c: hash.c:192:14: warning: 'z' is static but declared in inline function 'F1024' which is not static
hash.c: 192 | static u64 z[COLS1024] __attribute__((aligned(16)));
hash.c: | ^
hash.c: hash.c:191:14: warning: 'y' is static but declared in inline function 'F1024' which is not static
hash.c: 191 | static u64 y[COLS1024] __attribute__((aligned(16)));
hash.c: | ^
try.c: /usr/bin/ld: libcrypto_hash_groestl512.a(hash.o): in function `Transform':
try.c: hash.c:(.text+0x...): undefined reference to `F512'
try.c: /usr/bin/ld: hash.c:(.text+0x...): undefined reference to `F1024'
try.c: collect2: error: ld returned 1 exit status

Number of similar (compiler,implementation) pairs: 1, namely:
CompilerImplementations
gcc -march=native -mtune=native -Os -fomit-frame-pointer -fwrapv -fPIC -fPIE T:opt64

Compiler output

Implementation: T:vperm
Security model: timingleaks
Compiler: clang -march=native -O2 -fomit-frame-pointer -fwrapv -Qunused-arguments -fPIC -fPIE
hash.c: hash.c:104:12: warning: comparison of array 'ctx->chaining' equal to a null pointer is always false [-Wtautological-pointer-compare]
hash.c: if (ctx->chaining == NULL || ctx->buffer == NULL)
hash.c: ~~~~~^~~~~~~~ ~~~~
hash.c: hash.c:104:37: warning: comparison of array 'ctx->buffer' equal to a null pointer is always false [-Wtautological-pointer-compare]
hash.c: if (ctx->chaining == NULL || ctx->buffer == NULL)
hash.c: ~~~~~^~~~~~ ~~~~
hash.c: In file included from hash.c:19:
hash.c: ./groestl-asm-vperm.h:1196:3: error: invalid operand for instruction
hash.c: VPERM_Transform_RoundConst();
hash.c: ^
hash.c: ./groestl-asm-vperm.h:1173:3: note: expanded from macro 'VPERM_Transform_RoundConst'
hash.c: VPERM_Transform_RoundConst_CNT2(0, 1);\
hash.c: ^
hash.c: ./groestl-asm-vperm.h:1158:8: note: expanded from macro 'VPERM_Transform_RoundConst_CNT2'
hash.c: asm ("movaps xmm0, [ROUND_CONST_P+"tostr(i)"*16]");\
hash.c: ^
hash.c: <inline asm>:1:15: note: instantiated into assembly here
hash.c: movaps xmm0, [ROUND_CONST_P+0*16]
hash.c: ^~~~~~~~~~~~~~~~~~~~
hash.c: In file included from hash.c:19:
hash.c: ./groestl-asm-vperm.h:1196:3: error: invalid operand for instruction
hash.c: VPERM_Transform_RoundConst();
hash.c: ^
hash.c: ./groestl-asm-vperm.h:1173:3: note: expanded from macro 'VPERM_Transform_RoundConst'
hash.c: VPERM_Transform_RoundConst_CNT2(0, 1);\
hash.c: ...

Number of similar (compiler,implementation) pairs: 5, namely:
CompilerImplementations
clang -march=native -O2 -fomit-frame-pointer -fwrapv -Qunused-arguments -fPIC -fPIE T:vperm
clang -march=native -O3 -fomit-frame-pointer -fwrapv -Qunused-arguments -fPIC -fPIE T:vperm
clang -march=native -O -fomit-frame-pointer -fwrapv -Qunused-arguments -fPIC -fPIE T:vperm
clang -march=native -Os -fomit-frame-pointer -fwrapv -Qunused-arguments -fPIC -fPIE T:vperm
clang -mcpu=native -O3 -fomit-frame-pointer -fwrapv -Qunused-arguments -fPIC -fPIE T:vperm

Compiler output

Implementation: T:vperm
Security model: timingleaks
Compiler: gcc -march=native -mtune=native -O2 -fomit-frame-pointer -fwrapv -fPIC -fPIE
try.c: /usr/bin/ld: libcrypto_hash_groestl512.a(hash.o): relocation R_X86_64_32S against symbol `ROUND_CONST_P' can not be used when making a PIE object; recompile with -fPIE
try.c: collect2: error: ld returned 1 exit status

Number of similar (compiler,implementation) pairs: 4, namely:
CompilerImplementations
gcc -march=native -mtune=native -O2 -fomit-frame-pointer -fwrapv -fPIC -fPIE T:vperm
gcc -march=native -mtune=native -O3 -fomit-frame-pointer -fwrapv -fPIC -fPIE T:vperm
gcc -march=native -mtune=native -O -fomit-frame-pointer -fwrapv -fPIC -fPIE T:vperm
gcc -march=native -mtune=native -Os -fomit-frame-pointer -fwrapv -fPIC -fPIE T:vperm

Compiler output

Implementation: T:vperm-intr
Security model: timingleaks
Compiler: clang -mcpu=native -O3 -fomit-frame-pointer -fwrapv -Qunused-arguments -fPIC -fPIE
hash.c: In file included from hash.c:34:
hash.c: ./groestl-intr-vperm.h:1102:3: error: always_inline function '_mm_shuffle_epi8' requires target feature 'ssse3', but would be inlined into function 'INIT' that is compiled without support for 'ssse3'
hash.c: VPERM_Transform_RoundConst();
hash.c: ^
hash.c: ./groestl-intr-vperm.h:1081:3: note: expanded from macro 'VPERM_Transform_RoundConst'
hash.c: VPERM_Transform_RoundConst_CNT2(0, 1);\
hash.c: ^
hash.c: ./groestl-intr-vperm.h:1070:3: note: expanded from macro 'VPERM_Transform_RoundConst_CNT2'
hash.c: VPERM_Transform_State(xmm0, xmm1, xmm2, xmm3, VPERM_IPT, xmm4, xmm5, xmm6, xmm7, xmm8, xmm9, xmm10);\
hash.c: ^
hash.c: ./groestl-intr-vperm.h:133:3: note: expanded from macro 'VPERM_Transform_State'
hash.c: VPERM_Transform_No_Const(a0, a1, t0, t1, t2, t3, c0, c1, c2);\
hash.c: ^
hash.c: ./groestl-intr-vperm.h:88:8: note: expanded from macro 'VPERM_Transform_No_Const'
hash.c: t2 = _mm_shuffle_epi8(t2, a0);\
hash.c: ^
hash.c: ./groestl-intr-vperm.h:1102:3: error: always_inline function '_mm_shuffle_epi8' requires target feature 'ssse3', but would be inlined into function 'INIT' that is compiled without support for 'ssse3'
hash.c: ./groestl-intr-vperm.h:1081:3: note: expanded from macro 'VPERM_Transform_RoundConst'
hash.c: VPERM_Transform_RoundConst_CNT2(0, 1);\
hash.c: ^
hash.c: ./groestl-intr-vperm.h:1070:3: note: expanded from macro 'VPERM_Transform_RoundConst_CNT2'
hash.c: VPERM_Transform_State(xmm0, xmm1, xmm2, xmm3, VPERM_IPT, xmm4, xmm5, xmm6, xmm7, xmm8, xmm9, xmm10);\
hash.c: ^
hash.c: ./groestl-intr-vperm.h:133:3: note: expanded from macro 'VPERM_Transform_State'
hash.c: VPERM_Transform_No_Const(a0, a1, t0, t1, t2, t3, c0, c1, c2);\
hash.c: ...

Number of similar (compiler,implementation) pairs: 1, namely:
CompilerImplementations
clang -mcpu=native -O3 -fomit-frame-pointer -fwrapv -Qunused-arguments -fPIC -fPIE T:vperm-intr

Namespace violations

Implementation: T:32bit-bytesliced-c-small
Security model: timingleaks
Compiler: clang -march=native -O2 -fomit-frame-pointer -fwrapv -Qunused-arguments -fPIC -fPIE
hash.o memxor T
hash.o mixbytes T
hash.o permutation T
hash.o setmessage T

Number of similar (compiler,implementation) pairs: 9, namely:
CompilerImplementations
clang -march=native -O2 -fomit-frame-pointer -fwrapv -Qunused-arguments -fPIC -fPIE T:32bit-bytesliced-c-small
clang -march=native -O3 -fomit-frame-pointer -fwrapv -Qunused-arguments -fPIC -fPIE T:32bit-bytesliced-c-small
clang -march=native -O -fomit-frame-pointer -fwrapv -Qunused-arguments -fPIC -fPIE T:32bit-bytesliced-c-small
clang -march=native -Os -fomit-frame-pointer -fwrapv -Qunused-arguments -fPIC -fPIE T:32bit-bytesliced-c-small
clang -mcpu=native -O3 -fomit-frame-pointer -fwrapv -Qunused-arguments -fPIC -fPIE T:32bit-bytesliced-c-small
gcc -march=native -mtune=native -O2 -fomit-frame-pointer -fwrapv -fPIC -fPIE T:32bit-bytesliced-c-small
gcc -march=native -mtune=native -O3 -fomit-frame-pointer -fwrapv -fPIC -fPIE T:32bit-bytesliced-c-small
gcc -march=native -mtune=native -O -fomit-frame-pointer -fwrapv -fPIC -fPIE T:32bit-bytesliced-c-small
gcc -march=native -mtune=native -Os -fomit-frame-pointer -fwrapv -fPIC -fPIE T:32bit-bytesliced-c-small

Namespace violations

Implementation: T:aesni-intr
Security model: timingleaks
Compiler: clang -march=native -O2 -fomit-frame-pointer -fwrapv -Qunused-arguments -fPIC -fPIE
hash.o ALL_1B C
hash.o ALL_FF C
hash.o Final T
hash.o Hash T
hash.o INIT T
hash.o Init T
hash.o OF1024 T
hash.o OutputTransformation T
hash.o ROUND_CONST_L0 C
hash.o ROUND_CONST_L7 C
hash.o ROUND_CONST_Lx C
hash.o ROUND_CONST_P C
hash.o ROUND_CONST_Q C
hash.o SUBSH_MASK C
hash.o TF1024 T
hash.o TRANSP_MASK C
hash.o Transform T
hash.o Update T

Number of similar (compiler,implementation) pairs: 16, namely:
CompilerImplementations
clang -march=native -O2 -fomit-frame-pointer -fwrapv -Qunused-arguments -fPIC -fPIE T:aesni-intr
clang -march=native -O3 -fomit-frame-pointer -fwrapv -Qunused-arguments -fPIC -fPIE T:aesni-intr
clang -march=native -O -fomit-frame-pointer -fwrapv -Qunused-arguments -fPIC -fPIE T:aesni-intr
clang -march=native -Os -fomit-frame-pointer -fwrapv -Qunused-arguments -fPIC -fPIE T:aesni-intr
gcc -march=native -mtune=native -O2 -fomit-frame-pointer -fwrapv -fPIC -fPIE T:aesni-intr
gcc -march=native -mtune=native -O3 -fomit-frame-pointer -fwrapv -fPIC -fPIE T:aesni-intr
gcc -march=native -mtune=native -O -fomit-frame-pointer -fwrapv -fPIC -fPIE T:aesni-intr
gcc -march=native -mtune=native -Os -fomit-frame-pointer -fwrapv -fPIC -fPIE T:aesni-intr
clang -march=native -O2 -fomit-frame-pointer -fwrapv -Qunused-arguments -fPIC -fPIE T:avx-intr
clang -march=native -O3 -fomit-frame-pointer -fwrapv -Qunused-arguments -fPIC -fPIE T:avx-intr
clang -march=native -O -fomit-frame-pointer -fwrapv -Qunused-arguments -fPIC -fPIE T:avx-intr
clang -march=native -Os -fomit-frame-pointer -fwrapv -Qunused-arguments -fPIC -fPIE T:avx-intr
gcc -march=native -mtune=native -O2 -fomit-frame-pointer -fwrapv -fPIC -fPIE T:avx-intr
gcc -march=native -mtune=native -O3 -fomit-frame-pointer -fwrapv -fPIC -fPIE T:avx-intr
gcc -march=native -mtune=native -O -fomit-frame-pointer -fwrapv -fPIC -fPIE T:avx-intr
gcc -march=native -mtune=native -Os -fomit-frame-pointer -fwrapv -fPIC -fPIE T:avx-intr

Namespace violations

Implementation: T:core2duo
Security model: timingleaks
Compiler: clang -march=native -O2 -fomit-frame-pointer -fwrapv -Qunused-arguments -fPIC -fPIE
hash.o Final T
hash.o Init T
hash.o OutputTransformation T
hash.o T0 R
hash.o T1 R
hash.o T2 R
hash.o T3 R
hash.o T4 R
hash.o T5 R
hash.o T6 R
hash.o T7 R
hash.o Transform T
hash.o Update T

Number of similar (compiler,implementation) pairs: 10, namely:
CompilerImplementations
clang -march=native -O2 -fomit-frame-pointer -fwrapv -Qunused-arguments -fPIC -fPIE T:core2duo
clang -march=native -O3 -fomit-frame-pointer -fwrapv -Qunused-arguments -fPIC -fPIE T:core2duo
clang -march=native -O -fomit-frame-pointer -fwrapv -Qunused-arguments -fPIC -fPIE T:core2duo
clang -march=native -Os -fomit-frame-pointer -fwrapv -Qunused-arguments -fPIC -fPIE T:core2duo
clang -mcpu=native -O3 -fomit-frame-pointer -fwrapv -Qunused-arguments -fPIC -fPIE T:core2duo
clang -march=native -O2 -fomit-frame-pointer -fwrapv -Qunused-arguments -fPIC -fPIE T:opteron
clang -march=native -O3 -fomit-frame-pointer -fwrapv -Qunused-arguments -fPIC -fPIE T:opteron
clang -march=native -O -fomit-frame-pointer -fwrapv -Qunused-arguments -fPIC -fPIE T:opteron
clang -march=native -Os -fomit-frame-pointer -fwrapv -Qunused-arguments -fPIC -fPIE T:opteron
clang -mcpu=native -O3 -fomit-frame-pointer -fwrapv -Qunused-arguments -fPIC -fPIE T:opteron

Namespace violations

Implementation: T:mmx
Security model: timingleaks
Compiler: clang -march=native -O2 -fomit-frame-pointer -fwrapv -Qunused-arguments -fPIC -fPIE
hash.o Final T
hash.o Hash T
hash.o Init T
hash.o OutputTransformation T
hash.o OutputTransformation1024 T
hash.o OutputTransformation512 T
hash.o PrintHash T
hash.o ROUNDP1024 T
hash.o ROUNDQ1024 T
hash.o T R
hash.o Transform T
hash.o Transform1024 T
hash.o Transform512 T
hash.o Update T

Number of similar (compiler,implementation) pairs: 9, namely:
CompilerImplementations
clang -march=native -O2 -fomit-frame-pointer -fwrapv -Qunused-arguments -fPIC -fPIE T:mmx
clang -march=native -O3 -fomit-frame-pointer -fwrapv -Qunused-arguments -fPIC -fPIE T:mmx
clang -march=native -O -fomit-frame-pointer -fwrapv -Qunused-arguments -fPIC -fPIE T:mmx
clang -march=native -Os -fomit-frame-pointer -fwrapv -Qunused-arguments -fPIC -fPIE T:mmx
clang -mcpu=native -O3 -fomit-frame-pointer -fwrapv -Qunused-arguments -fPIC -fPIE T:mmx
gcc -march=native -mtune=native -O2 -fomit-frame-pointer -fwrapv -fPIC -fPIE T:mmx
gcc -march=native -mtune=native -O3 -fomit-frame-pointer -fwrapv -fPIC -fPIE T:mmx
gcc -march=native -mtune=native -O -fomit-frame-pointer -fwrapv -fPIC -fPIE T:mmx
gcc -march=native -mtune=native -Os -fomit-frame-pointer -fwrapv -fPIC -fPIE T:mmx

Namespace violations

Implementation: T:opt32
Security model: timingleaks
Compiler: clang -march=native -O2 -fomit-frame-pointer -fwrapv -Qunused-arguments -fPIC -fPIE
hash.o F1024 T
hash.o F512 T
hash.o Final T
hash.o Hash T
hash.o Init T
hash.o OutputTransformation T
hash.o PrintHash T
hash.o RND1024P T
hash.o RND1024Q T
hash.o RND512P T
hash.o RND512Q T
hash.o T R
hash.o Transform T
hash.o Update T

Number of similar (compiler,implementation) pairs: 9, namely:
CompilerImplementations
clang -march=native -O2 -fomit-frame-pointer -fwrapv -Qunused-arguments -fPIC -fPIE T:opt32
clang -march=native -O3 -fomit-frame-pointer -fwrapv -Qunused-arguments -fPIC -fPIE T:opt32
clang -march=native -O -fomit-frame-pointer -fwrapv -Qunused-arguments -fPIC -fPIE T:opt32
clang -march=native -Os -fomit-frame-pointer -fwrapv -Qunused-arguments -fPIC -fPIE T:opt32
clang -mcpu=native -O3 -fomit-frame-pointer -fwrapv -Qunused-arguments -fPIC -fPIE T:opt32
gcc -march=native -mtune=native -O2 -fomit-frame-pointer -fwrapv -fPIC -fPIE T:opt32
gcc -march=native -mtune=native -O3 -fomit-frame-pointer -fwrapv -fPIC -fPIE T:opt32
gcc -march=native -mtune=native -O -fomit-frame-pointer -fwrapv -fPIC -fPIE T:opt32
gcc -march=native -mtune=native -Os -fomit-frame-pointer -fwrapv -fPIC -fPIE T:opt32

Namespace violations

Implementation: T:sphlib
Security model: timingleaks
Compiler: clang -march=native -O2 -fomit-frame-pointer -fwrapv -Qunused-arguments -fPIC -fPIE
groestl.o sph_groestl224 T
groestl.o sph_groestl224_addbits_and_close T
groestl.o sph_groestl224_close T
groestl.o sph_groestl224_init T
groestl.o sph_groestl256 T
groestl.o sph_groestl256_addbits_and_close T
groestl.o sph_groestl256_close T
groestl.o sph_groestl256_init T
groestl.o sph_groestl384 T
groestl.o sph_groestl384_addbits_and_close T
groestl.o sph_groestl384_close T
groestl.o sph_groestl384_init T
groestl.o sph_groestl512 T
groestl.o sph_groestl512_addbits_and_close T
groestl.o sph_groestl512_close T
groestl.o sph_groestl512_init T

Number of similar (compiler,implementation) pairs: 27, namely:
CompilerImplementations
clang -march=native -O2 -fomit-frame-pointer -fwrapv -Qunused-arguments -fPIC -fPIE T:sphlib
clang -march=native -O3 -fomit-frame-pointer -fwrapv -Qunused-arguments -fPIC -fPIE T:sphlib
clang -march=native -O -fomit-frame-pointer -fwrapv -Qunused-arguments -fPIC -fPIE T:sphlib
clang -march=native -Os -fomit-frame-pointer -fwrapv -Qunused-arguments -fPIC -fPIE T:sphlib
clang -mcpu=native -O3 -fomit-frame-pointer -fwrapv -Qunused-arguments -fPIC -fPIE T:sphlib
gcc -march=native -mtune=native -O2 -fomit-frame-pointer -fwrapv -fPIC -fPIE T:sphlib
gcc -march=native -mtune=native -O3 -fomit-frame-pointer -fwrapv -fPIC -fPIE T:sphlib
gcc -march=native -mtune=native -O -fomit-frame-pointer -fwrapv -fPIC -fPIE T:sphlib
gcc -march=native -mtune=native -Os -fomit-frame-pointer -fwrapv -fPIC -fPIE T:sphlib
clang -march=native -O2 -fomit-frame-pointer -fwrapv -Qunused-arguments -fPIC -fPIE T:sphlib-adapted
clang -march=native -O3 -fomit-frame-pointer -fwrapv -Qunused-arguments -fPIC -fPIE T:sphlib-adapted
clang -march=native -O -fomit-frame-pointer -fwrapv -Qunused-arguments -fPIC -fPIE T:sphlib-adapted
clang -march=native -Os -fomit-frame-pointer -fwrapv -Qunused-arguments -fPIC -fPIE T:sphlib-adapted
clang -mcpu=native -O3 -fomit-frame-pointer -fwrapv -Qunused-arguments -fPIC -fPIE T:sphlib-adapted
gcc -march=native -mtune=native -O2 -fomit-frame-pointer -fwrapv -fPIC -fPIE T:sphlib-adapted
gcc -march=native -mtune=native -O3 -fomit-frame-pointer -fwrapv -fPIC -fPIE T:sphlib-adapted
gcc -march=native -mtune=native -O -fomit-frame-pointer -fwrapv -fPIC -fPIE T:sphlib-adapted
gcc -march=native -mtune=native -Os -fomit-frame-pointer -fwrapv -fPIC -fPIE T:sphlib-adapted
clang -march=native -O2 -fomit-frame-pointer -fwrapv -Qunused-arguments -fPIC -fPIE T:sphlib-small
clang -march=native -O3 -fomit-frame-pointer -fwrapv -Qunused-arguments -fPIC -fPIE T:sphlib-small
clang -march=native -O -fomit-frame-pointer -fwrapv -Qunused-arguments -fPIC -fPIE T:sphlib-small
clang -march=native -Os -fomit-frame-pointer -fwrapv -Qunused-arguments -fPIC -fPIE T:sphlib-small
clang -mcpu=native -O3 -fomit-frame-pointer -fwrapv -Qunused-arguments -fPIC -fPIE T:sphlib-small
gcc -march=native -mtune=native -O2 -fomit-frame-pointer -fwrapv -fPIC -fPIE T:sphlib-small
gcc -march=native -mtune=native -O3 -fomit-frame-pointer -fwrapv -fPIC -fPIE T:sphlib-small
gcc -march=native -mtune=native -O -fomit-frame-pointer -fwrapv -fPIC -fPIE T:sphlib-small
gcc -march=native -mtune=native -Os -fomit-frame-pointer -fwrapv -fPIC -fPIE T:sphlib-small

Namespace violations

Implementation: T:vperm-intr
Security model: timingleaks
Compiler: clang -march=native -O2 -fomit-frame-pointer -fwrapv -Qunused-arguments -fPIC -fPIE
hash.o ALL_0F C
hash.o ALL_15 C
hash.o ALL_1B C
hash.o ALL_63 C
hash.o ALL_FF C
hash.o Final T
hash.o Hash T
hash.o INIT T
hash.o Init T
hash.o OF1024 T
hash.o OutputTransformation T
hash.o ROUND_CONST_L0 C
hash.o ROUND_CONST_L7 C
hash.o ROUND_CONST_Lx C
hash.o ROUND_CONST_P C
hash.o ROUND_CONST_Q C
hash.o SUBSH_MASK C
hash.o TF1024 T
hash.o TRANSP_MASK C
hash.o Transform T
hash.o Update T
hash.o VPERM_INV C
hash.o VPERM_IPT C
hash.o VPERM_OPT C
hash.o VPERM_SB1 C
hash.o VPERM_SB2 C
hash.o VPERM_SB4 C
hash.o VPERM_SBO C

Number of similar (compiler,implementation) pairs: 8, namely:
CompilerImplementations
clang -march=native -O2 -fomit-frame-pointer -fwrapv -Qunused-arguments -fPIC -fPIE T:vperm-intr
clang -march=native -O3 -fomit-frame-pointer -fwrapv -Qunused-arguments -fPIC -fPIE T:vperm-intr
clang -march=native -O -fomit-frame-pointer -fwrapv -Qunused-arguments -fPIC -fPIE T:vperm-intr
clang -march=native -Os -fomit-frame-pointer -fwrapv -Qunused-arguments -fPIC -fPIE T:vperm-intr
gcc -march=native -mtune=native -O2 -fomit-frame-pointer -fwrapv -fPIC -fPIE T:vperm-intr
gcc -march=native -mtune=native -O3 -fomit-frame-pointer -fwrapv -fPIC -fPIE T:vperm-intr
gcc -march=native -mtune=native -O -fomit-frame-pointer -fwrapv -fPIC -fPIE T:vperm-intr
gcc -march=native -mtune=native -Os -fomit-frame-pointer -fwrapv -fPIC -fPIE T:vperm-intr