Implementation notes: amd64, panther, crypto_sign/redgemss192

Computer: panther
Microarchitecture: amd64; Tiger Lake (806c1)
Architecture: amd64
CPU ID: GenuineIntel-000806c1-00-bfebfbff
SUPERCOP version: 20240625
Operation: crypto_sign
Primitive: redgemss192
TimeObject sizeTest sizeImplementationCompilerBenchmark dateSUPERCOP version
852928488064 0 087432 796 1784T:optgcc_-march=native_-mtune=native_-Os_-fwrapv_-fPIC_-fPIE_-gdwarf-4_-Wall2024062920240625
853014488176 0 087560 796 1784T:skylakegcc_-march=native_-mtune=native_-Os_-fwrapv_-fPIC_-fPIE_-gdwarf-4_-Wall2024062920240625
9186781118486 0 0116336 804 1816T:skylakegcc_-march=native_-mtune=native_-O3_-fwrapv_-fPIC_-fPIE_-gdwarf-4_-Wall2024062920240625
9309088118429 0 0116272 804 1816T:optgcc_-march=native_-mtune=native_-O3_-fwrapv_-fPIC_-fPIE_-gdwarf-4_-Wall2024062920240625
950671998231 0 097016 804 1816T:skylakegcc_-march=native_-mtune=native_-O2_-fwrapv_-fPIC_-fPIE_-gdwarf-4_-Wall2024062920240625
960498998174 0 096952 804 1816T:optgcc_-march=native_-mtune=native_-O2_-fwrapv_-fPIC_-fPIE_-gdwarf-4_-Wall2024062920240625
997988494928 0 093880 804 1816T:optgcc_-march=native_-mtune=native_-O_-fwrapv_-fPIC_-fPIE_-gdwarf-4_-Wall2024062920240625
999733694995 0 093944 804 1816T:skylakegcc_-march=native_-mtune=native_-O_-fwrapv_-fPIC_-fPIE_-gdwarf-4_-Wall2024062920240625
6244768949546 112 71784083 4004 6968T:refg++_-march=native_-mtune=native_-O2_-fwrapv_-fPIC_-fPIE_-gdwarf-4_-Wall2024062920240625
6323396742302 112 71776495 4004 6968T:refg++_-march=native_-mtune=native_-O_-fwrapv_-fPIC_-fPIE_-gdwarf-4_-Wall2024062920240625
6327878261605 112 71932827 4044 6904T:refclang++_-march=native_-O2_-fwrapv_-Qunused-arguments_-fPIC_-fPIE_-gdwarf-4_-Wall2024062920240625
6365164237154 112 71771811 3996 6936T:refg++_-march=native_-mtune=native_-Os_-fwrapv_-fPIC_-fPIE_-gdwarf-4_-Wall2024062920240625
6382835053189 112 71791331 4004 6968T:refg++_-march=native_-mtune=native_-O3_-fwrapv_-fPIC_-fPIE_-gdwarf-4_-Wall2024062920240625
6546996165870 112 71928065 4036 6904T:refclang++_-march=native_-O_-fwrapv_-Qunused-arguments_-fPIC_-fPIE_-gdwarf-4_-Wall2024062920240625
6681345894791 112 71937867 4044 6904T:refclang++_-march=native_-O3_-fwrapv_-Qunused-arguments_-fPIC_-fPIE_-gdwarf-4_-Wall2024062920240625
6686782241848 112 71915909 4036 6904T:refclang++_-march=native_-Os_-fwrapv_-Qunused-arguments_-fPIC_-fPIE_-gdwarf-4_-Wall2024062920240625

Compiler output


mul_gf2x.c: mul_gf2x.c:13:12: warning: implicit declaration of function '_mm_cvtsi128_si64x' is invalid in C99 [-Wimplicit-function-declaration]
mul_gf2x.c:     return MUL64LOW(x,y,0);
mul_gf2x.c:            ^
mul_gf2x.c: ./mul_gf2x.h:905:27: note: expanded from macro 'MUL64LOW'
mul_gf2x.c: #define MUL64LOW(x,y,pos) _mm_cvtsi128_si64x(_mm_clmulepi64_si128(x, y, pos))
mul_gf2x.c:                           ^
mul_gf2x.c: 1 warning generated.
sqr_gf2x.c: sqr_gf2x.c:27:12: warning: implicit declaration of function '_mm_cvtsi128_si64x' is invalid in C99 [-Wimplicit-function-declaration]
sqr_gf2x.c:     return _mm_cvtsi128_si64x(_mm_clmulepi64_si128(x,x,0));
sqr_gf2x.c:            ^
sqr_gf2x.c: sqr_gf2x.c:316:12: warning: implicit declaration of function '_mm_cvtsi128_si64x' is invalid in C99 [-Wimplicit-function-declaration]
sqr_gf2x.c:     return SQR64LOW(x,0);
sqr_gf2x.c:            ^
sqr_gf2x.c: ./sqr_gf2x.h:250:25: note: expanded from macro 'SQR64LOW'
sqr_gf2x.c: #define SQR64LOW(x,pos) _mm_cvtsi128_si64x(_mm_clmulepi64_si128(x, x, pos))
sqr_gf2x.c:                         ^
sqr_gf2x.c: 2 warnings generated.
try.c: /usr/bin/ld: libcrypto_sign_redgemss192.a(mul_gf2x.o): in function `RedGeMSS_192U_mul64low':
try.c: .../supercop-data/panther/amd64/try/c/clang_-march=native_-O2_-fwrapv_-Qunused-arguments_-fPIC_-fPIE_-gdwarf-4_-Wall/timingleaks/crypto_sign/redgemss192/opt/work/mul_gf2x.c:13: undefined reference to `_mm_cvtsi128_si64x'
try.c: /usr/bin/ld: libcrypto_sign_redgemss192.a(sqr_gf2x.o): in function `RedGeMSS_192U_sqr64low':
try.c: .../supercop-data/panther/amd64/try/c/clang_-march=native_-O2_-fwrapv_-Qunused-arguments_-fPIC_-fPIE_-gdwarf-4_-Wall/timingleaks/crypto_sign/redgemss192/opt/work/sqr_gf2x.c:27: undefined reference to `_mm_cvtsi128_si64x'
try.c: /usr/bin/ld: libcrypto_sign_redgemss192.a(sqr_gf2x.o): in function `RedGeMSS_192U_old_square64low':
try.c: .../supercop-data/panther/amd64/try/c/clang_-march=native_-O2_-fwrapv_-Qunused-arguments_-fPIC_-fPIE_-gdwarf-4_-Wall/timingleaks/crypto_sign/redgemss192/opt/work/sqr_gf2x.c:316: undefined reference to `_mm_cvtsi128_si64x'
try.c: clang: error: linker command failed with exit code 1 (use -v to see invocation)

Number of similar (implementation,compiler) pairs: 1, namely:
ImplementationCompiler
T:optclang -march=native -O2 -fwrapv -Qunused-arguments -fPIC -fPIE -gdwarf-4 -Wall (Debian_Clang_11.0.1)

Compiler output


mul_gf2x.c: mul_gf2x.c:13:12: warning: implicit declaration of function '_mm_cvtsi128_si64x' is invalid in C99 [-Wimplicit-function-declaration]
mul_gf2x.c:     return MUL64LOW(x,y,0);
mul_gf2x.c:            ^
mul_gf2x.c: ./mul_gf2x.h:905:27: note: expanded from macro 'MUL64LOW'
mul_gf2x.c: #define MUL64LOW(x,y,pos) _mm_cvtsi128_si64x(_mm_clmulepi64_si128(x, y, pos))
mul_gf2x.c:                           ^
mul_gf2x.c: 1 warning generated.
sqr_gf2x.c: sqr_gf2x.c:27:12: warning: implicit declaration of function '_mm_cvtsi128_si64x' is invalid in C99 [-Wimplicit-function-declaration]
sqr_gf2x.c:     return _mm_cvtsi128_si64x(_mm_clmulepi64_si128(x,x,0));
sqr_gf2x.c:            ^
sqr_gf2x.c: sqr_gf2x.c:316:12: warning: implicit declaration of function '_mm_cvtsi128_si64x' is invalid in C99 [-Wimplicit-function-declaration]
sqr_gf2x.c:     return SQR64LOW(x,0);
sqr_gf2x.c:            ^
sqr_gf2x.c: ./sqr_gf2x.h:250:25: note: expanded from macro 'SQR64LOW'
sqr_gf2x.c: #define SQR64LOW(x,pos) _mm_cvtsi128_si64x(_mm_clmulepi64_si128(x, x, pos))
sqr_gf2x.c:                         ^
sqr_gf2x.c: 2 warnings generated.
try.c: /usr/bin/ld: libcrypto_sign_redgemss192.a(mul_gf2x.o): in function `RedGeMSS_192U_mul64low':
try.c: .../supercop-data/panther/amd64/try/c/clang_-march=native_-O3_-fwrapv_-Qunused-arguments_-fPIC_-fPIE_-gdwarf-4_-Wall/timingleaks/crypto_sign/redgemss192/opt/work/mul_gf2x.c:13: undefined reference to `_mm_cvtsi128_si64x'
try.c: /usr/bin/ld: libcrypto_sign_redgemss192.a(sqr_gf2x.o): in function `RedGeMSS_192U_sqr64low':
try.c: .../supercop-data/panther/amd64/try/c/clang_-march=native_-O3_-fwrapv_-Qunused-arguments_-fPIC_-fPIE_-gdwarf-4_-Wall/timingleaks/crypto_sign/redgemss192/opt/work/sqr_gf2x.c:27: undefined reference to `_mm_cvtsi128_si64x'
try.c: /usr/bin/ld: libcrypto_sign_redgemss192.a(sqr_gf2x.o): in function `RedGeMSS_192U_old_square64low':
try.c: .../supercop-data/panther/amd64/try/c/clang_-march=native_-O3_-fwrapv_-Qunused-arguments_-fPIC_-fPIE_-gdwarf-4_-Wall/timingleaks/crypto_sign/redgemss192/opt/work/sqr_gf2x.c:316: undefined reference to `_mm_cvtsi128_si64x'
try.c: clang: error: linker command failed with exit code 1 (use -v to see invocation)

Number of similar (implementation,compiler) pairs: 1, namely:
ImplementationCompiler
T:optclang -march=native -O3 -fwrapv -Qunused-arguments -fPIC -fPIE -gdwarf-4 -Wall (Debian_Clang_11.0.1)

Compiler output


mul_gf2x.c: mul_gf2x.c:13:12: warning: implicit declaration of function '_mm_cvtsi128_si64x' is invalid in C99 [-Wimplicit-function-declaration]
mul_gf2x.c:     return MUL64LOW(x,y,0);
mul_gf2x.c:            ^
mul_gf2x.c: ./mul_gf2x.h:905:27: note: expanded from macro 'MUL64LOW'
mul_gf2x.c: #define MUL64LOW(x,y,pos) _mm_cvtsi128_si64x(_mm_clmulepi64_si128(x, y, pos))
mul_gf2x.c:                           ^
mul_gf2x.c: 1 warning generated.
sqr_gf2x.c: sqr_gf2x.c:27:12: warning: implicit declaration of function '_mm_cvtsi128_si64x' is invalid in C99 [-Wimplicit-function-declaration]
sqr_gf2x.c:     return _mm_cvtsi128_si64x(_mm_clmulepi64_si128(x,x,0));
sqr_gf2x.c:            ^
sqr_gf2x.c: sqr_gf2x.c:316:12: warning: implicit declaration of function '_mm_cvtsi128_si64x' is invalid in C99 [-Wimplicit-function-declaration]
sqr_gf2x.c:     return SQR64LOW(x,0);
sqr_gf2x.c:            ^
sqr_gf2x.c: ./sqr_gf2x.h:250:25: note: expanded from macro 'SQR64LOW'
sqr_gf2x.c: #define SQR64LOW(x,pos) _mm_cvtsi128_si64x(_mm_clmulepi64_si128(x, x, pos))
sqr_gf2x.c:                         ^
sqr_gf2x.c: 2 warnings generated.
try.c: /usr/bin/ld: libcrypto_sign_redgemss192.a(mul_gf2x.o): in function `RedGeMSS_192U_mul64low':
try.c: .../supercop-data/panther/amd64/try/c/clang_-march=native_-O_-fwrapv_-Qunused-arguments_-fPIC_-fPIE_-gdwarf-4_-Wall/timingleaks/crypto_sign/redgemss192/opt/work/mul_gf2x.c:13: undefined reference to `_mm_cvtsi128_si64x'
try.c: /usr/bin/ld: libcrypto_sign_redgemss192.a(sqr_gf2x.o): in function `RedGeMSS_192U_sqr64low':
try.c: .../supercop-data/panther/amd64/try/c/clang_-march=native_-O_-fwrapv_-Qunused-arguments_-fPIC_-fPIE_-gdwarf-4_-Wall/timingleaks/crypto_sign/redgemss192/opt/work/sqr_gf2x.c:27: undefined reference to `_mm_cvtsi128_si64x'
try.c: /usr/bin/ld: libcrypto_sign_redgemss192.a(sqr_gf2x.o): in function `RedGeMSS_192U_old_square64low':
try.c: .../supercop-data/panther/amd64/try/c/clang_-march=native_-O_-fwrapv_-Qunused-arguments_-fPIC_-fPIE_-gdwarf-4_-Wall/timingleaks/crypto_sign/redgemss192/opt/work/sqr_gf2x.c:316: undefined reference to `_mm_cvtsi128_si64x'
try.c: clang: error: linker command failed with exit code 1 (use -v to see invocation)

Number of similar (implementation,compiler) pairs: 1, namely:
ImplementationCompiler
T:optclang -march=native -O -fwrapv -Qunused-arguments -fPIC -fPIE -gdwarf-4 -Wall (Debian_Clang_11.0.1)

Compiler output


mul_gf2x.c: mul_gf2x.c:13:12: warning: implicit declaration of function '_mm_cvtsi128_si64x' is invalid in C99 [-Wimplicit-function-declaration]
mul_gf2x.c:     return MUL64LOW(x,y,0);
mul_gf2x.c:            ^
mul_gf2x.c: ./mul_gf2x.h:905:27: note: expanded from macro 'MUL64LOW'
mul_gf2x.c: #define MUL64LOW(x,y,pos) _mm_cvtsi128_si64x(_mm_clmulepi64_si128(x, y, pos))
mul_gf2x.c:                           ^
mul_gf2x.c: 1 warning generated.
sqr_gf2x.c: sqr_gf2x.c:27:12: warning: implicit declaration of function '_mm_cvtsi128_si64x' is invalid in C99 [-Wimplicit-function-declaration]
sqr_gf2x.c:     return _mm_cvtsi128_si64x(_mm_clmulepi64_si128(x,x,0));
sqr_gf2x.c:            ^
sqr_gf2x.c: sqr_gf2x.c:316:12: warning: implicit declaration of function '_mm_cvtsi128_si64x' is invalid in C99 [-Wimplicit-function-declaration]
sqr_gf2x.c:     return SQR64LOW(x,0);
sqr_gf2x.c:            ^
sqr_gf2x.c: ./sqr_gf2x.h:250:25: note: expanded from macro 'SQR64LOW'
sqr_gf2x.c: #define SQR64LOW(x,pos) _mm_cvtsi128_si64x(_mm_clmulepi64_si128(x, x, pos))
sqr_gf2x.c:                         ^
sqr_gf2x.c: 2 warnings generated.
try.c: /usr/bin/ld: libcrypto_sign_redgemss192.a(mul_gf2x.o): in function `RedGeMSS_192U_mul64low':
try.c: .../supercop-data/panther/amd64/try/c/clang_-march=native_-Os_-fwrapv_-Qunused-arguments_-fPIC_-fPIE_-gdwarf-4_-Wall/timingleaks/crypto_sign/redgemss192/opt/work/mul_gf2x.c:13: undefined reference to `_mm_cvtsi128_si64x'
try.c: /usr/bin/ld: libcrypto_sign_redgemss192.a(sqr_gf2x.o): in function `RedGeMSS_192U_sqr64low':
try.c: .../supercop-data/panther/amd64/try/c/clang_-march=native_-Os_-fwrapv_-Qunused-arguments_-fPIC_-fPIE_-gdwarf-4_-Wall/timingleaks/crypto_sign/redgemss192/opt/work/sqr_gf2x.c:27: undefined reference to `_mm_cvtsi128_si64x'
try.c: /usr/bin/ld: libcrypto_sign_redgemss192.a(sqr_gf2x.o): in function `RedGeMSS_192U_old_square64low':
try.c: .../supercop-data/panther/amd64/try/c/clang_-march=native_-Os_-fwrapv_-Qunused-arguments_-fPIC_-fPIE_-gdwarf-4_-Wall/timingleaks/crypto_sign/redgemss192/opt/work/sqr_gf2x.c:316: undefined reference to `_mm_cvtsi128_si64x'
try.c: clang: error: linker command failed with exit code 1 (use -v to see invocation)

Number of similar (implementation,compiler) pairs: 1, namely:
ImplementationCompiler
T:optclang -march=native -Os -fwrapv -Qunused-arguments -fPIC -fPIE -gdwarf-4 -Wall (Debian_Clang_11.0.1)

Compiler output


arith_gf2n.c: In file included from arith_gf2n.c:1:
arith_gf2n.c: In file included from ./arith_gf2n.h:9:
arith_gf2n.c: In file included from ./tools_gf2n.h:162:
arith_gf2n.c: ./mul_gf2x.h:17:14: fatal error: 'gf2x/gf2x_mul1.h' file not found
arith_gf2n.c:     #include <gf2x/gf2x_mul1.h>
arith_gf2n.c:              ^~~~~~~~~~~~~~~~~~
arith_gf2n.c: 1 error generated.

Number of similar (implementation,compiler) pairs: 2, namely:
ImplementationCompiler
T:optclang -mcpu=native -O3 -fwrapv -Qunused-arguments -fPIC -fPIE -gdwarf-4 -Wall (Debian_Clang_11.0.1)
T:skylakeclang -mcpu=native -O3 -fwrapv -Qunused-arguments -fPIC -fPIE -gdwarf-4 -Wall (Debian_Clang_11.0.1)

Compiler output


KAT_int.c: clang: warning: treating 'c' input as 'c++' when in C++ mode, this behavior is deprecated [-Wdeprecated]
bit.c: clang: warning: treating 'c' input as 'c++' when in C++ mode, this behavior is deprecated [-Wdeprecated]
convMQS_gf2.c: clang: warning: treating 'c' input as 'c++' when in C++ mode, this behavior is deprecated [-Wdeprecated]
evalMQnocst_gf2.c: clang: warning: treating 'c' input as 'c++' when in C++ mode, this behavior is deprecated [-Wdeprecated]
printgf2x.c: clang: warning: treating 'c' input as 'c++' when in C++ mode, this behavior is deprecated [-Wdeprecated]
sign.c: clang: warning: treating 'c' input as 'c++' when in C++ mode, this behavior is deprecated [-Wdeprecated]
sign_openHFE.c: clang: warning: treating 'c' input as 'c++' when in C++ mode, this behavior is deprecated [-Wdeprecated]

Number of similar (implementation,compiler) pairs: 4, namely:
ImplementationCompiler
T:refclang++ -march=native -O2 -fwrapv -Qunused-arguments -fPIC -fPIE -gdwarf-4 -Wall (Debian_Clang_11.0.1)
T:refclang++ -march=native -O3 -fwrapv -Qunused-arguments -fPIC -fPIE -gdwarf-4 -Wall (Debian_Clang_11.0.1)
T:refclang++ -march=native -O -fwrapv -Qunused-arguments -fPIC -fPIE -gdwarf-4 -Wall (Debian_Clang_11.0.1)
T:refclang++ -march=native -Os -fwrapv -Qunused-arguments -fPIC -fPIE -gdwarf-4 -Wall (Debian_Clang_11.0.1)

Compiler output


mul_gf2x.c: mul_gf2x.c:13:12: warning: implicit declaration of function '_mm_cvtsi128_si64x' is invalid in C99 [-Wimplicit-function-declaration]
mul_gf2x.c:     return MUL64LOW(x,y,0);
mul_gf2x.c:            ^
mul_gf2x.c: ./mul_gf2x.h:905:27: note: expanded from macro 'MUL64LOW'
mul_gf2x.c: #define MUL64LOW(x,y,pos) _mm_cvtsi128_si64x(_mm_clmulepi64_si128(x, y, pos))
mul_gf2x.c:                           ^
mul_gf2x.c: 1 warning generated.
sqr_gf2x.c: sqr_gf2x.c:27:12: warning: implicit declaration of function '_mm_cvtsi128_si64x' is invalid in C99 [-Wimplicit-function-declaration]
sqr_gf2x.c:     return _mm_cvtsi128_si64x(_mm_clmulepi64_si128(x,x,0));
sqr_gf2x.c:            ^
sqr_gf2x.c: sqr_gf2x.c:316:12: warning: implicit declaration of function '_mm_cvtsi128_si64x' is invalid in C99 [-Wimplicit-function-declaration]
sqr_gf2x.c:     return SQR64LOW(x,0);
sqr_gf2x.c:            ^
sqr_gf2x.c: ./sqr_gf2x.h:250:25: note: expanded from macro 'SQR64LOW'
sqr_gf2x.c: #define SQR64LOW(x,pos) _mm_cvtsi128_si64x(_mm_clmulepi64_si128(x, x, pos))
sqr_gf2x.c:                         ^
sqr_gf2x.c: 2 warnings generated.
try.c: /usr/bin/ld: libcrypto_sign_redgemss192.a(mul_gf2x.o): in function `RedGeMSS_192U_mul64low':
try.c: .../supercop-data/panther/amd64/try/c/clang_-march=native_-O2_-fwrapv_-Qunused-arguments_-fPIC_-fPIE_-gdwarf-4_-Wall/timingleaks/crypto_sign/redgemss192/skylake/work/mul_gf2x.c:13: undefined reference to `_mm_cvtsi128_si64x'
try.c: /usr/bin/ld: libcrypto_sign_redgemss192.a(sqr_gf2x.o): in function `RedGeMSS_192U_sqr64low':
try.c: .../supercop-data/panther/amd64/try/c/clang_-march=native_-O2_-fwrapv_-Qunused-arguments_-fPIC_-fPIE_-gdwarf-4_-Wall/timingleaks/crypto_sign/redgemss192/skylake/work/sqr_gf2x.c:27: undefined reference to `_mm_cvtsi128_si64x'
try.c: /usr/bin/ld: libcrypto_sign_redgemss192.a(sqr_gf2x.o): in function `RedGeMSS_192U_old_square64low':
try.c: .../supercop-data/panther/amd64/try/c/clang_-march=native_-O2_-fwrapv_-Qunused-arguments_-fPIC_-fPIE_-gdwarf-4_-Wall/timingleaks/crypto_sign/redgemss192/skylake/work/sqr_gf2x.c:316: undefined reference to `_mm_cvtsi128_si64x'
try.c: clang: error: linker command failed with exit code 1 (use -v to see invocation)

Number of similar (implementation,compiler) pairs: 1, namely:
ImplementationCompiler
T:skylakeclang -march=native -O2 -fwrapv -Qunused-arguments -fPIC -fPIE -gdwarf-4 -Wall (Debian_Clang_11.0.1)

Compiler output


mul_gf2x.c: mul_gf2x.c:13:12: warning: implicit declaration of function '_mm_cvtsi128_si64x' is invalid in C99 [-Wimplicit-function-declaration]
mul_gf2x.c:     return MUL64LOW(x,y,0);
mul_gf2x.c:            ^
mul_gf2x.c: ./mul_gf2x.h:905:27: note: expanded from macro 'MUL64LOW'
mul_gf2x.c: #define MUL64LOW(x,y,pos) _mm_cvtsi128_si64x(_mm_clmulepi64_si128(x, y, pos))
mul_gf2x.c:                           ^
mul_gf2x.c: 1 warning generated.
sqr_gf2x.c: sqr_gf2x.c:27:12: warning: implicit declaration of function '_mm_cvtsi128_si64x' is invalid in C99 [-Wimplicit-function-declaration]
sqr_gf2x.c:     return _mm_cvtsi128_si64x(_mm_clmulepi64_si128(x,x,0));
sqr_gf2x.c:            ^
sqr_gf2x.c: sqr_gf2x.c:316:12: warning: implicit declaration of function '_mm_cvtsi128_si64x' is invalid in C99 [-Wimplicit-function-declaration]
sqr_gf2x.c:     return SQR64LOW(x,0);
sqr_gf2x.c:            ^
sqr_gf2x.c: ./sqr_gf2x.h:250:25: note: expanded from macro 'SQR64LOW'
sqr_gf2x.c: #define SQR64LOW(x,pos) _mm_cvtsi128_si64x(_mm_clmulepi64_si128(x, x, pos))
sqr_gf2x.c:                         ^
sqr_gf2x.c: 2 warnings generated.
try.c: /usr/bin/ld: libcrypto_sign_redgemss192.a(mul_gf2x.o): in function `RedGeMSS_192U_mul64low':
try.c: .../supercop-data/panther/amd64/try/c/clang_-march=native_-O3_-fwrapv_-Qunused-arguments_-fPIC_-fPIE_-gdwarf-4_-Wall/timingleaks/crypto_sign/redgemss192/skylake/work/mul_gf2x.c:13: undefined reference to `_mm_cvtsi128_si64x'
try.c: /usr/bin/ld: libcrypto_sign_redgemss192.a(sqr_gf2x.o): in function `RedGeMSS_192U_sqr64low':
try.c: .../supercop-data/panther/amd64/try/c/clang_-march=native_-O3_-fwrapv_-Qunused-arguments_-fPIC_-fPIE_-gdwarf-4_-Wall/timingleaks/crypto_sign/redgemss192/skylake/work/sqr_gf2x.c:27: undefined reference to `_mm_cvtsi128_si64x'
try.c: /usr/bin/ld: libcrypto_sign_redgemss192.a(sqr_gf2x.o): in function `RedGeMSS_192U_old_square64low':
try.c: .../supercop-data/panther/amd64/try/c/clang_-march=native_-O3_-fwrapv_-Qunused-arguments_-fPIC_-fPIE_-gdwarf-4_-Wall/timingleaks/crypto_sign/redgemss192/skylake/work/sqr_gf2x.c:316: undefined reference to `_mm_cvtsi128_si64x'
try.c: clang: error: linker command failed with exit code 1 (use -v to see invocation)

Number of similar (implementation,compiler) pairs: 1, namely:
ImplementationCompiler
T:skylakeclang -march=native -O3 -fwrapv -Qunused-arguments -fPIC -fPIE -gdwarf-4 -Wall (Debian_Clang_11.0.1)

Compiler output


mul_gf2x.c: mul_gf2x.c:13:12: warning: implicit declaration of function '_mm_cvtsi128_si64x' is invalid in C99 [-Wimplicit-function-declaration]
mul_gf2x.c:     return MUL64LOW(x,y,0);
mul_gf2x.c:            ^
mul_gf2x.c: ./mul_gf2x.h:905:27: note: expanded from macro 'MUL64LOW'
mul_gf2x.c: #define MUL64LOW(x,y,pos) _mm_cvtsi128_si64x(_mm_clmulepi64_si128(x, y, pos))
mul_gf2x.c:                           ^
mul_gf2x.c: 1 warning generated.
sqr_gf2x.c: sqr_gf2x.c:27:12: warning: implicit declaration of function '_mm_cvtsi128_si64x' is invalid in C99 [-Wimplicit-function-declaration]
sqr_gf2x.c:     return _mm_cvtsi128_si64x(_mm_clmulepi64_si128(x,x,0));
sqr_gf2x.c:            ^
sqr_gf2x.c: sqr_gf2x.c:316:12: warning: implicit declaration of function '_mm_cvtsi128_si64x' is invalid in C99 [-Wimplicit-function-declaration]
sqr_gf2x.c:     return SQR64LOW(x,0);
sqr_gf2x.c:            ^
sqr_gf2x.c: ./sqr_gf2x.h:250:25: note: expanded from macro 'SQR64LOW'
sqr_gf2x.c: #define SQR64LOW(x,pos) _mm_cvtsi128_si64x(_mm_clmulepi64_si128(x, x, pos))
sqr_gf2x.c:                         ^
sqr_gf2x.c: 2 warnings generated.
try.c: /usr/bin/ld: libcrypto_sign_redgemss192.a(mul_gf2x.o): in function `RedGeMSS_192U_mul64low':
try.c: .../supercop-data/panther/amd64/try/c/clang_-march=native_-O_-fwrapv_-Qunused-arguments_-fPIC_-fPIE_-gdwarf-4_-Wall/timingleaks/crypto_sign/redgemss192/skylake/work/mul_gf2x.c:13: undefined reference to `_mm_cvtsi128_si64x'
try.c: /usr/bin/ld: libcrypto_sign_redgemss192.a(sqr_gf2x.o): in function `RedGeMSS_192U_sqr64low':
try.c: .../supercop-data/panther/amd64/try/c/clang_-march=native_-O_-fwrapv_-Qunused-arguments_-fPIC_-fPIE_-gdwarf-4_-Wall/timingleaks/crypto_sign/redgemss192/skylake/work/sqr_gf2x.c:27: undefined reference to `_mm_cvtsi128_si64x'
try.c: /usr/bin/ld: libcrypto_sign_redgemss192.a(sqr_gf2x.o): in function `RedGeMSS_192U_old_square64low':
try.c: .../supercop-data/panther/amd64/try/c/clang_-march=native_-O_-fwrapv_-Qunused-arguments_-fPIC_-fPIE_-gdwarf-4_-Wall/timingleaks/crypto_sign/redgemss192/skylake/work/sqr_gf2x.c:316: undefined reference to `_mm_cvtsi128_si64x'
try.c: clang: error: linker command failed with exit code 1 (use -v to see invocation)

Number of similar (implementation,compiler) pairs: 1, namely:
ImplementationCompiler
T:skylakeclang -march=native -O -fwrapv -Qunused-arguments -fPIC -fPIE -gdwarf-4 -Wall (Debian_Clang_11.0.1)

Compiler output


mul_gf2x.c: mul_gf2x.c:13:12: warning: implicit declaration of function '_mm_cvtsi128_si64x' is invalid in C99 [-Wimplicit-function-declaration]
mul_gf2x.c:     return MUL64LOW(x,y,0);
mul_gf2x.c:            ^
mul_gf2x.c: ./mul_gf2x.h:905:27: note: expanded from macro 'MUL64LOW'
mul_gf2x.c: #define MUL64LOW(x,y,pos) _mm_cvtsi128_si64x(_mm_clmulepi64_si128(x, y, pos))
mul_gf2x.c:                           ^
mul_gf2x.c: 1 warning generated.
sqr_gf2x.c: sqr_gf2x.c:27:12: warning: implicit declaration of function '_mm_cvtsi128_si64x' is invalid in C99 [-Wimplicit-function-declaration]
sqr_gf2x.c:     return _mm_cvtsi128_si64x(_mm_clmulepi64_si128(x,x,0));
sqr_gf2x.c:            ^
sqr_gf2x.c: sqr_gf2x.c:316:12: warning: implicit declaration of function '_mm_cvtsi128_si64x' is invalid in C99 [-Wimplicit-function-declaration]
sqr_gf2x.c:     return SQR64LOW(x,0);
sqr_gf2x.c:            ^
sqr_gf2x.c: ./sqr_gf2x.h:250:25: note: expanded from macro 'SQR64LOW'
sqr_gf2x.c: #define SQR64LOW(x,pos) _mm_cvtsi128_si64x(_mm_clmulepi64_si128(x, x, pos))
sqr_gf2x.c:                         ^
sqr_gf2x.c: 2 warnings generated.
try.c: /usr/bin/ld: libcrypto_sign_redgemss192.a(mul_gf2x.o): in function `RedGeMSS_192U_mul64low':
try.c: .../supercop-data/panther/amd64/try/c/clang_-march=native_-Os_-fwrapv_-Qunused-arguments_-fPIC_-fPIE_-gdwarf-4_-Wall/timingleaks/crypto_sign/redgemss192/skylake/work/mul_gf2x.c:13: undefined reference to `_mm_cvtsi128_si64x'
try.c: /usr/bin/ld: libcrypto_sign_redgemss192.a(sqr_gf2x.o): in function `RedGeMSS_192U_sqr64low':
try.c: .../supercop-data/panther/amd64/try/c/clang_-march=native_-Os_-fwrapv_-Qunused-arguments_-fPIC_-fPIE_-gdwarf-4_-Wall/timingleaks/crypto_sign/redgemss192/skylake/work/sqr_gf2x.c:27: undefined reference to `_mm_cvtsi128_si64x'
try.c: /usr/bin/ld: libcrypto_sign_redgemss192.a(sqr_gf2x.o): in function `RedGeMSS_192U_old_square64low':
try.c: .../supercop-data/panther/amd64/try/c/clang_-march=native_-Os_-fwrapv_-Qunused-arguments_-fPIC_-fPIE_-gdwarf-4_-Wall/timingleaks/crypto_sign/redgemss192/skylake/work/sqr_gf2x.c:316: undefined reference to `_mm_cvtsi128_si64x'
try.c: clang: error: linker command failed with exit code 1 (use -v to see invocation)

Number of similar (implementation,compiler) pairs: 1, namely:
ImplementationCompiler
T:skylakeclang -march=native -Os -fwrapv -Qunused-arguments -fPIC -fPIE -gdwarf-4 -Wall (Debian_Clang_11.0.1)