Implementation notes: amd64, panther, crypto_kem/rolloi128

Computer: panther
Microarchitecture: amd64; Tiger Lake (806c1)
Architecture: amd64
CPU ID: GenuineIntel-000806c1-00-bfebfbff
SUPERCOP version: 20240625
Operation: crypto_kem
Primitive: rolloi128
TimeObject sizeTest sizeImplementationCompilerBenchmark dateSUPERCOP version
113273830157 0 2460485 884 1816T:avxgcc_-march=native_-mtune=native_-O3_-fwrapv_-fPIC_-fPIE_-gdwarf-4_-Wall2024063020240625
113939228036 0 2456221 884 1816T:avxgcc_-march=native_-mtune=native_-O2_-fwrapv_-fPIC_-fPIE_-gdwarf-4_-Wall2024063020240625
117436029720 0 2460103 924 1752T:avxclang_-march=native_-O3_-fwrapv_-Qunused-arguments_-fPIC_-fPIE_-gdwarf-4_-Wall2024063020240625
118891227680 0 2458047 924 1752T:avxclang_-march=native_-O2_-fwrapv_-Qunused-arguments_-fPIC_-fPIE_-gdwarf-4_-Wall2024063020240625
122117621398 0 2448861 884 1816T:avxgcc_-march=native_-mtune=native_-O_-fwrapv_-fPIC_-fPIE_-gdwarf-4_-Wall2024063020240625
123981620592 0 2447623 908 1752T:avxclang_-march=native_-Os_-fwrapv_-Qunused-arguments_-fPIC_-fPIE_-gdwarf-4_-Wall2024063020240625
124779021850 0 2449135 908 1752T:avxclang_-march=native_-O_-fwrapv_-Qunused-arguments_-fPIC_-fPIE_-gdwarf-4_-Wall2024063020240625
131191919044 0 2445437 876 1784T:avxgcc_-march=native_-mtune=native_-Os_-fwrapv_-fPIC_-fPIE_-gdwarf-4_-Wall2024063020240625

Compiler output


lrpc.c: lrpc.c:118:13: warning: unknown pragma ignored [-Wunknown-pragmas]
lrpc.c: #pragma GCC push_options
lrpc.c:             ^
lrpc.c: lrpc.c:119:13: warning: unknown pragma ignored [-Wunknown-pragmas]
lrpc.c: #pragma GCC optimize ("O0")
lrpc.c:             ^
lrpc.c: lrpc.c:176:13: warning: unknown pragma ignored [-Wunknown-pragmas]
lrpc.c: #pragma GCC pop_options
lrpc.c:             ^
lrpc.c: 3 warnings generated.
rbc_qre.c: rbc_qre.c:123:13: warning: variable 'modulus' is used uninitialized whenever 'if' condition is false [-Wsometimes-uninitialized]
rbc_qre.c:   } else if(degree == 211) {
rbc_qre.c:             ^~~~~~~~~~~~~
rbc_qre.c: rbc_qre.c:134:10: note: uninitialized use occurs here
rbc_qre.c:   return modulus;
rbc_qre.c:          ^~~~~~~
rbc_qre.c: rbc_qre.c:123:10: note: remove the 'if' if its condition is always true
rbc_qre.c:   } else if(degree == 211) {
rbc_qre.c:          ^~~~~~~~~~~~~~~~~~
rbc_qre.c: rbc_qre.c:60:26: note: initialize the variable 'modulus' to silence this warning
rbc_qre.c:   rbc_poly_sparse modulus;
rbc_qre.c:                          ^
rbc_qre.c:                           = NULL
rbc_qre.c: 1 warning generated.

Number of similar (implementation,compiler) pairs: 4, namely:
ImplementationCompiler
T:avxclang -march=native -O2 -fwrapv -Qunused-arguments -fPIC -fPIE -gdwarf-4 -Wall (Debian_Clang_11.0.1)
T:avxclang -march=native -O3 -fwrapv -Qunused-arguments -fPIC -fPIE -gdwarf-4 -Wall (Debian_Clang_11.0.1)
T:avxclang -march=native -O -fwrapv -Qunused-arguments -fPIC -fPIE -gdwarf-4 -Wall (Debian_Clang_11.0.1)
T:avxclang -march=native -Os -fwrapv -Qunused-arguments -fPIC -fPIE -gdwarf-4 -Wall (Debian_Clang_11.0.1)

Compiler output


lrpc.c: lrpc.c:118:13: warning: unknown pragma ignored [-Wunknown-pragmas]
lrpc.c: #pragma GCC push_options
lrpc.c:             ^
lrpc.c: lrpc.c:119:13: warning: unknown pragma ignored [-Wunknown-pragmas]
lrpc.c: #pragma GCC optimize ("O0")
lrpc.c:             ^
lrpc.c: lrpc.c:176:13: warning: unknown pragma ignored [-Wunknown-pragmas]
lrpc.c: #pragma GCC pop_options
lrpc.c:             ^
lrpc.c: 3 warnings generated.
rbc_elt.c: rbc_elt.c:466:19: error: '__builtin_ia32_pclmulqdq128' needs target feature pclmul
rbc_elt.c:   __m128i a0_b0 = _mm_clmulepi64_si128(a, b, 0x00);
rbc_elt.c:                   ^
rbc_elt.c: /usr/lib/llvm-11/lib/clang/11.0.1/include/__wmmintrin_pclmul.h:45:13: note: expanded from macro '_mm_clmulepi64_si128'
rbc_elt.c:   ((__m128i)__builtin_ia32_pclmulqdq128((__v2di)(__m128i)(X), \
rbc_elt.c:             ^
rbc_elt.c: rbc_elt.c:468:19: error: '__builtin_ia32_pclmulqdq128' needs target feature pclmul
rbc_elt.c:   __m128i a0_b1 = _mm_clmulepi64_si128(a, b, 0x10);
rbc_elt.c:                   ^
rbc_elt.c: /usr/lib/llvm-11/lib/clang/11.0.1/include/__wmmintrin_pclmul.h:45:13: note: expanded from macro '_mm_clmulepi64_si128'
rbc_elt.c:   ((__m128i)__builtin_ia32_pclmulqdq128((__v2di)(__m128i)(X), \
rbc_elt.c:             ^
rbc_elt.c: rbc_elt.c:469:19: error: '__builtin_ia32_pclmulqdq128' needs target feature pclmul
rbc_elt.c:   __m128i a1_b0 = _mm_clmulepi64_si128(a, b, 0x01);
rbc_elt.c:                   ^
rbc_elt.c: /usr/lib/llvm-11/lib/clang/11.0.1/include/__wmmintrin_pclmul.h:45:13: note: expanded from macro '_mm_clmulepi64_si128'
rbc_elt.c:   ((__m128i)__builtin_ia32_pclmulqdq128((__v2di)(__m128i)(X), \
rbc_elt.c:             ^
rbc_elt.c: rbc_elt.c:471:19: error: '__builtin_ia32_pclmulqdq128' needs target feature pclmul
rbc_elt.c:   __m128i a1_b1 = _mm_clmulepi64_si128(a, b, 0x11);
rbc_elt.c:                   ^
rbc_elt.c: /usr/lib/llvm-11/lib/clang/11.0.1/include/__wmmintrin_pclmul.h:45:13: note: expanded from macro '_mm_clmulepi64_si128'
rbc_elt.c:   ((__m128i)__builtin_ia32_pclmulqdq128((__v2di)(__m128i)(X), \
rbc_elt.c:             ^
rbc_elt.c: 4 errors generated.

Number of similar (implementation,compiler) pairs: 1, namely:
ImplementationCompiler
T:avxclang -mcpu=native -O3 -fwrapv -Qunused-arguments -fPIC -fPIE -gdwarf-4 -Wall (Debian_Clang_11.0.1)

Compiler output


lrpc.c: lrpc.c:118:13: warning: unknown pragma ignored [-Wunknown-pragmas]
lrpc.c: #pragma GCC push_options
lrpc.c:             ^
lrpc.c: lrpc.c:119:13: warning: unknown pragma ignored [-Wunknown-pragmas]
lrpc.c: #pragma GCC optimize ("O0")
lrpc.c:             ^
lrpc.c: lrpc.c:176:13: warning: unknown pragma ignored [-Wunknown-pragmas]
lrpc.c: #pragma GCC pop_options
lrpc.c:             ^
lrpc.c: 3 warnings generated.
rbc_qre.c: rbc_qre.c:123:13: warning: variable 'modulus' is used uninitialized whenever 'if' condition is false [-Wsometimes-uninitialized]
rbc_qre.c:   } else if(degree == 211) {
rbc_qre.c:             ^~~~~~~~~~~~~
rbc_qre.c: rbc_qre.c:134:10: note: uninitialized use occurs here
rbc_qre.c:   return modulus;
rbc_qre.c:          ^~~~~~~
rbc_qre.c: rbc_qre.c:123:10: note: remove the 'if' if its condition is always true
rbc_qre.c:   } else if(degree == 211) {
rbc_qre.c:          ^~~~~~~~~~~~~~~~~~
rbc_qre.c: rbc_qre.c:60:26: note: initialize the variable 'modulus' to silence this warning
rbc_qre.c:   rbc_poly_sparse modulus;
rbc_qre.c:                          ^
rbc_qre.c:                           = NULL
rbc_qre.c: 1 warning generated.
try.c: /usr/bin/ld: libcrypto_kem_rolloi128.a(lrpc.o):.../supercop-data/panther/amd64/try/c/clang_-march=native_-O2_-fwrapv_-Qunused-arguments_-fPIC_-fPIE_-gdwarf-4_-Wall/timingleaks/crypto_kem/rolloi128/ref/work/./rbc.h:40: multiple definition of `RBC_SQR_LOOKUP_TABLE'; libcrypto_kem_rolloi128.a(kem.o):.../supercop-data/panther/amd64/try/c/clang_-march=native_-O2_-fwrapv_-Qunused-arguments_-fPIC_-fPIE_-gdwarf-4_-Wall/timingleaks/crypto_kem/rolloi128/ref/work/./rbc.h:40: first defined here
try.c: /usr/bin/ld: libcrypto_kem_rolloi128.a(parsing.o):.../supercop-data/panther/amd64/try/c/clang_-march=native_-O2_-fwrapv_-Qunused-arguments_-fPIC_-fPIE_-gdwarf-4_-Wall/timingleaks/crypto_kem/rolloi128/ref/work/./rbc.h:40: multiple definition of `RBC_SQR_LOOKUP_TABLE'; libcrypto_kem_rolloi128.a(kem.o):.../supercop-data/panther/amd64/try/c/clang_-march=native_-O2_-fwrapv_-Qunused-arguments_-fPIC_-fPIE_-gdwarf-4_-Wall/timingleaks/crypto_kem/rolloi128/ref/work/./rbc.h:40: first defined here
try.c: /usr/bin/ld: libcrypto_kem_rolloi128.a(rbc_elt.o):.../supercop-data/panther/amd64/try/c/clang_-march=native_-O2_-fwrapv_-Qunused-arguments_-fPIC_-fPIE_-gdwarf-4_-Wall/timingleaks/crypto_kem/rolloi128/ref/work/./rbc.h:40: multiple definition of `RBC_SQR_LOOKUP_TABLE'; libcrypto_kem_rolloi128.a(kem.o):.../supercop-data/panther/amd64/try/c/clang_-march=native_-O2_-fwrapv_-Qunused-arguments_-fPIC_-fPIE_-gdwarf-4_-Wall/timingleaks/crypto_kem/rolloi128/ref/work/./rbc.h:40: first defined here
try.c: /usr/bin/ld: libcrypto_kem_rolloi128.a(rbc_qre.o):.../supercop-data/panther/amd64/try/c/clang_-march=native_-O2_-fwrapv_-Qunused-arguments_-fPIC_-fPIE_-gdwarf-4_-Wall/timingleaks/crypto_kem/rolloi128/ref/work/./rbc.h:40: multiple definition of `RBC_SQR_LOOKUP_TABLE'; libcrypto_kem_rolloi128.a(kem.o):.../supercop-data/panther/amd64/try/c/clang_-march=native_-O2_-fwrapv_-Qunused-arguments_-fPIC_-fPIE_-gdwarf-4_-Wall/timingleaks/crypto_kem/rolloi128/ref/work/./rbc.h:40: first defined here
try.c: /usr/bin/ld: libcrypto_kem_rolloi128.a(rbc_vec.o):.../supercop-data/panther/amd64/try/c/clang_-march=native_-O2_-fwrapv_-Qunused-arguments_-fPIC_-fPIE_-gdwarf-4_-Wall/timingleaks/crypto_kem/rolloi128/ref/work/./rbc.h:40: multiple definition of `RBC_SQR_LOOKUP_TABLE'; libcrypto_kem_rolloi128.a(kem.o):.../supercop-data/panther/amd64/try/c/clang_-march=native_-O2_-fwrapv_-Qunused-arguments_-fPIC_-fPIE_-gdwarf-4_-Wall/timingleaks/crypto_kem/rolloi128/ref/work/./rbc.h:40: first defined here
try.c: /usr/bin/ld: libcrypto_kem_rolloi128.a(rbc_vspace.o):.../supercop-data/panther/amd64/try/c/clang_-march=native_-O2_-fwrapv_-Qunused-arguments_-fPIC_-fPIE_-gdwarf-4_-Wall/timingleaks/crypto_kem/rolloi128/ref/work/./rbc.h:40: multiple definition of `RBC_SQR_LOOKUP_TABLE'; libcrypto_kem_rolloi128.a(kem.o):.../supercop-data/panther/amd64/try/c/clang_-march=native_-O2_-fwrapv_-Qunused-arguments_-fPIC_-fPIE_-gdwarf-4_-Wall/timingleaks/crypto_kem/rolloi128/ref/work/./rbc.h:40: first defined here
try.c: /usr/bin/ld: libcrypto_kem_rolloi128.a(rbc_poly.o):.../supercop-data/panther/amd64/try/c/clang_-march=native_-O2_-fwrapv_-Qunused-arguments_-fPIC_-fPIE_-gdwarf-4_-Wall/timingleaks/crypto_kem/rolloi128/ref/work/./rbc.h:40: multiple definition of `RBC_SQR_LOOKUP_TABLE'; libcrypto_kem_rolloi128.a(kem.o):.../supercop-data/panther/amd64/try/c/clang_-march=native_-O2_-fwrapv_-Qunused-arguments_-fPIC_-fPIE_-gdwarf-4_-Wall/timingleaks/crypto_kem/rolloi128/ref/work/./rbc.h:40: first defined here
try.c: clang: error: linker command failed with exit code 1 (use -v to see invocation)

Number of similar (implementation,compiler) pairs: 1, namely:
ImplementationCompiler
T:refclang -march=native -O2 -fwrapv -Qunused-arguments -fPIC -fPIE -gdwarf-4 -Wall (Debian_Clang_11.0.1)

Compiler output


lrpc.c: lrpc.c:118:13: warning: unknown pragma ignored [-Wunknown-pragmas]
lrpc.c: #pragma GCC push_options
lrpc.c:             ^
lrpc.c: lrpc.c:119:13: warning: unknown pragma ignored [-Wunknown-pragmas]
lrpc.c: #pragma GCC optimize ("O0")
lrpc.c:             ^
lrpc.c: lrpc.c:176:13: warning: unknown pragma ignored [-Wunknown-pragmas]
lrpc.c: #pragma GCC pop_options
lrpc.c:             ^
lrpc.c: 3 warnings generated.
rbc_qre.c: rbc_qre.c:123:13: warning: variable 'modulus' is used uninitialized whenever 'if' condition is false [-Wsometimes-uninitialized]
rbc_qre.c:   } else if(degree == 211) {
rbc_qre.c:             ^~~~~~~~~~~~~
rbc_qre.c: rbc_qre.c:134:10: note: uninitialized use occurs here
rbc_qre.c:   return modulus;
rbc_qre.c:          ^~~~~~~
rbc_qre.c: rbc_qre.c:123:10: note: remove the 'if' if its condition is always true
rbc_qre.c:   } else if(degree == 211) {
rbc_qre.c:          ^~~~~~~~~~~~~~~~~~
rbc_qre.c: rbc_qre.c:60:26: note: initialize the variable 'modulus' to silence this warning
rbc_qre.c:   rbc_poly_sparse modulus;
rbc_qre.c:                          ^
rbc_qre.c:                           = NULL
rbc_qre.c: 1 warning generated.
try.c: /usr/bin/ld: libcrypto_kem_rolloi128.a(lrpc.o):.../supercop-data/panther/amd64/try/c/clang_-march=native_-O3_-fwrapv_-Qunused-arguments_-fPIC_-fPIE_-gdwarf-4_-Wall/timingleaks/crypto_kem/rolloi128/ref/work/./rbc.h:40: multiple definition of `RBC_SQR_LOOKUP_TABLE'; libcrypto_kem_rolloi128.a(kem.o):.../supercop-data/panther/amd64/try/c/clang_-march=native_-O3_-fwrapv_-Qunused-arguments_-fPIC_-fPIE_-gdwarf-4_-Wall/timingleaks/crypto_kem/rolloi128/ref/work/./rbc.h:40: first defined here
try.c: /usr/bin/ld: libcrypto_kem_rolloi128.a(parsing.o):.../supercop-data/panther/amd64/try/c/clang_-march=native_-O3_-fwrapv_-Qunused-arguments_-fPIC_-fPIE_-gdwarf-4_-Wall/timingleaks/crypto_kem/rolloi128/ref/work/./rbc.h:40: multiple definition of `RBC_SQR_LOOKUP_TABLE'; libcrypto_kem_rolloi128.a(kem.o):.../supercop-data/panther/amd64/try/c/clang_-march=native_-O3_-fwrapv_-Qunused-arguments_-fPIC_-fPIE_-gdwarf-4_-Wall/timingleaks/crypto_kem/rolloi128/ref/work/./rbc.h:40: first defined here
try.c: /usr/bin/ld: libcrypto_kem_rolloi128.a(rbc_elt.o):.../supercop-data/panther/amd64/try/c/clang_-march=native_-O3_-fwrapv_-Qunused-arguments_-fPIC_-fPIE_-gdwarf-4_-Wall/timingleaks/crypto_kem/rolloi128/ref/work/./rbc.h:40: multiple definition of `RBC_SQR_LOOKUP_TABLE'; libcrypto_kem_rolloi128.a(kem.o):.../supercop-data/panther/amd64/try/c/clang_-march=native_-O3_-fwrapv_-Qunused-arguments_-fPIC_-fPIE_-gdwarf-4_-Wall/timingleaks/crypto_kem/rolloi128/ref/work/./rbc.h:40: first defined here
try.c: /usr/bin/ld: libcrypto_kem_rolloi128.a(rbc_qre.o):.../supercop-data/panther/amd64/try/c/clang_-march=native_-O3_-fwrapv_-Qunused-arguments_-fPIC_-fPIE_-gdwarf-4_-Wall/timingleaks/crypto_kem/rolloi128/ref/work/./rbc.h:40: multiple definition of `RBC_SQR_LOOKUP_TABLE'; libcrypto_kem_rolloi128.a(kem.o):.../supercop-data/panther/amd64/try/c/clang_-march=native_-O3_-fwrapv_-Qunused-arguments_-fPIC_-fPIE_-gdwarf-4_-Wall/timingleaks/crypto_kem/rolloi128/ref/work/./rbc.h:40: first defined here
try.c: /usr/bin/ld: libcrypto_kem_rolloi128.a(rbc_vec.o):.../supercop-data/panther/amd64/try/c/clang_-march=native_-O3_-fwrapv_-Qunused-arguments_-fPIC_-fPIE_-gdwarf-4_-Wall/timingleaks/crypto_kem/rolloi128/ref/work/./rbc.h:40: multiple definition of `RBC_SQR_LOOKUP_TABLE'; libcrypto_kem_rolloi128.a(kem.o):.../supercop-data/panther/amd64/try/c/clang_-march=native_-O3_-fwrapv_-Qunused-arguments_-fPIC_-fPIE_-gdwarf-4_-Wall/timingleaks/crypto_kem/rolloi128/ref/work/./rbc.h:40: first defined here
try.c: /usr/bin/ld: libcrypto_kem_rolloi128.a(rbc_vspace.o):.../supercop-data/panther/amd64/try/c/clang_-march=native_-O3_-fwrapv_-Qunused-arguments_-fPIC_-fPIE_-gdwarf-4_-Wall/timingleaks/crypto_kem/rolloi128/ref/work/./rbc.h:40: multiple definition of `RBC_SQR_LOOKUP_TABLE'; libcrypto_kem_rolloi128.a(kem.o):.../supercop-data/panther/amd64/try/c/clang_-march=native_-O3_-fwrapv_-Qunused-arguments_-fPIC_-fPIE_-gdwarf-4_-Wall/timingleaks/crypto_kem/rolloi128/ref/work/./rbc.h:40: first defined here
try.c: /usr/bin/ld: libcrypto_kem_rolloi128.a(rbc_poly.o):.../supercop-data/panther/amd64/try/c/clang_-march=native_-O3_-fwrapv_-Qunused-arguments_-fPIC_-fPIE_-gdwarf-4_-Wall/timingleaks/crypto_kem/rolloi128/ref/work/./rbc.h:40: multiple definition of `RBC_SQR_LOOKUP_TABLE'; libcrypto_kem_rolloi128.a(kem.o):.../supercop-data/panther/amd64/try/c/clang_-march=native_-O3_-fwrapv_-Qunused-arguments_-fPIC_-fPIE_-gdwarf-4_-Wall/timingleaks/crypto_kem/rolloi128/ref/work/./rbc.h:40: first defined here
try.c: clang: error: linker command failed with exit code 1 (use -v to see invocation)

Number of similar (implementation,compiler) pairs: 1, namely:
ImplementationCompiler
T:refclang -march=native -O3 -fwrapv -Qunused-arguments -fPIC -fPIE -gdwarf-4 -Wall (Debian_Clang_11.0.1)

Compiler output


lrpc.c: lrpc.c:118:13: warning: unknown pragma ignored [-Wunknown-pragmas]
lrpc.c: #pragma GCC push_options
lrpc.c:             ^
lrpc.c: lrpc.c:119:13: warning: unknown pragma ignored [-Wunknown-pragmas]
lrpc.c: #pragma GCC optimize ("O0")
lrpc.c:             ^
lrpc.c: lrpc.c:176:13: warning: unknown pragma ignored [-Wunknown-pragmas]
lrpc.c: #pragma GCC pop_options
lrpc.c:             ^
lrpc.c: 3 warnings generated.
rbc_qre.c: rbc_qre.c:123:13: warning: variable 'modulus' is used uninitialized whenever 'if' condition is false [-Wsometimes-uninitialized]
rbc_qre.c:   } else if(degree == 211) {
rbc_qre.c:             ^~~~~~~~~~~~~
rbc_qre.c: rbc_qre.c:134:10: note: uninitialized use occurs here
rbc_qre.c:   return modulus;
rbc_qre.c:          ^~~~~~~
rbc_qre.c: rbc_qre.c:123:10: note: remove the 'if' if its condition is always true
rbc_qre.c:   } else if(degree == 211) {
rbc_qre.c:          ^~~~~~~~~~~~~~~~~~
rbc_qre.c: rbc_qre.c:60:26: note: initialize the variable 'modulus' to silence this warning
rbc_qre.c:   rbc_poly_sparse modulus;
rbc_qre.c:                          ^
rbc_qre.c:                           = NULL
rbc_qre.c: 1 warning generated.
try.c: /usr/bin/ld: libcrypto_kem_rolloi128.a(lrpc.o):.../supercop-data/panther/amd64/try/c/clang_-march=native_-O_-fwrapv_-Qunused-arguments_-fPIC_-fPIE_-gdwarf-4_-Wall/timingleaks/crypto_kem/rolloi128/ref/work/./rbc.h:40: multiple definition of `RBC_SQR_LOOKUP_TABLE'; libcrypto_kem_rolloi128.a(kem.o):.../supercop-data/panther/amd64/try/c/clang_-march=native_-O_-fwrapv_-Qunused-arguments_-fPIC_-fPIE_-gdwarf-4_-Wall/timingleaks/crypto_kem/rolloi128/ref/work/./rbc.h:40: first defined here
try.c: /usr/bin/ld: libcrypto_kem_rolloi128.a(parsing.o):.../supercop-data/panther/amd64/try/c/clang_-march=native_-O_-fwrapv_-Qunused-arguments_-fPIC_-fPIE_-gdwarf-4_-Wall/timingleaks/crypto_kem/rolloi128/ref/work/./rbc.h:40: multiple definition of `RBC_SQR_LOOKUP_TABLE'; libcrypto_kem_rolloi128.a(kem.o):.../supercop-data/panther/amd64/try/c/clang_-march=native_-O_-fwrapv_-Qunused-arguments_-fPIC_-fPIE_-gdwarf-4_-Wall/timingleaks/crypto_kem/rolloi128/ref/work/./rbc.h:40: first defined here
try.c: /usr/bin/ld: libcrypto_kem_rolloi128.a(rbc_elt.o):.../supercop-data/panther/amd64/try/c/clang_-march=native_-O_-fwrapv_-Qunused-arguments_-fPIC_-fPIE_-gdwarf-4_-Wall/timingleaks/crypto_kem/rolloi128/ref/work/./rbc.h:40: multiple definition of `RBC_SQR_LOOKUP_TABLE'; libcrypto_kem_rolloi128.a(kem.o):.../supercop-data/panther/amd64/try/c/clang_-march=native_-O_-fwrapv_-Qunused-arguments_-fPIC_-fPIE_-gdwarf-4_-Wall/timingleaks/crypto_kem/rolloi128/ref/work/./rbc.h:40: first defined here
try.c: /usr/bin/ld: libcrypto_kem_rolloi128.a(rbc_qre.o):.../supercop-data/panther/amd64/try/c/clang_-march=native_-O_-fwrapv_-Qunused-arguments_-fPIC_-fPIE_-gdwarf-4_-Wall/timingleaks/crypto_kem/rolloi128/ref/work/./rbc.h:40: multiple definition of `RBC_SQR_LOOKUP_TABLE'; libcrypto_kem_rolloi128.a(kem.o):.../supercop-data/panther/amd64/try/c/clang_-march=native_-O_-fwrapv_-Qunused-arguments_-fPIC_-fPIE_-gdwarf-4_-Wall/timingleaks/crypto_kem/rolloi128/ref/work/./rbc.h:40: first defined here
try.c: /usr/bin/ld: libcrypto_kem_rolloi128.a(rbc_vec.o):.../supercop-data/panther/amd64/try/c/clang_-march=native_-O_-fwrapv_-Qunused-arguments_-fPIC_-fPIE_-gdwarf-4_-Wall/timingleaks/crypto_kem/rolloi128/ref/work/./rbc.h:40: multiple definition of `RBC_SQR_LOOKUP_TABLE'; libcrypto_kem_rolloi128.a(kem.o):.../supercop-data/panther/amd64/try/c/clang_-march=native_-O_-fwrapv_-Qunused-arguments_-fPIC_-fPIE_-gdwarf-4_-Wall/timingleaks/crypto_kem/rolloi128/ref/work/./rbc.h:40: first defined here
try.c: /usr/bin/ld: libcrypto_kem_rolloi128.a(rbc_vspace.o):.../supercop-data/panther/amd64/try/c/clang_-march=native_-O_-fwrapv_-Qunused-arguments_-fPIC_-fPIE_-gdwarf-4_-Wall/timingleaks/crypto_kem/rolloi128/ref/work/./rbc.h:40: multiple definition of `RBC_SQR_LOOKUP_TABLE'; libcrypto_kem_rolloi128.a(kem.o):.../supercop-data/panther/amd64/try/c/clang_-march=native_-O_-fwrapv_-Qunused-arguments_-fPIC_-fPIE_-gdwarf-4_-Wall/timingleaks/crypto_kem/rolloi128/ref/work/./rbc.h:40: first defined here
try.c: /usr/bin/ld: libcrypto_kem_rolloi128.a(rbc_poly.o):.../supercop-data/panther/amd64/try/c/clang_-march=native_-O_-fwrapv_-Qunused-arguments_-fPIC_-fPIE_-gdwarf-4_-Wall/timingleaks/crypto_kem/rolloi128/ref/work/./rbc.h:40: multiple definition of `RBC_SQR_LOOKUP_TABLE'; libcrypto_kem_rolloi128.a(kem.o):.../supercop-data/panther/amd64/try/c/clang_-march=native_-O_-fwrapv_-Qunused-arguments_-fPIC_-fPIE_-gdwarf-4_-Wall/timingleaks/crypto_kem/rolloi128/ref/work/./rbc.h:40: first defined here
try.c: clang: error: linker command failed with exit code 1 (use -v to see invocation)

Number of similar (implementation,compiler) pairs: 1, namely:
ImplementationCompiler
T:refclang -march=native -O -fwrapv -Qunused-arguments -fPIC -fPIE -gdwarf-4 -Wall (Debian_Clang_11.0.1)

Compiler output


lrpc.c: lrpc.c:118:13: warning: unknown pragma ignored [-Wunknown-pragmas]
lrpc.c: #pragma GCC push_options
lrpc.c:             ^
lrpc.c: lrpc.c:119:13: warning: unknown pragma ignored [-Wunknown-pragmas]
lrpc.c: #pragma GCC optimize ("O0")
lrpc.c:             ^
lrpc.c: lrpc.c:176:13: warning: unknown pragma ignored [-Wunknown-pragmas]
lrpc.c: #pragma GCC pop_options
lrpc.c:             ^
lrpc.c: 3 warnings generated.
rbc_qre.c: rbc_qre.c:123:13: warning: variable 'modulus' is used uninitialized whenever 'if' condition is false [-Wsometimes-uninitialized]
rbc_qre.c:   } else if(degree == 211) {
rbc_qre.c:             ^~~~~~~~~~~~~
rbc_qre.c: rbc_qre.c:134:10: note: uninitialized use occurs here
rbc_qre.c:   return modulus;
rbc_qre.c:          ^~~~~~~
rbc_qre.c: rbc_qre.c:123:10: note: remove the 'if' if its condition is always true
rbc_qre.c:   } else if(degree == 211) {
rbc_qre.c:          ^~~~~~~~~~~~~~~~~~
rbc_qre.c: rbc_qre.c:60:26: note: initialize the variable 'modulus' to silence this warning
rbc_qre.c:   rbc_poly_sparse modulus;
rbc_qre.c:                          ^
rbc_qre.c:                           = NULL
rbc_qre.c: 1 warning generated.
try.c: /usr/bin/ld: libcrypto_kem_rolloi128.a(lrpc.o):.../supercop-data/panther/amd64/try/c/clang_-march=native_-Os_-fwrapv_-Qunused-arguments_-fPIC_-fPIE_-gdwarf-4_-Wall/timingleaks/crypto_kem/rolloi128/ref/work/./rbc.h:40: multiple definition of `RBC_SQR_LOOKUP_TABLE'; libcrypto_kem_rolloi128.a(kem.o):.../supercop-data/panther/amd64/try/c/clang_-march=native_-Os_-fwrapv_-Qunused-arguments_-fPIC_-fPIE_-gdwarf-4_-Wall/timingleaks/crypto_kem/rolloi128/ref/work/./rbc.h:40: first defined here
try.c: /usr/bin/ld: libcrypto_kem_rolloi128.a(parsing.o):.../supercop-data/panther/amd64/try/c/clang_-march=native_-Os_-fwrapv_-Qunused-arguments_-fPIC_-fPIE_-gdwarf-4_-Wall/timingleaks/crypto_kem/rolloi128/ref/work/./rbc.h:40: multiple definition of `RBC_SQR_LOOKUP_TABLE'; libcrypto_kem_rolloi128.a(kem.o):.../supercop-data/panther/amd64/try/c/clang_-march=native_-Os_-fwrapv_-Qunused-arguments_-fPIC_-fPIE_-gdwarf-4_-Wall/timingleaks/crypto_kem/rolloi128/ref/work/./rbc.h:40: first defined here
try.c: /usr/bin/ld: libcrypto_kem_rolloi128.a(rbc_elt.o):.../supercop-data/panther/amd64/try/c/clang_-march=native_-Os_-fwrapv_-Qunused-arguments_-fPIC_-fPIE_-gdwarf-4_-Wall/timingleaks/crypto_kem/rolloi128/ref/work/./rbc.h:40: multiple definition of `RBC_SQR_LOOKUP_TABLE'; libcrypto_kem_rolloi128.a(kem.o):.../supercop-data/panther/amd64/try/c/clang_-march=native_-Os_-fwrapv_-Qunused-arguments_-fPIC_-fPIE_-gdwarf-4_-Wall/timingleaks/crypto_kem/rolloi128/ref/work/./rbc.h:40: first defined here
try.c: /usr/bin/ld: libcrypto_kem_rolloi128.a(rbc_qre.o):.../supercop-data/panther/amd64/try/c/clang_-march=native_-Os_-fwrapv_-Qunused-arguments_-fPIC_-fPIE_-gdwarf-4_-Wall/timingleaks/crypto_kem/rolloi128/ref/work/./rbc.h:40: multiple definition of `RBC_SQR_LOOKUP_TABLE'; libcrypto_kem_rolloi128.a(kem.o):.../supercop-data/panther/amd64/try/c/clang_-march=native_-Os_-fwrapv_-Qunused-arguments_-fPIC_-fPIE_-gdwarf-4_-Wall/timingleaks/crypto_kem/rolloi128/ref/work/./rbc.h:40: first defined here
try.c: /usr/bin/ld: libcrypto_kem_rolloi128.a(rbc_vec.o):.../supercop-data/panther/amd64/try/c/clang_-march=native_-Os_-fwrapv_-Qunused-arguments_-fPIC_-fPIE_-gdwarf-4_-Wall/timingleaks/crypto_kem/rolloi128/ref/work/./rbc.h:40: multiple definition of `RBC_SQR_LOOKUP_TABLE'; libcrypto_kem_rolloi128.a(kem.o):.../supercop-data/panther/amd64/try/c/clang_-march=native_-Os_-fwrapv_-Qunused-arguments_-fPIC_-fPIE_-gdwarf-4_-Wall/timingleaks/crypto_kem/rolloi128/ref/work/./rbc.h:40: first defined here
try.c: /usr/bin/ld: libcrypto_kem_rolloi128.a(rbc_vspace.o):.../supercop-data/panther/amd64/try/c/clang_-march=native_-Os_-fwrapv_-Qunused-arguments_-fPIC_-fPIE_-gdwarf-4_-Wall/timingleaks/crypto_kem/rolloi128/ref/work/./rbc.h:40: multiple definition of `RBC_SQR_LOOKUP_TABLE'; libcrypto_kem_rolloi128.a(kem.o):.../supercop-data/panther/amd64/try/c/clang_-march=native_-Os_-fwrapv_-Qunused-arguments_-fPIC_-fPIE_-gdwarf-4_-Wall/timingleaks/crypto_kem/rolloi128/ref/work/./rbc.h:40: first defined here
try.c: /usr/bin/ld: libcrypto_kem_rolloi128.a(rbc_poly.o):.../supercop-data/panther/amd64/try/c/clang_-march=native_-Os_-fwrapv_-Qunused-arguments_-fPIC_-fPIE_-gdwarf-4_-Wall/timingleaks/crypto_kem/rolloi128/ref/work/./rbc.h:40: multiple definition of `RBC_SQR_LOOKUP_TABLE'; libcrypto_kem_rolloi128.a(kem.o):.../supercop-data/panther/amd64/try/c/clang_-march=native_-Os_-fwrapv_-Qunused-arguments_-fPIC_-fPIE_-gdwarf-4_-Wall/timingleaks/crypto_kem/rolloi128/ref/work/./rbc.h:40: first defined here
try.c: clang: error: linker command failed with exit code 1 (use -v to see invocation)

Number of similar (implementation,compiler) pairs: 1, namely:
ImplementationCompiler
T:refclang -march=native -Os -fwrapv -Qunused-arguments -fPIC -fPIE -gdwarf-4 -Wall (Debian_Clang_11.0.1)

Compiler output


lrpc.c: lrpc.c:118:13: warning: unknown pragma ignored [-Wunknown-pragmas]
lrpc.c: #pragma GCC push_options
lrpc.c:             ^
lrpc.c: lrpc.c:119:13: warning: unknown pragma ignored [-Wunknown-pragmas]
lrpc.c: #pragma GCC optimize ("O0")
lrpc.c:             ^
lrpc.c: lrpc.c:176:13: warning: unknown pragma ignored [-Wunknown-pragmas]
lrpc.c: #pragma GCC pop_options
lrpc.c:             ^
lrpc.c: 3 warnings generated.
rbc_qre.c: rbc_qre.c:123:13: warning: variable 'modulus' is used uninitialized whenever 'if' condition is false [-Wsometimes-uninitialized]
rbc_qre.c:   } else if(degree == 211) {
rbc_qre.c:             ^~~~~~~~~~~~~
rbc_qre.c: rbc_qre.c:134:10: note: uninitialized use occurs here
rbc_qre.c:   return modulus;
rbc_qre.c:          ^~~~~~~
rbc_qre.c: rbc_qre.c:123:10: note: remove the 'if' if its condition is always true
rbc_qre.c:   } else if(degree == 211) {
rbc_qre.c:          ^~~~~~~~~~~~~~~~~~
rbc_qre.c: rbc_qre.c:60:26: note: initialize the variable 'modulus' to silence this warning
rbc_qre.c:   rbc_poly_sparse modulus;
rbc_qre.c:                          ^
rbc_qre.c:                           = NULL
rbc_qre.c: 1 warning generated.
try.c: /usr/bin/ld: libcrypto_kem_rolloi128.a(lrpc.o):.../supercop-data/panther/amd64/try/c/clang_-mcpu=native_-O3_-fwrapv_-Qunused-arguments_-fPIC_-fPIE_-gdwarf-4_-Wall/timingleaks/crypto_kem/rolloi128/ref/work/./rbc.h:40: multiple definition of `RBC_SQR_LOOKUP_TABLE'; libcrypto_kem_rolloi128.a(kem.o):.../supercop-data/panther/amd64/try/c/clang_-mcpu=native_-O3_-fwrapv_-Qunused-arguments_-fPIC_-fPIE_-gdwarf-4_-Wall/timingleaks/crypto_kem/rolloi128/ref/work/./rbc.h:40: first defined here
try.c: /usr/bin/ld: libcrypto_kem_rolloi128.a(parsing.o):.../supercop-data/panther/amd64/try/c/clang_-mcpu=native_-O3_-fwrapv_-Qunused-arguments_-fPIC_-fPIE_-gdwarf-4_-Wall/timingleaks/crypto_kem/rolloi128/ref/work/./rbc.h:40: multiple definition of `RBC_SQR_LOOKUP_TABLE'; libcrypto_kem_rolloi128.a(kem.o):.../supercop-data/panther/amd64/try/c/clang_-mcpu=native_-O3_-fwrapv_-Qunused-arguments_-fPIC_-fPIE_-gdwarf-4_-Wall/timingleaks/crypto_kem/rolloi128/ref/work/./rbc.h:40: first defined here
try.c: /usr/bin/ld: libcrypto_kem_rolloi128.a(rbc_elt.o):.../supercop-data/panther/amd64/try/c/clang_-mcpu=native_-O3_-fwrapv_-Qunused-arguments_-fPIC_-fPIE_-gdwarf-4_-Wall/timingleaks/crypto_kem/rolloi128/ref/work/./rbc.h:40: multiple definition of `RBC_SQR_LOOKUP_TABLE'; libcrypto_kem_rolloi128.a(kem.o):.../supercop-data/panther/amd64/try/c/clang_-mcpu=native_-O3_-fwrapv_-Qunused-arguments_-fPIC_-fPIE_-gdwarf-4_-Wall/timingleaks/crypto_kem/rolloi128/ref/work/./rbc.h:40: first defined here
try.c: /usr/bin/ld: libcrypto_kem_rolloi128.a(rbc_qre.o):.../supercop-data/panther/amd64/try/c/clang_-mcpu=native_-O3_-fwrapv_-Qunused-arguments_-fPIC_-fPIE_-gdwarf-4_-Wall/timingleaks/crypto_kem/rolloi128/ref/work/./rbc.h:40: multiple definition of `RBC_SQR_LOOKUP_TABLE'; libcrypto_kem_rolloi128.a(kem.o):.../supercop-data/panther/amd64/try/c/clang_-mcpu=native_-O3_-fwrapv_-Qunused-arguments_-fPIC_-fPIE_-gdwarf-4_-Wall/timingleaks/crypto_kem/rolloi128/ref/work/./rbc.h:40: first defined here
try.c: /usr/bin/ld: libcrypto_kem_rolloi128.a(rbc_vec.o):.../supercop-data/panther/amd64/try/c/clang_-mcpu=native_-O3_-fwrapv_-Qunused-arguments_-fPIC_-fPIE_-gdwarf-4_-Wall/timingleaks/crypto_kem/rolloi128/ref/work/./rbc.h:40: multiple definition of `RBC_SQR_LOOKUP_TABLE'; libcrypto_kem_rolloi128.a(kem.o):.../supercop-data/panther/amd64/try/c/clang_-mcpu=native_-O3_-fwrapv_-Qunused-arguments_-fPIC_-fPIE_-gdwarf-4_-Wall/timingleaks/crypto_kem/rolloi128/ref/work/./rbc.h:40: first defined here
try.c: /usr/bin/ld: libcrypto_kem_rolloi128.a(rbc_vspace.o):.../supercop-data/panther/amd64/try/c/clang_-mcpu=native_-O3_-fwrapv_-Qunused-arguments_-fPIC_-fPIE_-gdwarf-4_-Wall/timingleaks/crypto_kem/rolloi128/ref/work/./rbc.h:40: multiple definition of `RBC_SQR_LOOKUP_TABLE'; libcrypto_kem_rolloi128.a(kem.o):.../supercop-data/panther/amd64/try/c/clang_-mcpu=native_-O3_-fwrapv_-Qunused-arguments_-fPIC_-fPIE_-gdwarf-4_-Wall/timingleaks/crypto_kem/rolloi128/ref/work/./rbc.h:40: first defined here
try.c: /usr/bin/ld: libcrypto_kem_rolloi128.a(rbc_poly.o):.../supercop-data/panther/amd64/try/c/clang_-mcpu=native_-O3_-fwrapv_-Qunused-arguments_-fPIC_-fPIE_-gdwarf-4_-Wall/timingleaks/crypto_kem/rolloi128/ref/work/./rbc.h:40: multiple definition of `RBC_SQR_LOOKUP_TABLE'; libcrypto_kem_rolloi128.a(kem.o):.../supercop-data/panther/amd64/try/c/clang_-mcpu=native_-O3_-fwrapv_-Qunused-arguments_-fPIC_-fPIE_-gdwarf-4_-Wall/timingleaks/crypto_kem/rolloi128/ref/work/./rbc.h:40: first defined here
try.c: clang: error: linker command failed with exit code 1 (use -v to see invocation)

Number of similar (implementation,compiler) pairs: 1, namely:
ImplementationCompiler
T:refclang -mcpu=native -O3 -fwrapv -Qunused-arguments -fPIC -fPIE -gdwarf-4 -Wall (Debian_Clang_11.0.1)

Compiler output


try.c: /usr/bin/ld: libcrypto_kem_rolloi128.a(lrpc.o):.../supercop-data/panther/amd64/try/c/gcc_-march=native_-mtune=native_-O2_-fwrapv_-fPIC_-fPIE_-gdwarf-4_-Wall/timingleaks/crypto_kem/rolloi128/ref/work/rbc.h:40: multiple definition of `RBC_SQR_LOOKUP_TABLE'; libcrypto_kem_rolloi128.a(kem.o):.../supercop-data/panther/amd64/try/c/gcc_-march=native_-mtune=native_-O2_-fwrapv_-fPIC_-fPIE_-gdwarf-4_-Wall/timingleaks/crypto_kem/rolloi128/ref/work/rbc.h:40: first defined here
try.c: /usr/bin/ld: libcrypto_kem_rolloi128.a(parsing.o):.../supercop-data/panther/amd64/try/c/gcc_-march=native_-mtune=native_-O2_-fwrapv_-fPIC_-fPIE_-gdwarf-4_-Wall/timingleaks/crypto_kem/rolloi128/ref/work/rbc.h:40: multiple definition of `RBC_SQR_LOOKUP_TABLE'; libcrypto_kem_rolloi128.a(kem.o):.../supercop-data/panther/amd64/try/c/gcc_-march=native_-mtune=native_-O2_-fwrapv_-fPIC_-fPIE_-gdwarf-4_-Wall/timingleaks/crypto_kem/rolloi128/ref/work/rbc.h:40: first defined here
try.c: /usr/bin/ld: libcrypto_kem_rolloi128.a(rbc_elt.o):.../supercop-data/panther/amd64/try/c/gcc_-march=native_-mtune=native_-O2_-fwrapv_-fPIC_-fPIE_-gdwarf-4_-Wall/timingleaks/crypto_kem/rolloi128/ref/work/rbc.h:40: multiple definition of `RBC_SQR_LOOKUP_TABLE'; libcrypto_kem_rolloi128.a(kem.o):.../supercop-data/panther/amd64/try/c/gcc_-march=native_-mtune=native_-O2_-fwrapv_-fPIC_-fPIE_-gdwarf-4_-Wall/timingleaks/crypto_kem/rolloi128/ref/work/rbc.h:40: first defined here
try.c: /usr/bin/ld: libcrypto_kem_rolloi128.a(rbc_qre.o):.../supercop-data/panther/amd64/try/c/gcc_-march=native_-mtune=native_-O2_-fwrapv_-fPIC_-fPIE_-gdwarf-4_-Wall/timingleaks/crypto_kem/rolloi128/ref/work/rbc.h:40: multiple definition of `RBC_SQR_LOOKUP_TABLE'; libcrypto_kem_rolloi128.a(kem.o):.../supercop-data/panther/amd64/try/c/gcc_-march=native_-mtune=native_-O2_-fwrapv_-fPIC_-fPIE_-gdwarf-4_-Wall/timingleaks/crypto_kem/rolloi128/ref/work/rbc.h:40: first defined here
try.c: /usr/bin/ld: libcrypto_kem_rolloi128.a(rbc_vec.o):.../supercop-data/panther/amd64/try/c/gcc_-march=native_-mtune=native_-O2_-fwrapv_-fPIC_-fPIE_-gdwarf-4_-Wall/timingleaks/crypto_kem/rolloi128/ref/work/rbc.h:40: multiple definition of `RBC_SQR_LOOKUP_TABLE'; libcrypto_kem_rolloi128.a(kem.o):.../supercop-data/panther/amd64/try/c/gcc_-march=native_-mtune=native_-O2_-fwrapv_-fPIC_-fPIE_-gdwarf-4_-Wall/timingleaks/crypto_kem/rolloi128/ref/work/rbc.h:40: first defined here
try.c: /usr/bin/ld: libcrypto_kem_rolloi128.a(rbc_vspace.o):.../supercop-data/panther/amd64/try/c/gcc_-march=native_-mtune=native_-O2_-fwrapv_-fPIC_-fPIE_-gdwarf-4_-Wall/timingleaks/crypto_kem/rolloi128/ref/work/rbc.h:40: multiple definition of `RBC_SQR_LOOKUP_TABLE'; libcrypto_kem_rolloi128.a(kem.o):.../supercop-data/panther/amd64/try/c/gcc_-march=native_-mtune=native_-O2_-fwrapv_-fPIC_-fPIE_-gdwarf-4_-Wall/timingleaks/crypto_kem/rolloi128/ref/work/rbc.h:40: first defined here
try.c: /usr/bin/ld: libcrypto_kem_rolloi128.a(rbc_poly.o):.../supercop-data/panther/amd64/try/c/gcc_-march=native_-mtune=native_-O2_-fwrapv_-fPIC_-fPIE_-gdwarf-4_-Wall/timingleaks/crypto_kem/rolloi128/ref/work/rbc.h:40: multiple definition of `RBC_SQR_LOOKUP_TABLE'; libcrypto_kem_rolloi128.a(kem.o):.../supercop-data/panther/amd64/try/c/gcc_-march=native_-mtune=native_-O2_-fwrapv_-fPIC_-fPIE_-gdwarf-4_-Wall/timingleaks/crypto_kem/rolloi128/ref/work/rbc.h:40: first defined here
try.c: collect2: error: ld returned 1 exit status

Number of similar (implementation,compiler) pairs: 1, namely:
ImplementationCompiler
T:refgcc -march=native -mtune=native -O2 -fwrapv -fPIC -fPIE -gdwarf-4 -Wall (10.2.1_20210110)

Compiler output


try.c: /usr/bin/ld: libcrypto_kem_rolloi128.a(lrpc.o):.../supercop-data/panther/amd64/try/c/gcc_-march=native_-mtune=native_-O3_-fwrapv_-fPIC_-fPIE_-gdwarf-4_-Wall/timingleaks/crypto_kem/rolloi128/ref/work/rbc.h:40: multiple definition of `RBC_SQR_LOOKUP_TABLE'; libcrypto_kem_rolloi128.a(kem.o):.../supercop-data/panther/amd64/try/c/gcc_-march=native_-mtune=native_-O3_-fwrapv_-fPIC_-fPIE_-gdwarf-4_-Wall/timingleaks/crypto_kem/rolloi128/ref/work/rbc.h:40: first defined here
try.c: /usr/bin/ld: libcrypto_kem_rolloi128.a(parsing.o):.../supercop-data/panther/amd64/try/c/gcc_-march=native_-mtune=native_-O3_-fwrapv_-fPIC_-fPIE_-gdwarf-4_-Wall/timingleaks/crypto_kem/rolloi128/ref/work/rbc.h:40: multiple definition of `RBC_SQR_LOOKUP_TABLE'; libcrypto_kem_rolloi128.a(kem.o):.../supercop-data/panther/amd64/try/c/gcc_-march=native_-mtune=native_-O3_-fwrapv_-fPIC_-fPIE_-gdwarf-4_-Wall/timingleaks/crypto_kem/rolloi128/ref/work/rbc.h:40: first defined here
try.c: /usr/bin/ld: libcrypto_kem_rolloi128.a(rbc_elt.o):.../supercop-data/panther/amd64/try/c/gcc_-march=native_-mtune=native_-O3_-fwrapv_-fPIC_-fPIE_-gdwarf-4_-Wall/timingleaks/crypto_kem/rolloi128/ref/work/rbc.h:40: multiple definition of `RBC_SQR_LOOKUP_TABLE'; libcrypto_kem_rolloi128.a(kem.o):.../supercop-data/panther/amd64/try/c/gcc_-march=native_-mtune=native_-O3_-fwrapv_-fPIC_-fPIE_-gdwarf-4_-Wall/timingleaks/crypto_kem/rolloi128/ref/work/rbc.h:40: first defined here
try.c: /usr/bin/ld: libcrypto_kem_rolloi128.a(rbc_qre.o):.../supercop-data/panther/amd64/try/c/gcc_-march=native_-mtune=native_-O3_-fwrapv_-fPIC_-fPIE_-gdwarf-4_-Wall/timingleaks/crypto_kem/rolloi128/ref/work/rbc.h:40: multiple definition of `RBC_SQR_LOOKUP_TABLE'; libcrypto_kem_rolloi128.a(kem.o):.../supercop-data/panther/amd64/try/c/gcc_-march=native_-mtune=native_-O3_-fwrapv_-fPIC_-fPIE_-gdwarf-4_-Wall/timingleaks/crypto_kem/rolloi128/ref/work/rbc.h:40: first defined here
try.c: /usr/bin/ld: libcrypto_kem_rolloi128.a(rbc_vec.o):.../supercop-data/panther/amd64/try/c/gcc_-march=native_-mtune=native_-O3_-fwrapv_-fPIC_-fPIE_-gdwarf-4_-Wall/timingleaks/crypto_kem/rolloi128/ref/work/rbc.h:40: multiple definition of `RBC_SQR_LOOKUP_TABLE'; libcrypto_kem_rolloi128.a(kem.o):.../supercop-data/panther/amd64/try/c/gcc_-march=native_-mtune=native_-O3_-fwrapv_-fPIC_-fPIE_-gdwarf-4_-Wall/timingleaks/crypto_kem/rolloi128/ref/work/rbc.h:40: first defined here
try.c: /usr/bin/ld: libcrypto_kem_rolloi128.a(rbc_vspace.o):.../supercop-data/panther/amd64/try/c/gcc_-march=native_-mtune=native_-O3_-fwrapv_-fPIC_-fPIE_-gdwarf-4_-Wall/timingleaks/crypto_kem/rolloi128/ref/work/rbc.h:40: multiple definition of `RBC_SQR_LOOKUP_TABLE'; libcrypto_kem_rolloi128.a(kem.o):.../supercop-data/panther/amd64/try/c/gcc_-march=native_-mtune=native_-O3_-fwrapv_-fPIC_-fPIE_-gdwarf-4_-Wall/timingleaks/crypto_kem/rolloi128/ref/work/rbc.h:40: first defined here
try.c: /usr/bin/ld: libcrypto_kem_rolloi128.a(rbc_poly.o):.../supercop-data/panther/amd64/try/c/gcc_-march=native_-mtune=native_-O3_-fwrapv_-fPIC_-fPIE_-gdwarf-4_-Wall/timingleaks/crypto_kem/rolloi128/ref/work/rbc.h:40: multiple definition of `RBC_SQR_LOOKUP_TABLE'; libcrypto_kem_rolloi128.a(kem.o):.../supercop-data/panther/amd64/try/c/gcc_-march=native_-mtune=native_-O3_-fwrapv_-fPIC_-fPIE_-gdwarf-4_-Wall/timingleaks/crypto_kem/rolloi128/ref/work/rbc.h:40: first defined here
try.c: collect2: error: ld returned 1 exit status

Number of similar (implementation,compiler) pairs: 1, namely:
ImplementationCompiler
T:refgcc -march=native -mtune=native -O3 -fwrapv -fPIC -fPIE -gdwarf-4 -Wall (10.2.1_20210110)

Compiler output


try.c: /usr/bin/ld: libcrypto_kem_rolloi128.a(lrpc.o):.../supercop-data/panther/amd64/try/c/gcc_-march=native_-mtune=native_-O_-fwrapv_-fPIC_-fPIE_-gdwarf-4_-Wall/timingleaks/crypto_kem/rolloi128/ref/work/rbc.h:40: multiple definition of `RBC_SQR_LOOKUP_TABLE'; libcrypto_kem_rolloi128.a(kem.o):.../supercop-data/panther/amd64/try/c/gcc_-march=native_-mtune=native_-O_-fwrapv_-fPIC_-fPIE_-gdwarf-4_-Wall/timingleaks/crypto_kem/rolloi128/ref/work/rbc.h:40: first defined here
try.c: /usr/bin/ld: libcrypto_kem_rolloi128.a(parsing.o):.../supercop-data/panther/amd64/try/c/gcc_-march=native_-mtune=native_-O_-fwrapv_-fPIC_-fPIE_-gdwarf-4_-Wall/timingleaks/crypto_kem/rolloi128/ref/work/rbc.h:40: multiple definition of `RBC_SQR_LOOKUP_TABLE'; libcrypto_kem_rolloi128.a(kem.o):.../supercop-data/panther/amd64/try/c/gcc_-march=native_-mtune=native_-O_-fwrapv_-fPIC_-fPIE_-gdwarf-4_-Wall/timingleaks/crypto_kem/rolloi128/ref/work/rbc.h:40: first defined here
try.c: /usr/bin/ld: libcrypto_kem_rolloi128.a(rbc_elt.o):.../supercop-data/panther/amd64/try/c/gcc_-march=native_-mtune=native_-O_-fwrapv_-fPIC_-fPIE_-gdwarf-4_-Wall/timingleaks/crypto_kem/rolloi128/ref/work/rbc.h:40: multiple definition of `RBC_SQR_LOOKUP_TABLE'; libcrypto_kem_rolloi128.a(kem.o):.../supercop-data/panther/amd64/try/c/gcc_-march=native_-mtune=native_-O_-fwrapv_-fPIC_-fPIE_-gdwarf-4_-Wall/timingleaks/crypto_kem/rolloi128/ref/work/rbc.h:40: first defined here
try.c: /usr/bin/ld: libcrypto_kem_rolloi128.a(rbc_qre.o):.../supercop-data/panther/amd64/try/c/gcc_-march=native_-mtune=native_-O_-fwrapv_-fPIC_-fPIE_-gdwarf-4_-Wall/timingleaks/crypto_kem/rolloi128/ref/work/rbc.h:40: multiple definition of `RBC_SQR_LOOKUP_TABLE'; libcrypto_kem_rolloi128.a(kem.o):.../supercop-data/panther/amd64/try/c/gcc_-march=native_-mtune=native_-O_-fwrapv_-fPIC_-fPIE_-gdwarf-4_-Wall/timingleaks/crypto_kem/rolloi128/ref/work/rbc.h:40: first defined here
try.c: /usr/bin/ld: libcrypto_kem_rolloi128.a(rbc_vec.o):.../supercop-data/panther/amd64/try/c/gcc_-march=native_-mtune=native_-O_-fwrapv_-fPIC_-fPIE_-gdwarf-4_-Wall/timingleaks/crypto_kem/rolloi128/ref/work/rbc.h:40: multiple definition of `RBC_SQR_LOOKUP_TABLE'; libcrypto_kem_rolloi128.a(kem.o):.../supercop-data/panther/amd64/try/c/gcc_-march=native_-mtune=native_-O_-fwrapv_-fPIC_-fPIE_-gdwarf-4_-Wall/timingleaks/crypto_kem/rolloi128/ref/work/rbc.h:40: first defined here
try.c: /usr/bin/ld: libcrypto_kem_rolloi128.a(rbc_vspace.o):.../supercop-data/panther/amd64/try/c/gcc_-march=native_-mtune=native_-O_-fwrapv_-fPIC_-fPIE_-gdwarf-4_-Wall/timingleaks/crypto_kem/rolloi128/ref/work/rbc.h:40: multiple definition of `RBC_SQR_LOOKUP_TABLE'; libcrypto_kem_rolloi128.a(kem.o):.../supercop-data/panther/amd64/try/c/gcc_-march=native_-mtune=native_-O_-fwrapv_-fPIC_-fPIE_-gdwarf-4_-Wall/timingleaks/crypto_kem/rolloi128/ref/work/rbc.h:40: first defined here
try.c: /usr/bin/ld: libcrypto_kem_rolloi128.a(rbc_poly.o):.../supercop-data/panther/amd64/try/c/gcc_-march=native_-mtune=native_-O_-fwrapv_-fPIC_-fPIE_-gdwarf-4_-Wall/timingleaks/crypto_kem/rolloi128/ref/work/rbc.h:40: multiple definition of `RBC_SQR_LOOKUP_TABLE'; libcrypto_kem_rolloi128.a(kem.o):.../supercop-data/panther/amd64/try/c/gcc_-march=native_-mtune=native_-O_-fwrapv_-fPIC_-fPIE_-gdwarf-4_-Wall/timingleaks/crypto_kem/rolloi128/ref/work/rbc.h:40: first defined here
try.c: collect2: error: ld returned 1 exit status

Number of similar (implementation,compiler) pairs: 1, namely:
ImplementationCompiler
T:refgcc -march=native -mtune=native -O -fwrapv -fPIC -fPIE -gdwarf-4 -Wall (10.2.1_20210110)

Compiler output


try.c: /usr/bin/ld: libcrypto_kem_rolloi128.a(lrpc.o):.../supercop-data/panther/amd64/try/c/gcc_-march=native_-mtune=native_-Os_-fwrapv_-fPIC_-fPIE_-gdwarf-4_-Wall/timingleaks/crypto_kem/rolloi128/ref/work/rbc.h:40: multiple definition of `RBC_SQR_LOOKUP_TABLE'; libcrypto_kem_rolloi128.a(kem.o):.../supercop-data/panther/amd64/try/c/gcc_-march=native_-mtune=native_-Os_-fwrapv_-fPIC_-fPIE_-gdwarf-4_-Wall/timingleaks/crypto_kem/rolloi128/ref/work/rbc.h:40: first defined here
try.c: /usr/bin/ld: libcrypto_kem_rolloi128.a(parsing.o):.../supercop-data/panther/amd64/try/c/gcc_-march=native_-mtune=native_-Os_-fwrapv_-fPIC_-fPIE_-gdwarf-4_-Wall/timingleaks/crypto_kem/rolloi128/ref/work/rbc.h:40: multiple definition of `RBC_SQR_LOOKUP_TABLE'; libcrypto_kem_rolloi128.a(kem.o):.../supercop-data/panther/amd64/try/c/gcc_-march=native_-mtune=native_-Os_-fwrapv_-fPIC_-fPIE_-gdwarf-4_-Wall/timingleaks/crypto_kem/rolloi128/ref/work/rbc.h:40: first defined here
try.c: /usr/bin/ld: libcrypto_kem_rolloi128.a(rbc_elt.o):.../supercop-data/panther/amd64/try/c/gcc_-march=native_-mtune=native_-Os_-fwrapv_-fPIC_-fPIE_-gdwarf-4_-Wall/timingleaks/crypto_kem/rolloi128/ref/work/rbc.h:40: multiple definition of `RBC_SQR_LOOKUP_TABLE'; libcrypto_kem_rolloi128.a(kem.o):.../supercop-data/panther/amd64/try/c/gcc_-march=native_-mtune=native_-Os_-fwrapv_-fPIC_-fPIE_-gdwarf-4_-Wall/timingleaks/crypto_kem/rolloi128/ref/work/rbc.h:40: first defined here
try.c: /usr/bin/ld: libcrypto_kem_rolloi128.a(rbc_qre.o):.../supercop-data/panther/amd64/try/c/gcc_-march=native_-mtune=native_-Os_-fwrapv_-fPIC_-fPIE_-gdwarf-4_-Wall/timingleaks/crypto_kem/rolloi128/ref/work/rbc.h:40: multiple definition of `RBC_SQR_LOOKUP_TABLE'; libcrypto_kem_rolloi128.a(kem.o):.../supercop-data/panther/amd64/try/c/gcc_-march=native_-mtune=native_-Os_-fwrapv_-fPIC_-fPIE_-gdwarf-4_-Wall/timingleaks/crypto_kem/rolloi128/ref/work/rbc.h:40: first defined here
try.c: /usr/bin/ld: libcrypto_kem_rolloi128.a(rbc_vec.o):.../supercop-data/panther/amd64/try/c/gcc_-march=native_-mtune=native_-Os_-fwrapv_-fPIC_-fPIE_-gdwarf-4_-Wall/timingleaks/crypto_kem/rolloi128/ref/work/rbc.h:40: multiple definition of `RBC_SQR_LOOKUP_TABLE'; libcrypto_kem_rolloi128.a(kem.o):.../supercop-data/panther/amd64/try/c/gcc_-march=native_-mtune=native_-Os_-fwrapv_-fPIC_-fPIE_-gdwarf-4_-Wall/timingleaks/crypto_kem/rolloi128/ref/work/rbc.h:40: first defined here
try.c: /usr/bin/ld: libcrypto_kem_rolloi128.a(rbc_vspace.o):.../supercop-data/panther/amd64/try/c/gcc_-march=native_-mtune=native_-Os_-fwrapv_-fPIC_-fPIE_-gdwarf-4_-Wall/timingleaks/crypto_kem/rolloi128/ref/work/rbc.h:40: multiple definition of `RBC_SQR_LOOKUP_TABLE'; libcrypto_kem_rolloi128.a(kem.o):.../supercop-data/panther/amd64/try/c/gcc_-march=native_-mtune=native_-Os_-fwrapv_-fPIC_-fPIE_-gdwarf-4_-Wall/timingleaks/crypto_kem/rolloi128/ref/work/rbc.h:40: first defined here
try.c: /usr/bin/ld: libcrypto_kem_rolloi128.a(rbc_poly.o):.../supercop-data/panther/amd64/try/c/gcc_-march=native_-mtune=native_-Os_-fwrapv_-fPIC_-fPIE_-gdwarf-4_-Wall/timingleaks/crypto_kem/rolloi128/ref/work/rbc.h:40: multiple definition of `RBC_SQR_LOOKUP_TABLE'; libcrypto_kem_rolloi128.a(kem.o):.../supercop-data/panther/amd64/try/c/gcc_-march=native_-mtune=native_-Os_-fwrapv_-fPIC_-fPIE_-gdwarf-4_-Wall/timingleaks/crypto_kem/rolloi128/ref/work/rbc.h:40: first defined here
try.c: collect2: error: ld returned 1 exit status

Number of similar (implementation,compiler) pairs: 1, namely:
ImplementationCompiler
T:refgcc -march=native -mtune=native -Os -fwrapv -fPIC -fPIE -gdwarf-4 -Wall (10.2.1_20210110)