Test results for amd64, meteor,tiny, crypto_kem/titaniumccastd

[Page version: 20261015 12:45:42]

Measurements for amd64, meteor,tiny, crypto_kem Test results for amd64, meteor,tiny, crypto_kem Test results for crypto_kem/titaniumccastd
Computer: meteor,tiny
Microarchitecture: amd64; Crestmont (a06a4-20)
Architecture: amd64
CPU ID: GenuineIntel-000a06a4-20-bfebfbff
SUPERCOP version: 20261004
Operation: crypto_kem
Primitive: titaniumccastd
TimeObject sizeTest sizeImplementationCompilerBenchmark dateSUPERCOP version
355038391380 0 36297827 1264 2456T:avx2clang -march=native -O2 -fwrapv -Qunused-arguments -fPIC -fPIE -gdwarf-4 -Wall2026080720260627
355349793534 0 36299939 1264 2456T:avx2clang -march=native -O3 -fwrapv -Qunused-arguments -fPIC -fPIE -gdwarf-4 -Wall2026080720260627
359939086891 0 36289283 1264 2360T:avx2clang -march=native -O -fwrapv -Qunused-arguments -fPIC -fPIE -gdwarf-4 -Wall2026080720260627
364413983911 0 36287181 1256 2456T:avx2clang -march=native -Os -fwrapv -Qunused-arguments -fPIC -fPIE -gdwarf-4 -Wall2026080720260627
372445191117 0 64297383 1224 2456T:avx2gcc -march=native -mtune=native -O3 -fwrapv -fPIC -fPIE -gdwarf-4 -Wall2026080720260627
376935684856 0 64288359 1224 2456T:avx2gcc -march=native -mtune=native -O -fwrapv -fPIC -fPIE -gdwarf-4 -Wall2026080720260627
379601086857 0 64290671 1224 2456T:avx2gcc -march=native -mtune=native -O2 -fwrapv -fPIC -fPIE -gdwarf-4 -Wall2026080720260627
433768489863 0 36295507 1264 2456T:optclang -march=native -O2 -fwrapv -Qunused-arguments -fPIC -fPIE -gdwarf-4 -Wall2026080720260627
4361021101413 0 36307019 1264 2456T:optclang -march=native -O3 -fwrapv -Qunused-arguments -fPIC -fPIE -gdwarf-4 -Wall2026080720260627
439611773359 0 36278395 1264 2360T:optclang -mcpu=native -O3 -fwrapv -Qunused-arguments -fPIC -fPIE -gdwarf-4 -Wall2026080720260627
458696150923 0 36253811 1264 2360T:optclang -march=native -O -fwrapv -Qunused-arguments -fPIC -fPIE -gdwarf-4 -Wall2026080720260627
467912652888 0 36256205 1256 2456T:optclang -march=native -Os -fwrapv -Qunused-arguments -fPIC -fPIE -gdwarf-4 -Wall2026080720260627
479404483846 0 64289967 1224 2456T:optgcc -march=native -mtune=native -O3 -fwrapv -fPIC -fPIE -gdwarf-4 -Wall2026080720260627
489591654141 0 64258079 1224 2456T:optgcc -march=native -mtune=native -O2 -fwrapv -fPIC -fPIE -gdwarf-4 -Wall2026080720260627
504041850000 0 64253543 1224 2456T:optgcc -march=native -mtune=native -O -fwrapv -fPIC -fPIE -gdwarf-4 -Wall2026080720260627
45118512955152 0 36261699 1264 2456T:refclang -march=native -O2 -fwrapv -Qunused-arguments -fPIC -fPIE -gdwarf-4 -Wall2026080720260627
451605096103614 0 36310083 1264 2456T:refclang -march=native -O3 -fwrapv -Qunused-arguments -fPIC -fPIE -gdwarf-4 -Wall2026080720260627
46974261659850 0 36265291 1264 2360T:refclang -mcpu=native -O3 -fwrapv -Qunused-arguments -fPIC -fPIE -gdwarf-4 -Wall2026080720260627
47508246436652 0 36239821 1256 2456T:refclang -march=native -Os -fwrapv -Qunused-arguments -fPIC -fPIE -gdwarf-4 -Wall2026080720260627
49133815333101 0 36235987 1264 2360T:refclang -march=native -O -fwrapv -Qunused-arguments -fPIC -fPIE -gdwarf-4 -Wall2026080720260627
51869955732814 0 64236231 1224 2456T:refgcc -march=native -mtune=native -O -fwrapv -fPIC -fPIE -gdwarf-4 -Wall2026080720260627
51871534753403 0 64259695 1224 2456T:refgcc -march=native -mtune=native -O3 -fwrapv -fPIC -fPIE -gdwarf-4 -Wall2026080720260627
51922743633416 0 64237247 1224 2456T:refgcc -march=native -mtune=native -O2 -fwrapv -fPIC -fPIE -gdwarf-4 -Wall2026080720260627
67061547731085 0 64232874 1216 2424T:refgcc -march=native -mtune=native -Os -fwrapv -fPIC -fPIE -gdwarf-4 -Wall2026080720260627

Compiler output


encrypt.c: encrypt.c:67:8: error: always_inline function '_mm256_loadu_si256' requires target feature 'avx', but would be inlined into function 'crypto_encrypt_keypair' that is compiled without support for 'avx'
encrypt.c:    67 |                         u = _mm256_loadu_si256((__m256i *)(a[i] + j));
encrypt.c:       |                             ^
encrypt.c: encrypt.c:67:8: error: AVX vector return of type '__m256i' (vector of 4 'long long' values) without 'avx' enabled changes the ABI
encrypt.c: encrypt.c:68:8: error: always_inline function '_mm256_loadu_si256' requires target feature 'avx', but would be inlined into function 'crypto_encrypt_keypair' that is compiled without support for 'avx'
encrypt.c:    68 |                         v = _mm256_loadu_si256((__m256i *)(s + j));
encrypt.c:       |                             ^
encrypt.c: encrypt.c:68:8: error: AVX vector return of type '__m256i' (vector of 4 'long long' values) without 'avx' enabled changes the ABI
encrypt.c: encrypt.c:69:8: error: always_inline function '_mm256_mul_epu32' requires target feature 'avx2', but would be inlined into function 'crypto_encrypt_keypair' that is compiled without support for 'avx2'
encrypt.c:    69 |                         t = _mm256_mul_epu32(u, v);
encrypt.c:       |                             ^
encrypt.c: encrypt.c:69:8: error: AVX vector argument of type '__m256i' (vector of 4 'long long' values) without 'avx' enabled changes the ABI
encrypt.c: encrypt.c:70:4: error: always_inline function '_mm256_storeu_si256' requires target feature 'avx', but would be inlined into function 'crypto_encrypt_keypair' that is compiled without support for 'avx'
encrypt.c:    70 |                         _mm256_storeu_si256((__m256i *)(a[i] + j), t);
encrypt.c:       |                         ^
encrypt.c: encrypt.c:70:4: error: AVX vector argument of type '__m256i' (vector of 4 'long long' values) without 'avx' enabled changes the ABI
encrypt.c: encrypt.c:82:8: error: always_inline function '_mm256_loadu_si256' requires target feature 'avx', but would be inlined into function 'crypto_encrypt_keypair' that is compiled without support for 'avx'
encrypt.c:    82 |                         u = _mm256_loadu_si256((__m256i *)(a[i] + j));
encrypt.c:       |                             ^
encrypt.c: encrypt.c:82:8: error: AVX vector return of type '__m256i' (vector of 4 'long long' values) without 'avx' enabled changes the ABI
encrypt.c: encrypt.c:83:8: error: always_inline function '_mm256_loadu_si256' requires target feature 'avx', but would be inlined into function 'crypto_encrypt_keypair' that is compiled without support for 'avx'
encrypt.c:    83 |                         v = _mm256_loadu_si256((__m256i *)(e[i] + j));
encrypt.c:       |                             ^
encrypt.c: encrypt.c:83:8: error: AVX vector return of type '__m256i' (vector of 4 'long long' values) without 'avx' enabled changes the ABI
encrypt.c: encrypt.c:84:8: error: always_inline function '_mm256_add_epi64' requires target feature 'avx2', but would be inlined into function 'crypto_encrypt_keypair' that is compiled without support for 'avx2'
encrypt.c: ...

Number of similar (implementation,compiler) pairs: 1, namely:
ImplementationCompiler
T:avx2clang -mcpu=native -O3 -fwrapv -Qunused-arguments -fPIC -fPIE -gdwarf-4 -Wall (Debian_Clang_19.1.7_(3+b1))

Compiler output


try.c: /usr/bin/ld: libcrypto_kem_titaniumccastd.a(sampler.o): in function `sampler_zq':
try.c: .../supercop-data/meteor,tiny/amd64/try/c/gcc_-march=native_-mtune=native_-Os_-fwrapv_-fPIC_-fPIE_-gdwarf-4_-Wall/timingleaks/crypto_kem/titaniumccastd/avx2/work/sampler.c:160:(.text+0x...): undefined reference to `barrett_zq'
try.c: collect2: error: ld returned 1 exit status

Number of similar (implementation,compiler) pairs: 1, namely:
ImplementationCompiler
T:avx2gcc -march=native -mtune=native -Os -fwrapv -fPIC -fPIE -gdwarf-4 -Wall (14.2.0)

Compiler output


try.c: /usr/bin/ld: libcrypto_kem_titaniumccastd.a(encrypt.o): in function `crypto_encrypt_keypair':
try.c: .../supercop-data/meteor,tiny/amd64/try/c/gcc_-march=native_-mtune=native_-Os_-fwrapv_-fPIC_-fPIE_-gdwarf-4_-Wall/timingleaks/crypto_kem/titaniumccastd/opt/work/encrypt.c:59:(.text+0x...): undefined reference to `barrett_4q2'
try.c: /usr/bin/ld: .../supercop-data/meteor,tiny/amd64/try/c/gcc_-march=native_-mtune=native_-Os_-fwrapv_-fPIC_-fPIE_-gdwarf-4_-Wall/timingleaks/crypto_kem/titaniumccastd/opt/work/encrypt.c:67:(.text+0x...): undefined reference to `barrett_4q'
try.c: /usr/bin/ld: libcrypto_kem_titaniumccastd.a(encrypt.o): in function `crypto_encrypt':
try.c: .../supercop-data/meteor,tiny/amd64/try/c/gcc_-march=native_-mtune=native_-Os_-fwrapv_-fPIC_-fPIE_-gdwarf-4_-Wall/timingleaks/crypto_kem/titaniumccastd/opt/work/encrypt.c:140:(.text+0x...): undefined reference to `barrett_4q2'
try.c: /usr/bin/ld: .../supercop-data/meteor,tiny/amd64/try/c/gcc_-march=native_-mtune=native_-Os_-fwrapv_-fPIC_-fPIE_-gdwarf-4_-Wall/timingleaks/crypto_kem/titaniumccastd/opt/work/encrypt.c:150:(.text+0x...): undefined reference to `barrett_4q2'
try.c: /usr/bin/ld: libcrypto_kem_titaniumccastd.a(encrypt.o): in function `crypto_encrypt_open':
try.c: .../supercop-data/meteor,tiny/amd64/try/c/gcc_-march=native_-mtune=native_-Os_-fwrapv_-fPIC_-fPIE_-gdwarf-4_-Wall/timingleaks/crypto_kem/titaniumccastd/opt/work/encrypt.c:194:(.text+0x...): undefined reference to `barrett_4q2'
try.c: /usr/bin/ld: libcrypto_kem_titaniumccastd.a(ntt.o): in function `ntt_2':
try.c: .../supercop-data/meteor,tiny/amd64/try/c/gcc_-march=native_-mtune=native_-Os_-fwrapv_-fPIC_-fPIE_-gdwarf-4_-Wall/timingleaks/crypto_kem/titaniumccastd/opt/work/ntt.c:459:(.text+0x...): undefined reference to `barrett_4q'
try.c: /usr/bin/ld: .../supercop-data/meteor,tiny/amd64/try/c/gcc_-march=native_-mtune=native_-Os_-fwrapv_-fPIC_-fPIE_-gdwarf-4_-Wall/timingleaks/crypto_kem/titaniumccastd/opt/work/ntt.c:460:(.text+0x...): undefined reference to `barrett_4q'
try.c: /usr/bin/ld: .../supercop-data/meteor,tiny/amd64/try/c/gcc_-march=native_-mtune=native_-Os_-fwrapv_-fPIC_-fPIE_-gdwarf-4_-Wall/timingleaks/crypto_kem/titaniumccastd/opt/work/ntt.c:471:(.text+0x...): undefined reference to `barrett_4q'
try.c: /usr/bin/ld: .../supercop-data/meteor,tiny/amd64/try/c/gcc_-march=native_-mtune=native_-Os_-fwrapv_-fPIC_-fPIE_-gdwarf-4_-Wall/timingleaks/crypto_kem/titaniumccastd/opt/work/ntt.c:472:(.text+0x...): undefined reference to `barrett_4q2'
try.c: /usr/bin/ld: .../supercop-data/meteor,tiny/amd64/try/c/gcc_-march=native_-mtune=native_-Os_-fwrapv_-fPIC_-fPIE_-gdwarf-4_-Wall/timingleaks/crypto_kem/titaniumccastd/opt/work/ntt.c:490:(.text+0x...): undefined reference to `barrett_4q'
try.c: /usr/bin/ld: .../supercop-data/meteor,tiny/amd64/try/c/gcc_-march=native_-mtune=native_-Os_-fwrapv_-fPIC_-fPIE_-gdwarf-4_-Wall/timingleaks/crypto_kem/titaniumccastd/opt/work/ntt.c:491:(.text+0x...): undefined reference to `barrett_4q'
try.c: /usr/bin/ld: .../supercop-data/meteor,tiny/amd64/try/c/gcc_-march=native_-mtune=native_-Os_-fwrapv_-fPIC_-fPIE_-gdwarf-4_-Wall/timingleaks/crypto_kem/titaniumccastd/opt/work/ntt.c:496:(.text+0x...): undefined reference to `barrett_4q'
try.c: /usr/bin/ld: .../supercop-data/meteor,tiny/amd64/try/c/gcc_-march=native_-mtune=native_-Os_-fwrapv_-fPIC_-fPIE_-gdwarf-4_-Wall/timingleaks/crypto_kem/titaniumccastd/opt/work/ntt.c:497:(.text+0x...): undefined reference to `barrett_4q2'
try.c: /usr/bin/ld: .../supercop-data/meteor,tiny/amd64/try/c/gcc_-march=native_-mtune=native_-Os_-fwrapv_-fPIC_-fPIE_-gdwarf-4_-Wall/timingleaks/crypto_kem/titaniumccastd/opt/work/ntt.c:507:(.text+0x...): undefined reference to `barrett_4q'
try.c: /usr/bin/ld: .../supercop-data/meteor,tiny/amd64/try/c/gcc_-march=native_-mtune=native_-Os_-fwrapv_-fPIC_-fPIE_-gdwarf-4_-Wall/timingleaks/crypto_kem/titaniumccastd/opt/work/ntt.c:508:(.text+0x...): undefined reference to `barrett_4q'
try.c: /usr/bin/ld: libcrypto_kem_titaniumccastd.a(ntt.o): in function `ntt_core':
try.c: .../supercop-data/meteor,tiny/amd64/try/c/gcc_-march=native_-mtune=native_-Os_-fwrapv_-fPIC_-fPIE_-gdwarf-4_-Wall/timingleaks/crypto_kem/titaniumccastd/opt/work/ntt.c:536:(.text+0x...): undefined reference to `barrett_2q2'
try.c: /usr/bin/ld: libcrypto_kem_titaniumccastd.a(ntt.o): in function `intt_core':
try.c: .../supercop-data/meteor,tiny/amd64/try/c/gcc_-march=native_-mtune=native_-Os_-fwrapv_-fPIC_-fPIE_-gdwarf-4_-Wall/timingleaks/crypto_kem/titaniumccastd/opt/work/ntt.c:564:(.text+0x...): undefined reference to `barrett_2q2'
try.c: /usr/bin/ld: .../supercop-data/meteor,tiny/amd64/try/c/gcc_-march=native_-mtune=native_-Os_-fwrapv_-fPIC_-fPIE_-gdwarf-4_-Wall/timingleaks/crypto_kem/titaniumccastd/opt/work/ntt.c:576:(.text+0x...): undefined reference to `barrett_2q2'
try.c: /usr/bin/ld: libcrypto_kem_titaniumccastd.a(ntt.o): in function `ntt_butterfly_1024_1792':
try.c: ...

Number of similar (implementation,compiler) pairs: 1, namely:
ImplementationCompiler
T:optgcc -march=native -mtune=native -Os -fwrapv -fPIC -fPIE -gdwarf-4 -Wall (14.2.0)

Namespace violations


encrypt.o crypto_encrypt T
encrypt.o crypto_encrypt_keypair T
encrypt.o crypto_encrypt_open T
fastrandombytes.o fastrandombytes T
fastrandombytes.o fastrandombytes_setseed T
fastrandombytes.o iv B
fastrandombytes.o key B
ntt.o intt_1536_1536_inv T
ntt.o intt_1792_256 T
ntt.o intt_1792_768 T
ntt.o intt_768_256 T
ntt.o ntt_1024_1536 T
ntt.o ntt_1024_1792 T
ntt.o ntt_1536_1792 T
ntt.o ntt_512_1536 T
ntt.o ntt_768_768_inv T
pack.o poly_decode T
pack.o poly_decode_c2 T
pack.o poly_encode T
pack.o poly_encode_c2 T
sampler.o sampler_binomial T
sampler.o sampler_zb T
sampler.o sampler_zq T

Number of similar (implementation,compiler) pairs: 15, namely:
ImplementationCompiler
T:avx2clang -march=native -O2 -fwrapv -Qunused-arguments -fPIC -fPIE -gdwarf-4 -Wall (Debian_Clang_19.1.7_(3+b1))
T:avx2clang -march=native -O3 -fwrapv -Qunused-arguments -fPIC -fPIE -gdwarf-4 -Wall (Debian_Clang_19.1.7_(3+b1))
T:avx2clang -march=native -O -fwrapv -Qunused-arguments -fPIC -fPIE -gdwarf-4 -Wall (Debian_Clang_19.1.7_(3+b1))
T:avx2clang -march=native -Os -fwrapv -Qunused-arguments -fPIC -fPIE -gdwarf-4 -Wall (Debian_Clang_19.1.7_(3+b1))
T:avx2gcc -march=native -mtune=native -O2 -fwrapv -fPIC -fPIE -gdwarf-4 -Wall (14.2.0)
T:avx2gcc -march=native -mtune=native -O3 -fwrapv -fPIC -fPIE -gdwarf-4 -Wall (14.2.0)
T:avx2gcc -march=native -mtune=native -O -fwrapv -fPIC -fPIE -gdwarf-4 -Wall (14.2.0)
T:optclang -march=native -O2 -fwrapv -Qunused-arguments -fPIC -fPIE -gdwarf-4 -Wall (Debian_Clang_19.1.7_(3+b1))
T:optclang -march=native -O3 -fwrapv -Qunused-arguments -fPIC -fPIE -gdwarf-4 -Wall (Debian_Clang_19.1.7_(3+b1))
T:optclang -march=native -O -fwrapv -Qunused-arguments -fPIC -fPIE -gdwarf-4 -Wall (Debian_Clang_19.1.7_(3+b1))
T:optclang -march=native -Os -fwrapv -Qunused-arguments -fPIC -fPIE -gdwarf-4 -Wall (Debian_Clang_19.1.7_(3+b1))
T:optclang -mcpu=native -O3 -fwrapv -Qunused-arguments -fPIC -fPIE -gdwarf-4 -Wall (Debian_Clang_19.1.7_(3+b1))
T:optgcc -march=native -mtune=native -O2 -fwrapv -fPIC -fPIE -gdwarf-4 -Wall (14.2.0)
T:optgcc -march=native -mtune=native -O3 -fwrapv -fPIC -fPIE -gdwarf-4 -Wall (14.2.0)
T:optgcc -march=native -mtune=native -O -fwrapv -fPIC -fPIE -gdwarf-4 -Wall (14.2.0)

Namespace violations


encrypt.o crypto_encrypt T
encrypt.o crypto_encrypt_keypair T
encrypt.o crypto_encrypt_open T
fastrandombytes.o fastrandombytes T
fastrandombytes.o fastrandombytes_setseed T
fastrandombytes.o iv B
fastrandombytes.o key B
ntt.o intt_1536_1536_inv T
ntt.o intt_1792_1792 T
ntt.o intt_768_768 T
ntt.o ntt_1536_1536 T
ntt.o ntt_768_768_inv T
pack.o poly_decode T
pack.o poly_decode_c2 T
pack.o poly_encode T
pack.o poly_encode_c2 T
product.o mp T
product.o product T
sampler.o sampler_binomial T
sampler.o sampler_zb T
sampler.o sampler_zq T

Number of similar (implementation,compiler) pairs: 9, namely:
ImplementationCompiler
T:refclang -march=native -O2 -fwrapv -Qunused-arguments -fPIC -fPIE -gdwarf-4 -Wall (Debian_Clang_19.1.7_(3+b1))
T:refclang -march=native -O3 -fwrapv -Qunused-arguments -fPIC -fPIE -gdwarf-4 -Wall (Debian_Clang_19.1.7_(3+b1))
T:refclang -march=native -O -fwrapv -Qunused-arguments -fPIC -fPIE -gdwarf-4 -Wall (Debian_Clang_19.1.7_(3+b1))
T:refclang -march=native -Os -fwrapv -Qunused-arguments -fPIC -fPIE -gdwarf-4 -Wall (Debian_Clang_19.1.7_(3+b1))
T:refclang -mcpu=native -O3 -fwrapv -Qunused-arguments -fPIC -fPIE -gdwarf-4 -Wall (Debian_Clang_19.1.7_(3+b1))
T:refgcc -march=native -mtune=native -O2 -fwrapv -fPIC -fPIE -gdwarf-4 -Wall (14.2.0)
T:refgcc -march=native -mtune=native -O3 -fwrapv -fPIC -fPIE -gdwarf-4 -Wall (14.2.0)
T:refgcc -march=native -mtune=native -O -fwrapv -fPIC -fPIE -gdwarf-4 -Wall (14.2.0)
T:refgcc -march=native -mtune=native -Os -fwrapv -fPIC -fPIE -gdwarf-4 -Wall (14.2.0)