Implementation notes: amd64, jasper3, crypto_sign/mqqsig160

Computer: jasper3
Microarchitecture: amd64; Tremont (906c0)
Architecture: amd64
CPU ID: GenuineIntel-000906c0-20-bfebfbff
SUPERCOP version: 20231107
Operation: crypto_sign
Primitive: mqqsig160

Compiler output

Implementation: T:sse
Security model: timingleaks
Compiler: clang -march=native -O2 -fomit-frame-pointer -fwrapv -Qunused-arguments -fPIC -fPIE
try.c: /usr/bin/ld: libcrypto_sign_mqqsig160.a(keygen.o):(.bss+0x60): multiple definition of `cc1'; /tmp/try-small-b7a6b6.o:(.bss+0xd0): first defined here
try.c: /usr/bin/ld: libcrypto_sign_mqqsig160.a(keygen.o):(.bss+0x70): multiple definition of `cc2'; /tmp/try-small-b7a6b6.o:(.bss+0xe0): first defined here
try.c: /usr/bin/ld: libcrypto_sign_mqqsig160.a(keygen.o):(.bss+0x1c0): multiple definition of `lookup_table_private_key'; /tmp/try-small-b7a6b6.o:(.bss+0x230): first defined here
try.c: /usr/bin/ld: libcrypto_sign_mqqsig160.a(keygen.o):(.bss+0x0): multiple definition of `mqq_a'; /tmp/try-small-b7a6b6.o:(.bss+0x70): first defined here
try.c: /usr/bin/ld: libcrypto_sign_mqqsig160.a(keygen.o):(.bss+0x80): multiple definition of `mqq_sigma1'; /tmp/try-small-b7a6b6.o:(.bss+0xf0): first defined here
try.c: /usr/bin/ld: libcrypto_sign_mqqsig160.a(keygen.o):(.bss+0x120): multiple definition of `mqq_sigmaK'; /tmp/try-small-b7a6b6.o:(.bss+0x190): first defined here
try.c: /usr/bin/ld: libcrypto_sign_mqqsig160.a(mqq-sign.o):(.bss+0x0): multiple definition of `cc1'; /tmp/try-small-b7a6b6.o:(.bss+0xd0): first defined here
try.c: /usr/bin/ld: libcrypto_sign_mqqsig160.a(mqq-sign.o):(.bss+0x10): multiple definition of `cc2'; /tmp/try-small-b7a6b6.o:(.bss+0xe0): first defined here
try.c: /usr/bin/ld: libcrypto_sign_mqqsig160.a(mqq-sign.o):(.bss+0x1c0): multiple definition of `lookup_table_private_key'; /tmp/try-small-b7a6b6.o:(.bss+0x230): first defined here
try.c: /usr/bin/ld: libcrypto_sign_mqqsig160.a(mqq-sign.o):(.bss+0x20): multiple definition of `mqq_a'; /tmp/try-small-b7a6b6.o:(.bss+0x70): first defined here
try.c: /usr/bin/ld: libcrypto_sign_mqqsig160.a(mqq-sign.o):(.bss+0x80): multiple definition of `mqq_sigma1'; /tmp/try-small-b7a6b6.o:(.bss+0xf0): first defined here
try.c: /usr/bin/ld: libcrypto_sign_mqqsig160.a(mqq-sign.o):(.bss+0x120): multiple definition of `mqq_sigmaK'; /tmp/try-small-b7a6b6.o:(.bss+0x190): first defined here
try.c: /usr/bin/ld: libcrypto_sign_mqqsig160.a(mqq-verify.o):(.bss+0x60): multiple definition of `cc1'; /tmp/try-small-b7a6b6.o:(.bss+0xd0): first defined here
try.c: /usr/bin/ld: libcrypto_sign_mqqsig160.a(mqq-verify.o):(.bss+0x70): multiple definition of `cc2'; /tmp/try-small-b7a6b6.o:(.bss+0xe0): first defined here
try.c: /usr/bin/ld: libcrypto_sign_mqqsig160.a(mqq-verify.o):(.bss+0x1c0): multiple definition of `lookup_table_private_key'; /tmp/try-small-b7a6b6.o:(.bss+0x230): first defined here
try.c: /usr/bin/ld: libcrypto_sign_mqqsig160.a(mqq-verify.o):(.bss+0x0): multiple definition of `mqq_a'; /tmp/try-small-b7a6b6.o:(.bss+0x70): first defined here
try.c: /usr/bin/ld: libcrypto_sign_mqqsig160.a(mqq-verify.o):(.bss+0x80): multiple definition of `mqq_sigma1'; /tmp/try-small-b7a6b6.o:(.bss+0xf0): first defined here
try.c: /usr/bin/ld: libcrypto_sign_mqqsig160.a(mqq-verify.o):(.bss+0x120): multiple definition of `mqq_sigmaK'; /tmp/try-small-b7a6b6.o:(.bss+0x190): first defined here
try.c: clang: error: linker command failed with exit code 1 (use -v to see invocation)

Number of similar (compiler,implementation) pairs: 1, namely:
CompilerImplementations
clang -march=native -O2 -fomit-frame-pointer -fwrapv -Qunused-arguments -fPIC -fPIE T:sse

Compiler output

Implementation: T:sse
Security model: timingleaks
Compiler: clang -march=native -O3 -fomit-frame-pointer -fwrapv -Qunused-arguments -fPIC -fPIE
try.c: /usr/bin/ld: libcrypto_sign_mqqsig160.a(keygen.o):(.bss+0x60): multiple definition of `cc1'; /tmp/try-small-a62980.o:(.bss+0xd0): first defined here
try.c: /usr/bin/ld: libcrypto_sign_mqqsig160.a(keygen.o):(.bss+0x70): multiple definition of `cc2'; /tmp/try-small-a62980.o:(.bss+0xe0): first defined here
try.c: /usr/bin/ld: libcrypto_sign_mqqsig160.a(keygen.o):(.bss+0x1c0): multiple definition of `lookup_table_private_key'; /tmp/try-small-a62980.o:(.bss+0x230): first defined here
try.c: /usr/bin/ld: libcrypto_sign_mqqsig160.a(keygen.o):(.bss+0x0): multiple definition of `mqq_a'; /tmp/try-small-a62980.o:(.bss+0x70): first defined here
try.c: /usr/bin/ld: libcrypto_sign_mqqsig160.a(keygen.o):(.bss+0x80): multiple definition of `mqq_sigma1'; /tmp/try-small-a62980.o:(.bss+0xf0): first defined here
try.c: /usr/bin/ld: libcrypto_sign_mqqsig160.a(keygen.o):(.bss+0x120): multiple definition of `mqq_sigmaK'; /tmp/try-small-a62980.o:(.bss+0x190): first defined here
try.c: /usr/bin/ld: libcrypto_sign_mqqsig160.a(mqq-sign.o):(.bss+0x0): multiple definition of `cc1'; /tmp/try-small-a62980.o:(.bss+0xd0): first defined here
try.c: /usr/bin/ld: libcrypto_sign_mqqsig160.a(mqq-sign.o):(.bss+0x10): multiple definition of `cc2'; /tmp/try-small-a62980.o:(.bss+0xe0): first defined here
try.c: /usr/bin/ld: libcrypto_sign_mqqsig160.a(mqq-sign.o):(.bss+0x1c0): multiple definition of `lookup_table_private_key'; /tmp/try-small-a62980.o:(.bss+0x230): first defined here
try.c: /usr/bin/ld: libcrypto_sign_mqqsig160.a(mqq-sign.o):(.bss+0x20): multiple definition of `mqq_a'; /tmp/try-small-a62980.o:(.bss+0x70): first defined here
try.c: /usr/bin/ld: libcrypto_sign_mqqsig160.a(mqq-sign.o):(.bss+0x80): multiple definition of `mqq_sigma1'; /tmp/try-small-a62980.o:(.bss+0xf0): first defined here
try.c: /usr/bin/ld: libcrypto_sign_mqqsig160.a(mqq-sign.o):(.bss+0x120): multiple definition of `mqq_sigmaK'; /tmp/try-small-a62980.o:(.bss+0x190): first defined here
try.c: /usr/bin/ld: libcrypto_sign_mqqsig160.a(mqq-verify.o):(.bss+0x60): multiple definition of `cc1'; /tmp/try-small-a62980.o:(.bss+0xd0): first defined here
try.c: /usr/bin/ld: libcrypto_sign_mqqsig160.a(mqq-verify.o):(.bss+0x70): multiple definition of `cc2'; /tmp/try-small-a62980.o:(.bss+0xe0): first defined here
try.c: /usr/bin/ld: libcrypto_sign_mqqsig160.a(mqq-verify.o):(.bss+0x1c0): multiple definition of `lookup_table_private_key'; /tmp/try-small-a62980.o:(.bss+0x230): first defined here
try.c: /usr/bin/ld: libcrypto_sign_mqqsig160.a(mqq-verify.o):(.bss+0x0): multiple definition of `mqq_a'; /tmp/try-small-a62980.o:(.bss+0x70): first defined here
try.c: /usr/bin/ld: libcrypto_sign_mqqsig160.a(mqq-verify.o):(.bss+0x80): multiple definition of `mqq_sigma1'; /tmp/try-small-a62980.o:(.bss+0xf0): first defined here
try.c: /usr/bin/ld: libcrypto_sign_mqqsig160.a(mqq-verify.o):(.bss+0x120): multiple definition of `mqq_sigmaK'; /tmp/try-small-a62980.o:(.bss+0x190): first defined here
try.c: clang: error: linker command failed with exit code 1 (use -v to see invocation)

Number of similar (compiler,implementation) pairs: 1, namely:
CompilerImplementations
clang -march=native -O3 -fomit-frame-pointer -fwrapv -Qunused-arguments -fPIC -fPIE T:sse

Compiler output

Implementation: T:sse
Security model: timingleaks
Compiler: clang -march=native -O -fomit-frame-pointer -fwrapv -Qunused-arguments -fPIC -fPIE
try.c: /usr/bin/ld: libcrypto_sign_mqqsig160.a(keygen.o):(.bss+0x60): multiple definition of `cc1'; /tmp/try-small-a67339.o:(.bss+0xd0): first defined here
try.c: /usr/bin/ld: libcrypto_sign_mqqsig160.a(keygen.o):(.bss+0x70): multiple definition of `cc2'; /tmp/try-small-a67339.o:(.bss+0xe0): first defined here
try.c: /usr/bin/ld: libcrypto_sign_mqqsig160.a(keygen.o):(.bss+0x1c0): multiple definition of `lookup_table_private_key'; /tmp/try-small-a67339.o:(.bss+0x230): first defined here
try.c: /usr/bin/ld: libcrypto_sign_mqqsig160.a(keygen.o):(.bss+0x0): multiple definition of `mqq_a'; /tmp/try-small-a67339.o:(.bss+0x70): first defined here
try.c: /usr/bin/ld: libcrypto_sign_mqqsig160.a(keygen.o):(.bss+0x80): multiple definition of `mqq_sigma1'; /tmp/try-small-a67339.o:(.bss+0xf0): first defined here
try.c: /usr/bin/ld: libcrypto_sign_mqqsig160.a(keygen.o):(.bss+0x120): multiple definition of `mqq_sigmaK'; /tmp/try-small-a67339.o:(.bss+0x190): first defined here
try.c: /usr/bin/ld: libcrypto_sign_mqqsig160.a(mqq-sign.o):(.bss+0x0): multiple definition of `cc1'; /tmp/try-small-a67339.o:(.bss+0xd0): first defined here
try.c: /usr/bin/ld: libcrypto_sign_mqqsig160.a(mqq-sign.o):(.bss+0x10): multiple definition of `cc2'; /tmp/try-small-a67339.o:(.bss+0xe0): first defined here
try.c: /usr/bin/ld: libcrypto_sign_mqqsig160.a(mqq-sign.o):(.bss+0x1c0): multiple definition of `lookup_table_private_key'; /tmp/try-small-a67339.o:(.bss+0x230): first defined here
try.c: /usr/bin/ld: libcrypto_sign_mqqsig160.a(mqq-sign.o):(.bss+0x20): multiple definition of `mqq_a'; /tmp/try-small-a67339.o:(.bss+0x70): first defined here
try.c: /usr/bin/ld: libcrypto_sign_mqqsig160.a(mqq-sign.o):(.bss+0x80): multiple definition of `mqq_sigma1'; /tmp/try-small-a67339.o:(.bss+0xf0): first defined here
try.c: /usr/bin/ld: libcrypto_sign_mqqsig160.a(mqq-sign.o):(.bss+0x120): multiple definition of `mqq_sigmaK'; /tmp/try-small-a67339.o:(.bss+0x190): first defined here
try.c: /usr/bin/ld: libcrypto_sign_mqqsig160.a(mqq-verify.o):(.bss+0x60): multiple definition of `cc1'; /tmp/try-small-a67339.o:(.bss+0xd0): first defined here
try.c: /usr/bin/ld: libcrypto_sign_mqqsig160.a(mqq-verify.o):(.bss+0x70): multiple definition of `cc2'; /tmp/try-small-a67339.o:(.bss+0xe0): first defined here
try.c: /usr/bin/ld: libcrypto_sign_mqqsig160.a(mqq-verify.o):(.bss+0x1c0): multiple definition of `lookup_table_private_key'; /tmp/try-small-a67339.o:(.bss+0x230): first defined here
try.c: /usr/bin/ld: libcrypto_sign_mqqsig160.a(mqq-verify.o):(.bss+0x0): multiple definition of `mqq_a'; /tmp/try-small-a67339.o:(.bss+0x70): first defined here
try.c: /usr/bin/ld: libcrypto_sign_mqqsig160.a(mqq-verify.o):(.bss+0x80): multiple definition of `mqq_sigma1'; /tmp/try-small-a67339.o:(.bss+0xf0): first defined here
try.c: /usr/bin/ld: libcrypto_sign_mqqsig160.a(mqq-verify.o):(.bss+0x120): multiple definition of `mqq_sigmaK'; /tmp/try-small-a67339.o:(.bss+0x190): first defined here
try.c: clang: error: linker command failed with exit code 1 (use -v to see invocation)

Number of similar (compiler,implementation) pairs: 1, namely:
CompilerImplementations
clang -march=native -O -fomit-frame-pointer -fwrapv -Qunused-arguments -fPIC -fPIE T:sse

Compiler output

Implementation: T:sse
Security model: timingleaks
Compiler: clang -march=native -Os -fomit-frame-pointer -fwrapv -Qunused-arguments -fPIC -fPIE
try.c: /usr/bin/ld: libcrypto_sign_mqqsig160.a(keygen.o):(.bss+0x60): multiple definition of `cc1'; /tmp/try-small-b6b666.o:(.bss+0xd0): first defined here
try.c: /usr/bin/ld: libcrypto_sign_mqqsig160.a(keygen.o):(.bss+0x70): multiple definition of `cc2'; /tmp/try-small-b6b666.o:(.bss+0xe0): first defined here
try.c: /usr/bin/ld: libcrypto_sign_mqqsig160.a(keygen.o):(.bss+0x1c0): multiple definition of `lookup_table_private_key'; /tmp/try-small-b6b666.o:(.bss+0x230): first defined here
try.c: /usr/bin/ld: libcrypto_sign_mqqsig160.a(keygen.o):(.bss+0x0): multiple definition of `mqq_a'; /tmp/try-small-b6b666.o:(.bss+0x70): first defined here
try.c: /usr/bin/ld: libcrypto_sign_mqqsig160.a(keygen.o):(.bss+0x80): multiple definition of `mqq_sigma1'; /tmp/try-small-b6b666.o:(.bss+0xf0): first defined here
try.c: /usr/bin/ld: libcrypto_sign_mqqsig160.a(keygen.o):(.bss+0x120): multiple definition of `mqq_sigmaK'; /tmp/try-small-b6b666.o:(.bss+0x190): first defined here
try.c: /usr/bin/ld: libcrypto_sign_mqqsig160.a(mqq-sign.o):(.bss+0x0): multiple definition of `cc1'; /tmp/try-small-b6b666.o:(.bss+0xd0): first defined here
try.c: /usr/bin/ld: libcrypto_sign_mqqsig160.a(mqq-sign.o):(.bss+0x10): multiple definition of `cc2'; /tmp/try-small-b6b666.o:(.bss+0xe0): first defined here
try.c: /usr/bin/ld: libcrypto_sign_mqqsig160.a(mqq-sign.o):(.bss+0x1c0): multiple definition of `lookup_table_private_key'; /tmp/try-small-b6b666.o:(.bss+0x230): first defined here
try.c: /usr/bin/ld: libcrypto_sign_mqqsig160.a(mqq-sign.o):(.bss+0x20): multiple definition of `mqq_a'; /tmp/try-small-b6b666.o:(.bss+0x70): first defined here
try.c: /usr/bin/ld: libcrypto_sign_mqqsig160.a(mqq-sign.o):(.bss+0x80): multiple definition of `mqq_sigma1'; /tmp/try-small-b6b666.o:(.bss+0xf0): first defined here
try.c: /usr/bin/ld: libcrypto_sign_mqqsig160.a(mqq-sign.o):(.bss+0x120): multiple definition of `mqq_sigmaK'; /tmp/try-small-b6b666.o:(.bss+0x190): first defined here
try.c: /usr/bin/ld: libcrypto_sign_mqqsig160.a(mqq-verify.o):(.bss+0x60): multiple definition of `cc1'; /tmp/try-small-b6b666.o:(.bss+0xd0): first defined here
try.c: /usr/bin/ld: libcrypto_sign_mqqsig160.a(mqq-verify.o):(.bss+0x70): multiple definition of `cc2'; /tmp/try-small-b6b666.o:(.bss+0xe0): first defined here
try.c: /usr/bin/ld: libcrypto_sign_mqqsig160.a(mqq-verify.o):(.bss+0x1c0): multiple definition of `lookup_table_private_key'; /tmp/try-small-b6b666.o:(.bss+0x230): first defined here
try.c: /usr/bin/ld: libcrypto_sign_mqqsig160.a(mqq-verify.o):(.bss+0x0): multiple definition of `mqq_a'; /tmp/try-small-b6b666.o:(.bss+0x70): first defined here
try.c: /usr/bin/ld: libcrypto_sign_mqqsig160.a(mqq-verify.o):(.bss+0x80): multiple definition of `mqq_sigma1'; /tmp/try-small-b6b666.o:(.bss+0xf0): first defined here
try.c: /usr/bin/ld: libcrypto_sign_mqqsig160.a(mqq-verify.o):(.bss+0x120): multiple definition of `mqq_sigmaK'; /tmp/try-small-b6b666.o:(.bss+0x190): first defined here
try.c: clang: error: linker command failed with exit code 1 (use -v to see invocation)

Number of similar (compiler,implementation) pairs: 1, namely:
CompilerImplementations
clang -march=native -Os -fomit-frame-pointer -fwrapv -Qunused-arguments -fPIC -fPIE T:sse

Compiler output

Implementation: T:sse
Security model: timingleaks
Compiler: clang -mcpu=native -O3 -fomit-frame-pointer -fwrapv -Qunused-arguments -fPIC -fPIE
try.c: /usr/bin/ld: libcrypto_sign_mqqsig160.a(keygen.o):(.bss+0x60): multiple definition of `cc1'; /tmp/try-small-da44e7.o:(.bss+0xd0): first defined here
try.c: /usr/bin/ld: libcrypto_sign_mqqsig160.a(keygen.o):(.bss+0x70): multiple definition of `cc2'; /tmp/try-small-da44e7.o:(.bss+0xe0): first defined here
try.c: /usr/bin/ld: libcrypto_sign_mqqsig160.a(keygen.o):(.bss+0x1c0): multiple definition of `lookup_table_private_key'; /tmp/try-small-da44e7.o:(.bss+0x230): first defined here
try.c: /usr/bin/ld: libcrypto_sign_mqqsig160.a(keygen.o):(.bss+0x0): multiple definition of `mqq_a'; /tmp/try-small-da44e7.o:(.bss+0x70): first defined here
try.c: /usr/bin/ld: libcrypto_sign_mqqsig160.a(keygen.o):(.bss+0x80): multiple definition of `mqq_sigma1'; /tmp/try-small-da44e7.o:(.bss+0xf0): first defined here
try.c: /usr/bin/ld: libcrypto_sign_mqqsig160.a(keygen.o):(.bss+0x120): multiple definition of `mqq_sigmaK'; /tmp/try-small-da44e7.o:(.bss+0x190): first defined here
try.c: /usr/bin/ld: libcrypto_sign_mqqsig160.a(mqq-sign.o):(.bss+0x0): multiple definition of `cc1'; /tmp/try-small-da44e7.o:(.bss+0xd0): first defined here
try.c: /usr/bin/ld: libcrypto_sign_mqqsig160.a(mqq-sign.o):(.bss+0x10): multiple definition of `cc2'; /tmp/try-small-da44e7.o:(.bss+0xe0): first defined here
try.c: /usr/bin/ld: libcrypto_sign_mqqsig160.a(mqq-sign.o):(.bss+0x1c0): multiple definition of `lookup_table_private_key'; /tmp/try-small-da44e7.o:(.bss+0x230): first defined here
try.c: /usr/bin/ld: libcrypto_sign_mqqsig160.a(mqq-sign.o):(.bss+0x20): multiple definition of `mqq_a'; /tmp/try-small-da44e7.o:(.bss+0x70): first defined here
try.c: /usr/bin/ld: libcrypto_sign_mqqsig160.a(mqq-sign.o):(.bss+0x80): multiple definition of `mqq_sigma1'; /tmp/try-small-da44e7.o:(.bss+0xf0): first defined here
try.c: /usr/bin/ld: libcrypto_sign_mqqsig160.a(mqq-sign.o):(.bss+0x120): multiple definition of `mqq_sigmaK'; /tmp/try-small-da44e7.o:(.bss+0x190): first defined here
try.c: /usr/bin/ld: libcrypto_sign_mqqsig160.a(mqq-verify.o):(.bss+0x60): multiple definition of `cc1'; /tmp/try-small-da44e7.o:(.bss+0xd0): first defined here
try.c: /usr/bin/ld: libcrypto_sign_mqqsig160.a(mqq-verify.o):(.bss+0x70): multiple definition of `cc2'; /tmp/try-small-da44e7.o:(.bss+0xe0): first defined here
try.c: /usr/bin/ld: libcrypto_sign_mqqsig160.a(mqq-verify.o):(.bss+0x1c0): multiple definition of `lookup_table_private_key'; /tmp/try-small-da44e7.o:(.bss+0x230): first defined here
try.c: /usr/bin/ld: libcrypto_sign_mqqsig160.a(mqq-verify.o):(.bss+0x0): multiple definition of `mqq_a'; /tmp/try-small-da44e7.o:(.bss+0x70): first defined here
try.c: /usr/bin/ld: libcrypto_sign_mqqsig160.a(mqq-verify.o):(.bss+0x80): multiple definition of `mqq_sigma1'; /tmp/try-small-da44e7.o:(.bss+0xf0): first defined here
try.c: /usr/bin/ld: libcrypto_sign_mqqsig160.a(mqq-verify.o):(.bss+0x120): multiple definition of `mqq_sigmaK'; /tmp/try-small-da44e7.o:(.bss+0x190): first defined here
try.c: clang: error: linker command failed with exit code 1 (use -v to see invocation)

Number of similar (compiler,implementation) pairs: 1, namely:
CompilerImplementations
clang -mcpu=native -O3 -fomit-frame-pointer -fwrapv -Qunused-arguments -fPIC -fPIE T:sse

Compiler output

Implementation: T:sse
Security model: timingleaks
Compiler: gcc -march=native -mtune=native -O2 -fomit-frame-pointer -fwrapv -fPIC -fPIE
try.c: /usr/bin/ld: libcrypto_sign_mqqsig160.a(keygen.o):(.bss+0x0): multiple definition of `lookup_table_private_key'; /tmp/ccgGeMiL.o:(.bss+0x20): first defined here
try.c: /usr/bin/ld: libcrypto_sign_mqqsig160.a(keygen.o):(.bss+0x20000): multiple definition of `mqq_sigmaK'; /tmp/ccgGeMiL.o:(.bss+0x20020): first defined here
try.c: /usr/bin/ld: libcrypto_sign_mqqsig160.a(keygen.o):(.bss+0x200a0): multiple definition of `mqq_sigma1'; /tmp/ccgGeMiL.o:(.bss+0x200c0): first defined here
try.c: /usr/bin/ld: libcrypto_sign_mqqsig160.a(keygen.o):(.bss+0x20140): multiple definition of `cc2'; /tmp/ccgGeMiL.o:(.bss+0x20160): first defined here
try.c: /usr/bin/ld: libcrypto_sign_mqqsig160.a(keygen.o):(.bss+0x20150): multiple definition of `cc1'; /tmp/ccgGeMiL.o:(.bss+0x20170): first defined here
try.c: /usr/bin/ld: libcrypto_sign_mqqsig160.a(keygen.o):(.bss+0x20160): multiple definition of `mqq_a'; /tmp/ccgGeMiL.o:(.bss+0x20180): first defined here
try.c: /usr/bin/ld: libcrypto_sign_mqqsig160.a(mqq-sign.o):(.bss+0x20150): multiple definition of `cc1'; /tmp/ccgGeMiL.o:(.bss+0x20170): first defined here
try.c: /usr/bin/ld: libcrypto_sign_mqqsig160.a(mqq-sign.o):(.bss+0x20160): multiple definition of `mqq_a'; /tmp/ccgGeMiL.o:(.bss+0x20180): first defined here
try.c: /usr/bin/ld: libcrypto_sign_mqqsig160.a(mqq-sign.o):(.bss+0x20140): multiple definition of `cc2'; /tmp/ccgGeMiL.o:(.bss+0x20160): first defined here
try.c: /usr/bin/ld: libcrypto_sign_mqqsig160.a(mqq-sign.o):(.bss+0x20000): multiple definition of `mqq_sigmaK'; /tmp/ccgGeMiL.o:(.bss+0x20020): first defined here
try.c: /usr/bin/ld: libcrypto_sign_mqqsig160.a(mqq-sign.o):(.bss+0x200a0): multiple definition of `mqq_sigma1'; /tmp/ccgGeMiL.o:(.bss+0x200c0): first defined here
try.c: /usr/bin/ld: libcrypto_sign_mqqsig160.a(mqq-sign.o):(.bss+0x0): multiple definition of `lookup_table_private_key'; /tmp/ccgGeMiL.o:(.bss+0x20): first defined here
try.c: /usr/bin/ld: libcrypto_sign_mqqsig160.a(mqq-verify.o):(.bss+0x0): multiple definition of `lookup_table_private_key'; /tmp/ccgGeMiL.o:(.bss+0x20): first defined here
try.c: /usr/bin/ld: libcrypto_sign_mqqsig160.a(mqq-verify.o):(.bss+0x20000): multiple definition of `mqq_sigmaK'; /tmp/ccgGeMiL.o:(.bss+0x20020): first defined here
try.c: /usr/bin/ld: libcrypto_sign_mqqsig160.a(mqq-verify.o):(.bss+0x200a0): multiple definition of `mqq_sigma1'; /tmp/ccgGeMiL.o:(.bss+0x200c0): first defined here
try.c: /usr/bin/ld: libcrypto_sign_mqqsig160.a(mqq-verify.o):(.bss+0x20140): multiple definition of `cc2'; /tmp/ccgGeMiL.o:(.bss+0x20160): first defined here
try.c: /usr/bin/ld: libcrypto_sign_mqqsig160.a(mqq-verify.o):(.bss+0x20150): multiple definition of `cc1'; /tmp/ccgGeMiL.o:(.bss+0x20170): first defined here
try.c: /usr/bin/ld: libcrypto_sign_mqqsig160.a(mqq-verify.o):(.bss+0x20160): multiple definition of `mqq_a'; /tmp/ccgGeMiL.o:(.bss+0x20180): first defined here
try.c: collect2: error: ld returned 1 exit status

Number of similar (compiler,implementation) pairs: 1, namely:
CompilerImplementations
gcc -march=native -mtune=native -O2 -fomit-frame-pointer -fwrapv -fPIC -fPIE T:sse

Compiler output

Implementation: T:sse
Security model: timingleaks
Compiler: gcc -march=native -mtune=native -O3 -fomit-frame-pointer -fwrapv -fPIC -fPIE
try.c: /usr/bin/ld: libcrypto_sign_mqqsig160.a(keygen.o):(.bss+0x0): multiple definition of `lookup_table_private_key'; /tmp/ccI1HRtZ.o:(.bss+0x20): first defined here
try.c: /usr/bin/ld: libcrypto_sign_mqqsig160.a(keygen.o):(.bss+0x20000): multiple definition of `mqq_sigmaK'; /tmp/ccI1HRtZ.o:(.bss+0x20020): first defined here
try.c: /usr/bin/ld: libcrypto_sign_mqqsig160.a(keygen.o):(.bss+0x200a0): multiple definition of `mqq_sigma1'; /tmp/ccI1HRtZ.o:(.bss+0x200c0): first defined here
try.c: /usr/bin/ld: libcrypto_sign_mqqsig160.a(keygen.o):(.bss+0x20140): multiple definition of `cc2'; /tmp/ccI1HRtZ.o:(.bss+0x20160): first defined here
try.c: /usr/bin/ld: libcrypto_sign_mqqsig160.a(keygen.o):(.bss+0x20150): multiple definition of `cc1'; /tmp/ccI1HRtZ.o:(.bss+0x20170): first defined here
try.c: /usr/bin/ld: libcrypto_sign_mqqsig160.a(keygen.o):(.bss+0x20160): multiple definition of `mqq_a'; /tmp/ccI1HRtZ.o:(.bss+0x20180): first defined here
try.c: /usr/bin/ld: libcrypto_sign_mqqsig160.a(mqq-sign.o):(.bss+0x20000): multiple definition of `mqq_sigmaK'; /tmp/ccI1HRtZ.o:(.bss+0x20020): first defined here
try.c: /usr/bin/ld: libcrypto_sign_mqqsig160.a(mqq-sign.o):(.bss+0x200a0): multiple definition of `mqq_sigma1'; /tmp/ccI1HRtZ.o:(.bss+0x200c0): first defined here
try.c: /usr/bin/ld: libcrypto_sign_mqqsig160.a(mqq-sign.o):(.bss+0x20150): multiple definition of `cc1'; /tmp/ccI1HRtZ.o:(.bss+0x20170): first defined here
try.c: /usr/bin/ld: libcrypto_sign_mqqsig160.a(mqq-sign.o):(.bss+0x20140): multiple definition of `cc2'; /tmp/ccI1HRtZ.o:(.bss+0x20160): first defined here
try.c: /usr/bin/ld: libcrypto_sign_mqqsig160.a(mqq-sign.o):(.bss+0x20160): multiple definition of `mqq_a'; /tmp/ccI1HRtZ.o:(.bss+0x20180): first defined here
try.c: /usr/bin/ld: libcrypto_sign_mqqsig160.a(mqq-sign.o):(.bss+0x0): multiple definition of `lookup_table_private_key'; /tmp/ccI1HRtZ.o:(.bss+0x20): first defined here
try.c: /usr/bin/ld: libcrypto_sign_mqqsig160.a(mqq-verify.o):(.bss+0x0): multiple definition of `lookup_table_private_key'; /tmp/ccI1HRtZ.o:(.bss+0x20): first defined here
try.c: /usr/bin/ld: libcrypto_sign_mqqsig160.a(mqq-verify.o):(.bss+0x20000): multiple definition of `mqq_sigmaK'; /tmp/ccI1HRtZ.o:(.bss+0x20020): first defined here
try.c: /usr/bin/ld: libcrypto_sign_mqqsig160.a(mqq-verify.o):(.bss+0x200a0): multiple definition of `mqq_sigma1'; /tmp/ccI1HRtZ.o:(.bss+0x200c0): first defined here
try.c: /usr/bin/ld: libcrypto_sign_mqqsig160.a(mqq-verify.o):(.bss+0x20140): multiple definition of `cc2'; /tmp/ccI1HRtZ.o:(.bss+0x20160): first defined here
try.c: /usr/bin/ld: libcrypto_sign_mqqsig160.a(mqq-verify.o):(.bss+0x20150): multiple definition of `cc1'; /tmp/ccI1HRtZ.o:(.bss+0x20170): first defined here
try.c: /usr/bin/ld: libcrypto_sign_mqqsig160.a(mqq-verify.o):(.bss+0x20160): multiple definition of `mqq_a'; /tmp/ccI1HRtZ.o:(.bss+0x20180): first defined here
try.c: collect2: error: ld returned 1 exit status

Number of similar (compiler,implementation) pairs: 1, namely:
CompilerImplementations
gcc -march=native -mtune=native -O3 -fomit-frame-pointer -fwrapv -fPIC -fPIE T:sse

Compiler output

Implementation: T:sse
Security model: timingleaks
Compiler: gcc -march=native -mtune=native -O -fomit-frame-pointer -fwrapv -fPIC -fPIE
try.c: /usr/bin/ld: libcrypto_sign_mqqsig160.a(keygen.o):(.bss+0x0): multiple definition of `lookup_table_private_key'; /tmp/ccKkcvIq.o:(.bss+0x20): first defined here
try.c: /usr/bin/ld: libcrypto_sign_mqqsig160.a(keygen.o):(.bss+0x20000): multiple definition of `mqq_sigmaK'; /tmp/ccKkcvIq.o:(.bss+0x20020): first defined here
try.c: /usr/bin/ld: libcrypto_sign_mqqsig160.a(keygen.o):(.bss+0x200a0): multiple definition of `mqq_sigma1'; /tmp/ccKkcvIq.o:(.bss+0x200c0): first defined here
try.c: /usr/bin/ld: libcrypto_sign_mqqsig160.a(keygen.o):(.bss+0x20140): multiple definition of `cc2'; /tmp/ccKkcvIq.o:(.bss+0x20160): first defined here
try.c: /usr/bin/ld: libcrypto_sign_mqqsig160.a(keygen.o):(.bss+0x20150): multiple definition of `cc1'; /tmp/ccKkcvIq.o:(.bss+0x20170): first defined here
try.c: /usr/bin/ld: libcrypto_sign_mqqsig160.a(keygen.o):(.bss+0x20160): multiple definition of `mqq_a'; /tmp/ccKkcvIq.o:(.bss+0x20180): first defined here
try.c: /usr/bin/ld: libcrypto_sign_mqqsig160.a(mqq-sign.o):(.bss+0x20000): multiple definition of `mqq_sigmaK'; /tmp/ccKkcvIq.o:(.bss+0x20020): first defined here
try.c: /usr/bin/ld: libcrypto_sign_mqqsig160.a(mqq-sign.o):(.bss+0x200a0): multiple definition of `mqq_sigma1'; /tmp/ccKkcvIq.o:(.bss+0x200c0): first defined here
try.c: /usr/bin/ld: libcrypto_sign_mqqsig160.a(mqq-sign.o):(.bss+0x20150): multiple definition of `cc1'; /tmp/ccKkcvIq.o:(.bss+0x20170): first defined here
try.c: /usr/bin/ld: libcrypto_sign_mqqsig160.a(mqq-sign.o):(.bss+0x20160): multiple definition of `mqq_a'; /tmp/ccKkcvIq.o:(.bss+0x20180): first defined here
try.c: /usr/bin/ld: libcrypto_sign_mqqsig160.a(mqq-sign.o):(.bss+0x20140): multiple definition of `cc2'; /tmp/ccKkcvIq.o:(.bss+0x20160): first defined here
try.c: /usr/bin/ld: libcrypto_sign_mqqsig160.a(mqq-sign.o):(.bss+0x0): multiple definition of `lookup_table_private_key'; /tmp/ccKkcvIq.o:(.bss+0x20): first defined here
try.c: /usr/bin/ld: libcrypto_sign_mqqsig160.a(mqq-verify.o):(.bss+0x0): multiple definition of `lookup_table_private_key'; /tmp/ccKkcvIq.o:(.bss+0x20): first defined here
try.c: /usr/bin/ld: libcrypto_sign_mqqsig160.a(mqq-verify.o):(.bss+0x20000): multiple definition of `mqq_sigmaK'; /tmp/ccKkcvIq.o:(.bss+0x20020): first defined here
try.c: /usr/bin/ld: libcrypto_sign_mqqsig160.a(mqq-verify.o):(.bss+0x200a0): multiple definition of `mqq_sigma1'; /tmp/ccKkcvIq.o:(.bss+0x200c0): first defined here
try.c: /usr/bin/ld: libcrypto_sign_mqqsig160.a(mqq-verify.o):(.bss+0x20140): multiple definition of `cc2'; /tmp/ccKkcvIq.o:(.bss+0x20160): first defined here
try.c: /usr/bin/ld: libcrypto_sign_mqqsig160.a(mqq-verify.o):(.bss+0x20150): multiple definition of `cc1'; /tmp/ccKkcvIq.o:(.bss+0x20170): first defined here
try.c: /usr/bin/ld: libcrypto_sign_mqqsig160.a(mqq-verify.o):(.bss+0x20160): multiple definition of `mqq_a'; /tmp/ccKkcvIq.o:(.bss+0x20180): first defined here
try.c: collect2: error: ld returned 1 exit status

Number of similar (compiler,implementation) pairs: 1, namely:
CompilerImplementations
gcc -march=native -mtune=native -O -fomit-frame-pointer -fwrapv -fPIC -fPIE T:sse

Compiler output

Implementation: T:sse
Security model: timingleaks
Compiler: gcc -march=native -mtune=native -Os -fomit-frame-pointer -fwrapv -fPIC -fPIE
try.c: /usr/bin/ld: libcrypto_sign_mqqsig160.a(keygen.o):(.bss+0x0): multiple definition of `lookup_table_private_key'; /tmp/cce91cH8.o:(.bss+0x20): first defined here
try.c: /usr/bin/ld: libcrypto_sign_mqqsig160.a(keygen.o):(.bss+0x20000): multiple definition of `mqq_sigmaK'; /tmp/cce91cH8.o:(.bss+0x20020): first defined here
try.c: /usr/bin/ld: libcrypto_sign_mqqsig160.a(keygen.o):(.bss+0x200a0): multiple definition of `mqq_sigma1'; /tmp/cce91cH8.o:(.bss+0x200c0): first defined here
try.c: /usr/bin/ld: libcrypto_sign_mqqsig160.a(keygen.o):(.bss+0x20140): multiple definition of `cc2'; /tmp/cce91cH8.o:(.bss+0x20160): first defined here
try.c: /usr/bin/ld: libcrypto_sign_mqqsig160.a(keygen.o):(.bss+0x20150): multiple definition of `cc1'; /tmp/cce91cH8.o:(.bss+0x20170): first defined here
try.c: /usr/bin/ld: libcrypto_sign_mqqsig160.a(keygen.o):(.bss+0x20160): multiple definition of `mqq_a'; /tmp/cce91cH8.o:(.bss+0x20180): first defined here
try.c: /usr/bin/ld: libcrypto_sign_mqqsig160.a(mqq-sign.o):(.bss+0x20000): multiple definition of `mqq_sigmaK'; /tmp/cce91cH8.o:(.bss+0x20020): first defined here
try.c: /usr/bin/ld: libcrypto_sign_mqqsig160.a(mqq-sign.o):(.bss+0x200a0): multiple definition of `mqq_sigma1'; /tmp/cce91cH8.o:(.bss+0x200c0): first defined here
try.c: /usr/bin/ld: libcrypto_sign_mqqsig160.a(mqq-sign.o):(.bss+0x20150): multiple definition of `cc1'; /tmp/cce91cH8.o:(.bss+0x20170): first defined here
try.c: /usr/bin/ld: libcrypto_sign_mqqsig160.a(mqq-sign.o):(.bss+0x20160): multiple definition of `mqq_a'; /tmp/cce91cH8.o:(.bss+0x20180): first defined here
try.c: /usr/bin/ld: libcrypto_sign_mqqsig160.a(mqq-sign.o):(.bss+0x20140): multiple definition of `cc2'; /tmp/cce91cH8.o:(.bss+0x20160): first defined here
try.c: /usr/bin/ld: libcrypto_sign_mqqsig160.a(mqq-sign.o):(.bss+0x0): multiple definition of `lookup_table_private_key'; /tmp/cce91cH8.o:(.bss+0x20): first defined here
try.c: /usr/bin/ld: libcrypto_sign_mqqsig160.a(mqq-verify.o):(.bss+0x0): multiple definition of `lookup_table_private_key'; /tmp/cce91cH8.o:(.bss+0x20): first defined here
try.c: /usr/bin/ld: libcrypto_sign_mqqsig160.a(mqq-verify.o):(.bss+0x20000): multiple definition of `mqq_sigmaK'; /tmp/cce91cH8.o:(.bss+0x20020): first defined here
try.c: /usr/bin/ld: libcrypto_sign_mqqsig160.a(mqq-verify.o):(.bss+0x200a0): multiple definition of `mqq_sigma1'; /tmp/cce91cH8.o:(.bss+0x200c0): first defined here
try.c: /usr/bin/ld: libcrypto_sign_mqqsig160.a(mqq-verify.o):(.bss+0x20140): multiple definition of `cc2'; /tmp/cce91cH8.o:(.bss+0x20160): first defined here
try.c: /usr/bin/ld: libcrypto_sign_mqqsig160.a(mqq-verify.o):(.bss+0x20150): multiple definition of `cc1'; /tmp/cce91cH8.o:(.bss+0x20170): first defined here
try.c: /usr/bin/ld: libcrypto_sign_mqqsig160.a(mqq-verify.o):(.bss+0x20160): multiple definition of `mqq_a'; /tmp/cce91cH8.o:(.bss+0x20180): first defined here
try.c: collect2: error: ld returned 1 exit status

Number of similar (compiler,implementation) pairs: 1, namely:
CompilerImplementations
gcc -march=native -mtune=native -Os -fomit-frame-pointer -fwrapv -fPIC -fPIE T:sse