Implementation notes: amd64, hunsnivy, crypto_hash/md2

Computer: hunsnivy
Microarchitecture: amd64; Ivy Bridge+AES (306a9)
Architecture: amd64
CPU ID: GenuineIntel-000306a9-bfebfbff
SUPERCOP version: 20240625
Operation: crypto_hash
Primitive: md2

Compiler output


hash.c: hash.c:7:3: warning: implicit declaration of function 'MD2' is invalid in C99 [-Wimplicit-function-declaration]
hash.c:   MD2(in,inlen,out);
hash.c:   ^
hash.c: 1 warning generated.
try.c: /usr/bin/ld: libcrypto_hash_md2.a(hash.o): in function `crypto_hash_md2_openssl_timingleaks':
try.c: .../supercop-data/hunsnivy/amd64/try/c/clang_-march=native_-O2_-fwrapv_-Qunused-arguments_-fPIC_-fPIE_-gdwarf-4_-Wall/timingleaks/crypto_hash/md2/openssl/work/hash.c:7: undefined reference to `MD2'
try.c: clang: error: linker command failed with exit code 1 (use -v to see invocation)

Number of similar (implementation,compiler) pairs: 1, namely:
ImplementationCompiler
T:opensslclang -march=native -O2 -fwrapv -Qunused-arguments -fPIC -fPIE -gdwarf-4 -Wall (Debian_Clang_11.0.1)

Compiler output


hash.c: hash.c:7:3: warning: implicit declaration of function 'MD2' is invalid in C99 [-Wimplicit-function-declaration]
hash.c:   MD2(in,inlen,out);
hash.c:   ^
hash.c: 1 warning generated.
try.c: /usr/bin/ld: libcrypto_hash_md2.a(hash.o): in function `crypto_hash_md2_openssl_timingleaks':
try.c: .../supercop-data/hunsnivy/amd64/try/c/clang_-march=native_-O3_-fwrapv_-Qunused-arguments_-fPIC_-fPIE_-gdwarf-4_-Wall/timingleaks/crypto_hash/md2/openssl/work/hash.c:7: undefined reference to `MD2'
try.c: clang: error: linker command failed with exit code 1 (use -v to see invocation)

Number of similar (implementation,compiler) pairs: 1, namely:
ImplementationCompiler
T:opensslclang -march=native -O3 -fwrapv -Qunused-arguments -fPIC -fPIE -gdwarf-4 -Wall (Debian_Clang_11.0.1)

Compiler output


hash.c: hash.c:7:3: warning: implicit declaration of function 'MD2' is invalid in C99 [-Wimplicit-function-declaration]
hash.c:   MD2(in,inlen,out);
hash.c:   ^
hash.c: 1 warning generated.
try.c: /usr/bin/ld: libcrypto_hash_md2.a(hash.o): in function `crypto_hash_md2_openssl_timingleaks':
try.c: .../supercop-data/hunsnivy/amd64/try/c/clang_-march=native_-O_-fwrapv_-Qunused-arguments_-fPIC_-fPIE_-gdwarf-4_-Wall/timingleaks/crypto_hash/md2/openssl/work/hash.c:7: undefined reference to `MD2'
try.c: clang: error: linker command failed with exit code 1 (use -v to see invocation)

Number of similar (implementation,compiler) pairs: 1, namely:
ImplementationCompiler
T:opensslclang -march=native -O -fwrapv -Qunused-arguments -fPIC -fPIE -gdwarf-4 -Wall (Debian_Clang_11.0.1)

Compiler output


hash.c: hash.c:7:3: warning: implicit declaration of function 'MD2' is invalid in C99 [-Wimplicit-function-declaration]
hash.c:   MD2(in,inlen,out);
hash.c:   ^
hash.c: 1 warning generated.
try.c: /usr/bin/ld: libcrypto_hash_md2.a(hash.o): in function `crypto_hash_md2_openssl_timingleaks':
try.c: .../supercop-data/hunsnivy/amd64/try/c/clang_-march=native_-Os_-fwrapv_-Qunused-arguments_-fPIC_-fPIE_-gdwarf-4_-Wall/timingleaks/crypto_hash/md2/openssl/work/hash.c:7: undefined reference to `MD2'
try.c: clang: error: linker command failed with exit code 1 (use -v to see invocation)

Number of similar (implementation,compiler) pairs: 1, namely:
ImplementationCompiler
T:opensslclang -march=native -Os -fwrapv -Qunused-arguments -fPIC -fPIE -gdwarf-4 -Wall (Debian_Clang_11.0.1)

Compiler output


hash.c: hash.c:7:3: warning: implicit declaration of function 'MD2' is invalid in C99 [-Wimplicit-function-declaration]
hash.c:   MD2(in,inlen,out);
hash.c:   ^
hash.c: 1 warning generated.
try.c: /usr/bin/ld: libcrypto_hash_md2.a(hash.o): in function `crypto_hash_md2_openssl_timingleaks':
try.c: .../supercop-data/hunsnivy/amd64/try/c/clang_-mcpu=native_-O3_-fwrapv_-Qunused-arguments_-fPIC_-fPIE_-gdwarf-4_-Wall/timingleaks/crypto_hash/md2/openssl/work/hash.c:7: undefined reference to `MD2'
try.c: clang: error: linker command failed with exit code 1 (use -v to see invocation)

Number of similar (implementation,compiler) pairs: 1, namely:
ImplementationCompiler
T:opensslclang -mcpu=native -O3 -fwrapv -Qunused-arguments -fPIC -fPIE -gdwarf-4 -Wall (Debian_Clang_11.0.1)

Compiler output


hash.c: hash.c: In function 'crypto_hash_md2_openssl_timingleaks':
hash.c: hash.c:7:3: warning: implicit declaration of function 'MD2' [-Wimplicit-function-declaration]
hash.c:     7 |   MD2(in,inlen,out);
hash.c:       |   ^~~
try.c: /usr/bin/ld: libcrypto_hash_md2.a(hash.o): in function `crypto_hash_md2_openssl_timingleaks':
try.c: .../supercop-data/hunsnivy/amd64/try/c/gcc_-march=native_-mtune=native_-O2_-fwrapv_-fPIC_-fPIE_-gdwarf-4_-Wall/timingleaks/crypto_hash/md2/openssl/work/hash.c:7: undefined reference to `MD2'
try.c: collect2: error: ld returned 1 exit status

Number of similar (implementation,compiler) pairs: 1, namely:
ImplementationCompiler
T:opensslgcc -march=native -mtune=native -O2 -fwrapv -fPIC -fPIE -gdwarf-4 -Wall (10.2.1_20210110)

Compiler output


hash.c: hash.c: In function 'crypto_hash_md2_openssl_timingleaks':
hash.c: hash.c:7:3: warning: implicit declaration of function 'MD2' [-Wimplicit-function-declaration]
hash.c:     7 |   MD2(in,inlen,out);
hash.c:       |   ^~~
try.c: /usr/bin/ld: libcrypto_hash_md2.a(hash.o): in function `crypto_hash_md2_openssl_timingleaks':
try.c: .../supercop-data/hunsnivy/amd64/try/c/gcc_-march=native_-mtune=native_-O3_-fwrapv_-fPIC_-fPIE_-gdwarf-4_-Wall/timingleaks/crypto_hash/md2/openssl/work/hash.c:7: undefined reference to `MD2'
try.c: collect2: error: ld returned 1 exit status

Number of similar (implementation,compiler) pairs: 1, namely:
ImplementationCompiler
T:opensslgcc -march=native -mtune=native -O3 -fwrapv -fPIC -fPIE -gdwarf-4 -Wall (10.2.1_20210110)

Compiler output


hash.c: hash.c: In function 'crypto_hash_md2_openssl_timingleaks':
hash.c: hash.c:7:3: warning: implicit declaration of function 'MD2' [-Wimplicit-function-declaration]
hash.c:     7 |   MD2(in,inlen,out);
hash.c:       |   ^~~
try.c: /usr/bin/ld: libcrypto_hash_md2.a(hash.o): in function `crypto_hash_md2_openssl_timingleaks':
try.c: .../supercop-data/hunsnivy/amd64/try/c/gcc_-march=native_-mtune=native_-O_-fwrapv_-fPIC_-fPIE_-gdwarf-4_-Wall/timingleaks/crypto_hash/md2/openssl/work/hash.c:7: undefined reference to `MD2'
try.c: collect2: error: ld returned 1 exit status

Number of similar (implementation,compiler) pairs: 1, namely:
ImplementationCompiler
T:opensslgcc -march=native -mtune=native -O -fwrapv -fPIC -fPIE -gdwarf-4 -Wall (10.2.1_20210110)

Compiler output


hash.c: hash.c: In function 'crypto_hash_md2_openssl_timingleaks':
hash.c: hash.c:7:3: warning: implicit declaration of function 'MD2' [-Wimplicit-function-declaration]
hash.c:     7 |   MD2(in,inlen,out);
hash.c:       |   ^~~
try.c: /usr/bin/ld: libcrypto_hash_md2.a(hash.o): in function `crypto_hash_md2_openssl_timingleaks':
try.c: .../supercop-data/hunsnivy/amd64/try/c/gcc_-march=native_-mtune=native_-Os_-fwrapv_-fPIC_-fPIE_-gdwarf-4_-Wall/timingleaks/crypto_hash/md2/openssl/work/hash.c:7: undefined reference to `MD2'
try.c: collect2: error: ld returned 1 exit status

Number of similar (implementation,compiler) pairs: 1, namely:
ImplementationCompiler
T:opensslgcc -march=native -mtune=native -Os -fwrapv -fPIC -fPIE -gdwarf-4 -Wall (10.2.1_20210110)