Implementation notes: amd64, hertz, crypto_encrypt/r5nd3pke0d

Computer: hertz
Microarchitecture: amd64; Zen 4 (a60f12)
Architecture: amd64
CPU ID: AuthenticAMD-00a60f12-178bfbff
SUPERCOP version: 20240625
Operation: crypto_encrypt
Primitive: r5nd3pke0d
TimeObject sizeTest sizeImplementationCompilerBenchmark dateSUPERCOP version
29292936501 0 0154032 1020 1896T:optgcc_-march=native_-mtune=native_-O3_-fwrapv_-fPIC_-fPIE_-gdwarf-4_-Wall2024070620240625
29300436501 0 0154032 1020 1896T:avx2gcc_-march=native_-mtune=native_-O3_-fwrapv_-fPIC_-fPIE_-gdwarf-4_-Wall2024070620240625
35594752837 0 0164246 1028 1832T:avx2clang_-march=native_-O3_-fwrapv_-Qunused-arguments_-fPIC_-fPIE_-gdwarf-4_-Wall2024070620240625
36119752837 0 0164246 1028 1832T:optclang_-march=native_-O3_-fwrapv_-Qunused-arguments_-fPIC_-fPIE_-gdwarf-4_-Wall2024070620240625
37817447388 0 0164422 1028 1832T:optclang_-march=native_-O2_-fwrapv_-Qunused-arguments_-fPIC_-fPIE_-gdwarf-4_-Wall2024070620240625
37912647388 0 0164422 1028 1832T:avx2clang_-march=native_-O2_-fwrapv_-Qunused-arguments_-fPIC_-fPIE_-gdwarf-4_-Wall2024070620240625
82490724480 0 0146384 1020 1832T:avx2clang_-march=native_-Os_-fwrapv_-Qunused-arguments_-fPIC_-fPIE_-gdwarf-4_-Wall2024070620240625
82956224480 0 0146384 1020 1832T:optclang_-march=native_-Os_-fwrapv_-Qunused-arguments_-fPIC_-fPIE_-gdwarf-4_-Wall2024070620240625
131395624996 0 0146256 1020 1832T:optgcc_-march=native_-mtune=native_-O2_-fwrapv_-fPIC_-fPIE_-gdwarf-4_-Wall2024070620240625
131557224996 0 0146256 1020 1832T:avx2gcc_-march=native_-mtune=native_-O2_-fwrapv_-fPIC_-fPIE_-gdwarf-4_-Wall2024070620240625
182947321694 0 0142720 1012 1800T:avx2gcc_-march=native_-mtune=native_-Os_-fwrapv_-fPIC_-fPIE_-gdwarf-4_-Wall2024070620240625
183000121694 0 0142720 1012 1800T:optgcc_-march=native_-mtune=native_-Os_-fwrapv_-fPIC_-fPIE_-gdwarf-4_-Wall2024070620240625

Compiler output


try.c: /usr/bin/ld: libcrypto_encrypt_r5nd3pke0d.a(parameters.o):.../supercop-data/hertz/amd64/try/c/clang_-march=native_-O2_-fwrapv_-Qunused-arguments_-fPIC_-fPIE_-gdwarf-4_-Wall/timingleaks/crypto_encrypt/r5nd3pke0d/ref/work/./r5_parameter_sets.h:63: multiple definition of `r5_parameter_sets'; libcrypto_encrypt_r5nd3pke0d.a(cca_encrypt.o):.../supercop-data/hertz/amd64/try/c/clang_-march=native_-O2_-fwrapv_-Qunused-arguments_-fPIC_-fPIE_-gdwarf-4_-Wall/timingleaks/crypto_encrypt/r5nd3pke0d/ref/work/./r5_parameter_sets.h:63: first defined here
try.c: /usr/bin/ld: libcrypto_encrypt_r5nd3pke0d.a(parameters.o):.../supercop-data/hertz/amd64/try/c/clang_-march=native_-O2_-fwrapv_-Qunused-arguments_-fPIC_-fPIE_-gdwarf-4_-Wall/timingleaks/crypto_encrypt/r5nd3pke0d/ref/work/./r5_parameter_sets.h:66: multiple definition of `r5_parameter_set_names'; libcrypto_encrypt_r5nd3pke0d.a(cca_encrypt.o):.../supercop-data/hertz/amd64/try/c/clang_-march=native_-O2_-fwrapv_-Qunused-arguments_-fPIC_-fPIE_-gdwarf-4_-Wall/timingleaks/crypto_encrypt/r5nd3pke0d/ref/work/./r5_parameter_sets.h:66: first defined here
try.c: /usr/bin/ld: libcrypto_encrypt_r5nd3pke0d.a(r5_cca_pke.o):.../supercop-data/hertz/amd64/try/c/clang_-march=native_-O2_-fwrapv_-Qunused-arguments_-fPIC_-fPIE_-gdwarf-4_-Wall/timingleaks/crypto_encrypt/r5nd3pke0d/ref/work/./r5_parameter_sets.h:63: multiple definition of `r5_parameter_sets'; libcrypto_encrypt_r5nd3pke0d.a(cca_encrypt.o):.../supercop-data/hertz/amd64/try/c/clang_-march=native_-O2_-fwrapv_-Qunused-arguments_-fPIC_-fPIE_-gdwarf-4_-Wall/timingleaks/crypto_encrypt/r5nd3pke0d/ref/work/./r5_parameter_sets.h:63: first defined here
try.c: /usr/bin/ld: libcrypto_encrypt_r5nd3pke0d.a(r5_cca_pke.o):.../supercop-data/hertz/amd64/try/c/clang_-march=native_-O2_-fwrapv_-Qunused-arguments_-fPIC_-fPIE_-gdwarf-4_-Wall/timingleaks/crypto_encrypt/r5nd3pke0d/ref/work/./r5_parameter_sets.h:66: multiple definition of `r5_parameter_set_names'; libcrypto_encrypt_r5nd3pke0d.a(cca_encrypt.o):.../supercop-data/hertz/amd64/try/c/clang_-march=native_-O2_-fwrapv_-Qunused-arguments_-fPIC_-fPIE_-gdwarf-4_-Wall/timingleaks/crypto_encrypt/r5nd3pke0d/ref/work/./r5_parameter_sets.h:66: first defined here
try.c: /usr/bin/ld: libcrypto_encrypt_r5nd3pke0d.a(r5_cca_kem.o):.../supercop-data/hertz/amd64/try/c/clang_-march=native_-O2_-fwrapv_-Qunused-arguments_-fPIC_-fPIE_-gdwarf-4_-Wall/timingleaks/crypto_encrypt/r5nd3pke0d/ref/work/./r5_parameter_sets.h:63: multiple definition of `r5_parameter_sets'; libcrypto_encrypt_r5nd3pke0d.a(cca_encrypt.o):.../supercop-data/hertz/amd64/try/c/clang_-march=native_-O2_-fwrapv_-Qunused-arguments_-fPIC_-fPIE_-gdwarf-4_-Wall/timingleaks/crypto_encrypt/r5nd3pke0d/ref/work/./r5_parameter_sets.h:63: first defined here
try.c: /usr/bin/ld: libcrypto_encrypt_r5nd3pke0d.a(r5_cca_kem.o):.../supercop-data/hertz/amd64/try/c/clang_-march=native_-O2_-fwrapv_-Qunused-arguments_-fPIC_-fPIE_-gdwarf-4_-Wall/timingleaks/crypto_encrypt/r5nd3pke0d/ref/work/./r5_parameter_sets.h:66: multiple definition of `r5_parameter_set_names'; libcrypto_encrypt_r5nd3pke0d.a(cca_encrypt.o):.../supercop-data/hertz/amd64/try/c/clang_-march=native_-O2_-fwrapv_-Qunused-arguments_-fPIC_-fPIE_-gdwarf-4_-Wall/timingleaks/crypto_encrypt/r5nd3pke0d/ref/work/./r5_parameter_sets.h:66: first defined here
try.c: /usr/bin/ld: libcrypto_encrypt_r5nd3pke0d.a(r5_cpa_pke.o):.../supercop-data/hertz/amd64/try/c/clang_-march=native_-O2_-fwrapv_-Qunused-arguments_-fPIC_-fPIE_-gdwarf-4_-Wall/timingleaks/crypto_encrypt/r5nd3pke0d/ref/work/./r5_parameter_sets.h:63: multiple definition of `r5_parameter_sets'; libcrypto_encrypt_r5nd3pke0d.a(cca_encrypt.o):.../supercop-data/hertz/amd64/try/c/clang_-march=native_-O2_-fwrapv_-Qunused-arguments_-fPIC_-fPIE_-gdwarf-4_-Wall/timingleaks/crypto_encrypt/r5nd3pke0d/ref/work/./r5_parameter_sets.h:63: first defined here
try.c: /usr/bin/ld: libcrypto_encrypt_r5nd3pke0d.a(r5_cpa_pke.o):.../supercop-data/hertz/amd64/try/c/clang_-march=native_-O2_-fwrapv_-Qunused-arguments_-fPIC_-fPIE_-gdwarf-4_-Wall/timingleaks/crypto_encrypt/r5nd3pke0d/ref/work/./r5_parameter_sets.h:66: multiple definition of `r5_parameter_set_names'; libcrypto_encrypt_r5nd3pke0d.a(cca_encrypt.o):.../supercop-data/hertz/amd64/try/c/clang_-march=native_-O2_-fwrapv_-Qunused-arguments_-fPIC_-fPIE_-gdwarf-4_-Wall/timingleaks/crypto_encrypt/r5nd3pke0d/ref/work/./r5_parameter_sets.h:66: first defined here
try.c: /usr/bin/ld: libcrypto_encrypt_r5nd3pke0d.a(r5_core.o):.../supercop-data/hertz/amd64/try/c/clang_-march=native_-O2_-fwrapv_-Qunused-arguments_-fPIC_-fPIE_-gdwarf-4_-Wall/timingleaks/crypto_encrypt/r5nd3pke0d/ref/work/./r5_parameter_sets.h:63: multiple definition of `r5_parameter_sets'; libcrypto_encrypt_r5nd3pke0d.a(cca_encrypt.o):.../supercop-data/hertz/amd64/try/c/clang_-march=native_-O2_-fwrapv_-Qunused-arguments_-fPIC_-fPIE_-gdwarf-4_-Wall/timingleaks/crypto_encrypt/r5nd3pke0d/ref/work/./r5_parameter_sets.h:63: first defined here
try.c: /usr/bin/ld: libcrypto_encrypt_r5nd3pke0d.a(r5_core.o):.../supercop-data/hertz/amd64/try/c/clang_-march=native_-O2_-fwrapv_-Qunused-arguments_-fPIC_-fPIE_-gdwarf-4_-Wall/timingleaks/crypto_encrypt/r5nd3pke0d/ref/work/./r5_parameter_sets.h:66: multiple definition of `r5_parameter_set_names'; libcrypto_encrypt_r5nd3pke0d.a(cca_encrypt.o):.../supercop-data/hertz/amd64/try/c/clang_-march=native_-O2_-fwrapv_-Qunused-arguments_-fPIC_-fPIE_-gdwarf-4_-Wall/timingleaks/crypto_encrypt/r5nd3pke0d/ref/work/./r5_parameter_sets.h:66: first defined here
try.c: /usr/bin/ld: libcrypto_encrypt_r5nd3pke0d.a(a_fixed.o):.../supercop-data/hertz/amd64/try/c/clang_-march=native_-O2_-fwrapv_-Qunused-arguments_-fPIC_-fPIE_-gdwarf-4_-Wall/timingleaks/crypto_encrypt/r5nd3pke0d/ref/work/./r5_parameter_sets.h:63: multiple definition of `r5_parameter_sets'; libcrypto_encrypt_r5nd3pke0d.a(cca_encrypt.o):.../supercop-data/hertz/amd64/try/c/clang_-march=native_-O2_-fwrapv_-Qunused-arguments_-fPIC_-fPIE_-gdwarf-4_-Wall/timingleaks/crypto_encrypt/r5nd3pke0d/ref/work/./r5_parameter_sets.h:63: first defined here
try.c: /usr/bin/ld: libcrypto_encrypt_r5nd3pke0d.a(a_fixed.o):.../supercop-data/hertz/amd64/try/c/clang_-march=native_-O2_-fwrapv_-Qunused-arguments_-fPIC_-fPIE_-gdwarf-4_-Wall/timingleaks/crypto_encrypt/r5nd3pke0d/ref/work/./r5_parameter_sets.h:66: multiple definition of `r5_parameter_set_names'; libcrypto_encrypt_r5nd3pke0d.a(cca_encrypt.o):.../supercop-data/hertz/amd64/try/c/clang_-march=native_-O2_-fwrapv_-Qunused-arguments_-fPIC_-fPIE_-gdwarf-4_-Wall/timingleaks/crypto_encrypt/r5nd3pke0d/ref/work/./r5_parameter_sets.h:66: first defined here
try.c: /usr/bin/ld: libcrypto_encrypt_r5nd3pke0d.a(a_random.o):.../supercop-data/hertz/amd64/try/c/clang_-march=native_-O2_-fwrapv_-Qunused-arguments_-fPIC_-fPIE_-gdwarf-4_-Wall/timingleaks/crypto_encrypt/r5nd3pke0d/ref/work/./r5_parameter_sets.h:63: multiple definition of `r5_parameter_sets'; libcrypto_encrypt_r5nd3pke0d.a(cca_encrypt.o):.../supercop-data/hertz/amd64/try/c/clang_-march=native_-O2_-fwrapv_-Qunused-arguments_-fPIC_-fPIE_-gdwarf-4_-Wall/timingleaks/crypto_encrypt/r5nd3pke0d/ref/work/./r5_parameter_sets.h:63: first defined here
try.c: /usr/bin/ld: libcrypto_encrypt_r5nd3pke0d.a(a_random.o):.../supercop-data/hertz/amd64/try/c/clang_-march=native_-O2_-fwrapv_-Qunused-arguments_-fPIC_-fPIE_-gdwarf-4_-Wall/timingleaks/crypto_encrypt/r5nd3pke0d/ref/work/./r5_parameter_sets.h:66: multiple definition of `r5_parameter_set_names'; libcrypto_encrypt_r5nd3pke0d.a(cca_encrypt.o):.../supercop-data/hertz/amd64/try/c/clang_-march=native_-O2_-fwrapv_-Qunused-arguments_-fPIC_-fPIE_-gdwarf-4_-Wall/timingleaks/crypto_encrypt/r5nd3pke0d/ref/work/./r5_parameter_sets.h:66: first defined here
try.c: clang: error: linker command failed with exit code 1 (use -v to see invocation)

Number of similar (implementation,compiler) pairs: 1, namely:
ImplementationCompiler
T:refclang -march=native -O2 -fwrapv -Qunused-arguments -fPIC -fPIE -gdwarf-4 -Wall (Ubuntu_Clang_18.1.3_(1ubuntu1))

Compiler output


try.c: /usr/bin/ld: libcrypto_encrypt_r5nd3pke0d.a(parameters.o):.../supercop-data/hertz/amd64/try/c/clang_-march=native_-O3_-fwrapv_-Qunused-arguments_-fPIC_-fPIE_-gdwarf-4_-Wall/timingleaks/crypto_encrypt/r5nd3pke0d/ref/work/./r5_parameter_sets.h:63: multiple definition of `r5_parameter_sets'; libcrypto_encrypt_r5nd3pke0d.a(cca_encrypt.o):.../supercop-data/hertz/amd64/try/c/clang_-march=native_-O3_-fwrapv_-Qunused-arguments_-fPIC_-fPIE_-gdwarf-4_-Wall/timingleaks/crypto_encrypt/r5nd3pke0d/ref/work/./r5_parameter_sets.h:63: first defined here
try.c: /usr/bin/ld: libcrypto_encrypt_r5nd3pke0d.a(parameters.o):.../supercop-data/hertz/amd64/try/c/clang_-march=native_-O3_-fwrapv_-Qunused-arguments_-fPIC_-fPIE_-gdwarf-4_-Wall/timingleaks/crypto_encrypt/r5nd3pke0d/ref/work/./r5_parameter_sets.h:66: multiple definition of `r5_parameter_set_names'; libcrypto_encrypt_r5nd3pke0d.a(cca_encrypt.o):.../supercop-data/hertz/amd64/try/c/clang_-march=native_-O3_-fwrapv_-Qunused-arguments_-fPIC_-fPIE_-gdwarf-4_-Wall/timingleaks/crypto_encrypt/r5nd3pke0d/ref/work/./r5_parameter_sets.h:66: first defined here
try.c: /usr/bin/ld: libcrypto_encrypt_r5nd3pke0d.a(r5_cca_pke.o):.../supercop-data/hertz/amd64/try/c/clang_-march=native_-O3_-fwrapv_-Qunused-arguments_-fPIC_-fPIE_-gdwarf-4_-Wall/timingleaks/crypto_encrypt/r5nd3pke0d/ref/work/./r5_parameter_sets.h:63: multiple definition of `r5_parameter_sets'; libcrypto_encrypt_r5nd3pke0d.a(cca_encrypt.o):.../supercop-data/hertz/amd64/try/c/clang_-march=native_-O3_-fwrapv_-Qunused-arguments_-fPIC_-fPIE_-gdwarf-4_-Wall/timingleaks/crypto_encrypt/r5nd3pke0d/ref/work/./r5_parameter_sets.h:63: first defined here
try.c: /usr/bin/ld: libcrypto_encrypt_r5nd3pke0d.a(r5_cca_pke.o):.../supercop-data/hertz/amd64/try/c/clang_-march=native_-O3_-fwrapv_-Qunused-arguments_-fPIC_-fPIE_-gdwarf-4_-Wall/timingleaks/crypto_encrypt/r5nd3pke0d/ref/work/./r5_parameter_sets.h:66: multiple definition of `r5_parameter_set_names'; libcrypto_encrypt_r5nd3pke0d.a(cca_encrypt.o):.../supercop-data/hertz/amd64/try/c/clang_-march=native_-O3_-fwrapv_-Qunused-arguments_-fPIC_-fPIE_-gdwarf-4_-Wall/timingleaks/crypto_encrypt/r5nd3pke0d/ref/work/./r5_parameter_sets.h:66: first defined here
try.c: /usr/bin/ld: libcrypto_encrypt_r5nd3pke0d.a(r5_cca_kem.o):.../supercop-data/hertz/amd64/try/c/clang_-march=native_-O3_-fwrapv_-Qunused-arguments_-fPIC_-fPIE_-gdwarf-4_-Wall/timingleaks/crypto_encrypt/r5nd3pke0d/ref/work/./r5_parameter_sets.h:63: multiple definition of `r5_parameter_sets'; libcrypto_encrypt_r5nd3pke0d.a(cca_encrypt.o):.../supercop-data/hertz/amd64/try/c/clang_-march=native_-O3_-fwrapv_-Qunused-arguments_-fPIC_-fPIE_-gdwarf-4_-Wall/timingleaks/crypto_encrypt/r5nd3pke0d/ref/work/./r5_parameter_sets.h:63: first defined here
try.c: /usr/bin/ld: libcrypto_encrypt_r5nd3pke0d.a(r5_cca_kem.o):.../supercop-data/hertz/amd64/try/c/clang_-march=native_-O3_-fwrapv_-Qunused-arguments_-fPIC_-fPIE_-gdwarf-4_-Wall/timingleaks/crypto_encrypt/r5nd3pke0d/ref/work/./r5_parameter_sets.h:66: multiple definition of `r5_parameter_set_names'; libcrypto_encrypt_r5nd3pke0d.a(cca_encrypt.o):.../supercop-data/hertz/amd64/try/c/clang_-march=native_-O3_-fwrapv_-Qunused-arguments_-fPIC_-fPIE_-gdwarf-4_-Wall/timingleaks/crypto_encrypt/r5nd3pke0d/ref/work/./r5_parameter_sets.h:66: first defined here
try.c: /usr/bin/ld: libcrypto_encrypt_r5nd3pke0d.a(r5_cpa_pke.o):.../supercop-data/hertz/amd64/try/c/clang_-march=native_-O3_-fwrapv_-Qunused-arguments_-fPIC_-fPIE_-gdwarf-4_-Wall/timingleaks/crypto_encrypt/r5nd3pke0d/ref/work/./r5_parameter_sets.h:63: multiple definition of `r5_parameter_sets'; libcrypto_encrypt_r5nd3pke0d.a(cca_encrypt.o):.../supercop-data/hertz/amd64/try/c/clang_-march=native_-O3_-fwrapv_-Qunused-arguments_-fPIC_-fPIE_-gdwarf-4_-Wall/timingleaks/crypto_encrypt/r5nd3pke0d/ref/work/./r5_parameter_sets.h:63: first defined here
try.c: /usr/bin/ld: libcrypto_encrypt_r5nd3pke0d.a(r5_cpa_pke.o):.../supercop-data/hertz/amd64/try/c/clang_-march=native_-O3_-fwrapv_-Qunused-arguments_-fPIC_-fPIE_-gdwarf-4_-Wall/timingleaks/crypto_encrypt/r5nd3pke0d/ref/work/./r5_parameter_sets.h:66: multiple definition of `r5_parameter_set_names'; libcrypto_encrypt_r5nd3pke0d.a(cca_encrypt.o):.../supercop-data/hertz/amd64/try/c/clang_-march=native_-O3_-fwrapv_-Qunused-arguments_-fPIC_-fPIE_-gdwarf-4_-Wall/timingleaks/crypto_encrypt/r5nd3pke0d/ref/work/./r5_parameter_sets.h:66: first defined here
try.c: /usr/bin/ld: libcrypto_encrypt_r5nd3pke0d.a(r5_core.o):.../supercop-data/hertz/amd64/try/c/clang_-march=native_-O3_-fwrapv_-Qunused-arguments_-fPIC_-fPIE_-gdwarf-4_-Wall/timingleaks/crypto_encrypt/r5nd3pke0d/ref/work/./r5_parameter_sets.h:63: multiple definition of `r5_parameter_sets'; libcrypto_encrypt_r5nd3pke0d.a(cca_encrypt.o):.../supercop-data/hertz/amd64/try/c/clang_-march=native_-O3_-fwrapv_-Qunused-arguments_-fPIC_-fPIE_-gdwarf-4_-Wall/timingleaks/crypto_encrypt/r5nd3pke0d/ref/work/./r5_parameter_sets.h:63: first defined here
try.c: /usr/bin/ld: libcrypto_encrypt_r5nd3pke0d.a(r5_core.o):.../supercop-data/hertz/amd64/try/c/clang_-march=native_-O3_-fwrapv_-Qunused-arguments_-fPIC_-fPIE_-gdwarf-4_-Wall/timingleaks/crypto_encrypt/r5nd3pke0d/ref/work/./r5_parameter_sets.h:66: multiple definition of `r5_parameter_set_names'; libcrypto_encrypt_r5nd3pke0d.a(cca_encrypt.o):.../supercop-data/hertz/amd64/try/c/clang_-march=native_-O3_-fwrapv_-Qunused-arguments_-fPIC_-fPIE_-gdwarf-4_-Wall/timingleaks/crypto_encrypt/r5nd3pke0d/ref/work/./r5_parameter_sets.h:66: first defined here
try.c: /usr/bin/ld: libcrypto_encrypt_r5nd3pke0d.a(a_fixed.o):.../supercop-data/hertz/amd64/try/c/clang_-march=native_-O3_-fwrapv_-Qunused-arguments_-fPIC_-fPIE_-gdwarf-4_-Wall/timingleaks/crypto_encrypt/r5nd3pke0d/ref/work/./r5_parameter_sets.h:63: multiple definition of `r5_parameter_sets'; libcrypto_encrypt_r5nd3pke0d.a(cca_encrypt.o):.../supercop-data/hertz/amd64/try/c/clang_-march=native_-O3_-fwrapv_-Qunused-arguments_-fPIC_-fPIE_-gdwarf-4_-Wall/timingleaks/crypto_encrypt/r5nd3pke0d/ref/work/./r5_parameter_sets.h:63: first defined here
try.c: /usr/bin/ld: libcrypto_encrypt_r5nd3pke0d.a(a_fixed.o):.../supercop-data/hertz/amd64/try/c/clang_-march=native_-O3_-fwrapv_-Qunused-arguments_-fPIC_-fPIE_-gdwarf-4_-Wall/timingleaks/crypto_encrypt/r5nd3pke0d/ref/work/./r5_parameter_sets.h:66: multiple definition of `r5_parameter_set_names'; libcrypto_encrypt_r5nd3pke0d.a(cca_encrypt.o):.../supercop-data/hertz/amd64/try/c/clang_-march=native_-O3_-fwrapv_-Qunused-arguments_-fPIC_-fPIE_-gdwarf-4_-Wall/timingleaks/crypto_encrypt/r5nd3pke0d/ref/work/./r5_parameter_sets.h:66: first defined here
try.c: /usr/bin/ld: libcrypto_encrypt_r5nd3pke0d.a(a_random.o):.../supercop-data/hertz/amd64/try/c/clang_-march=native_-O3_-fwrapv_-Qunused-arguments_-fPIC_-fPIE_-gdwarf-4_-Wall/timingleaks/crypto_encrypt/r5nd3pke0d/ref/work/./r5_parameter_sets.h:63: multiple definition of `r5_parameter_sets'; libcrypto_encrypt_r5nd3pke0d.a(cca_encrypt.o):.../supercop-data/hertz/amd64/try/c/clang_-march=native_-O3_-fwrapv_-Qunused-arguments_-fPIC_-fPIE_-gdwarf-4_-Wall/timingleaks/crypto_encrypt/r5nd3pke0d/ref/work/./r5_parameter_sets.h:63: first defined here
try.c: /usr/bin/ld: libcrypto_encrypt_r5nd3pke0d.a(a_random.o):.../supercop-data/hertz/amd64/try/c/clang_-march=native_-O3_-fwrapv_-Qunused-arguments_-fPIC_-fPIE_-gdwarf-4_-Wall/timingleaks/crypto_encrypt/r5nd3pke0d/ref/work/./r5_parameter_sets.h:66: multiple definition of `r5_parameter_set_names'; libcrypto_encrypt_r5nd3pke0d.a(cca_encrypt.o):.../supercop-data/hertz/amd64/try/c/clang_-march=native_-O3_-fwrapv_-Qunused-arguments_-fPIC_-fPIE_-gdwarf-4_-Wall/timingleaks/crypto_encrypt/r5nd3pke0d/ref/work/./r5_parameter_sets.h:66: first defined here
try.c: clang: error: linker command failed with exit code 1 (use -v to see invocation)

Number of similar (implementation,compiler) pairs: 1, namely:
ImplementationCompiler
T:refclang -march=native -O3 -fwrapv -Qunused-arguments -fPIC -fPIE -gdwarf-4 -Wall (Ubuntu_Clang_18.1.3_(1ubuntu1))

Compiler output


try.c: /usr/bin/ld: libcrypto_encrypt_r5nd3pke0d.a(parameters.o):.../supercop-data/hertz/amd64/try/c/clang_-march=native_-Os_-fwrapv_-Qunused-arguments_-fPIC_-fPIE_-gdwarf-4_-Wall/timingleaks/crypto_encrypt/r5nd3pke0d/ref/work/./r5_parameter_sets.h:63: multiple definition of `r5_parameter_sets'; libcrypto_encrypt_r5nd3pke0d.a(cca_encrypt.o):.../supercop-data/hertz/amd64/try/c/clang_-march=native_-Os_-fwrapv_-Qunused-arguments_-fPIC_-fPIE_-gdwarf-4_-Wall/timingleaks/crypto_encrypt/r5nd3pke0d/ref/work/./r5_parameter_sets.h:63: first defined here
try.c: /usr/bin/ld: libcrypto_encrypt_r5nd3pke0d.a(parameters.o):.../supercop-data/hertz/amd64/try/c/clang_-march=native_-Os_-fwrapv_-Qunused-arguments_-fPIC_-fPIE_-gdwarf-4_-Wall/timingleaks/crypto_encrypt/r5nd3pke0d/ref/work/./r5_parameter_sets.h:66: multiple definition of `r5_parameter_set_names'; libcrypto_encrypt_r5nd3pke0d.a(cca_encrypt.o):.../supercop-data/hertz/amd64/try/c/clang_-march=native_-Os_-fwrapv_-Qunused-arguments_-fPIC_-fPIE_-gdwarf-4_-Wall/timingleaks/crypto_encrypt/r5nd3pke0d/ref/work/./r5_parameter_sets.h:66: first defined here
try.c: /usr/bin/ld: libcrypto_encrypt_r5nd3pke0d.a(r5_cca_pke.o):.../supercop-data/hertz/amd64/try/c/clang_-march=native_-Os_-fwrapv_-Qunused-arguments_-fPIC_-fPIE_-gdwarf-4_-Wall/timingleaks/crypto_encrypt/r5nd3pke0d/ref/work/./r5_parameter_sets.h:63: multiple definition of `r5_parameter_sets'; libcrypto_encrypt_r5nd3pke0d.a(cca_encrypt.o):.../supercop-data/hertz/amd64/try/c/clang_-march=native_-Os_-fwrapv_-Qunused-arguments_-fPIC_-fPIE_-gdwarf-4_-Wall/timingleaks/crypto_encrypt/r5nd3pke0d/ref/work/./r5_parameter_sets.h:63: first defined here
try.c: /usr/bin/ld: libcrypto_encrypt_r5nd3pke0d.a(r5_cca_pke.o):.../supercop-data/hertz/amd64/try/c/clang_-march=native_-Os_-fwrapv_-Qunused-arguments_-fPIC_-fPIE_-gdwarf-4_-Wall/timingleaks/crypto_encrypt/r5nd3pke0d/ref/work/./r5_parameter_sets.h:66: multiple definition of `r5_parameter_set_names'; libcrypto_encrypt_r5nd3pke0d.a(cca_encrypt.o):.../supercop-data/hertz/amd64/try/c/clang_-march=native_-Os_-fwrapv_-Qunused-arguments_-fPIC_-fPIE_-gdwarf-4_-Wall/timingleaks/crypto_encrypt/r5nd3pke0d/ref/work/./r5_parameter_sets.h:66: first defined here
try.c: /usr/bin/ld: libcrypto_encrypt_r5nd3pke0d.a(r5_cca_kem.o):.../supercop-data/hertz/amd64/try/c/clang_-march=native_-Os_-fwrapv_-Qunused-arguments_-fPIC_-fPIE_-gdwarf-4_-Wall/timingleaks/crypto_encrypt/r5nd3pke0d/ref/work/./r5_parameter_sets.h:63: multiple definition of `r5_parameter_sets'; libcrypto_encrypt_r5nd3pke0d.a(cca_encrypt.o):.../supercop-data/hertz/amd64/try/c/clang_-march=native_-Os_-fwrapv_-Qunused-arguments_-fPIC_-fPIE_-gdwarf-4_-Wall/timingleaks/crypto_encrypt/r5nd3pke0d/ref/work/./r5_parameter_sets.h:63: first defined here
try.c: /usr/bin/ld: libcrypto_encrypt_r5nd3pke0d.a(r5_cca_kem.o):.../supercop-data/hertz/amd64/try/c/clang_-march=native_-Os_-fwrapv_-Qunused-arguments_-fPIC_-fPIE_-gdwarf-4_-Wall/timingleaks/crypto_encrypt/r5nd3pke0d/ref/work/./r5_parameter_sets.h:66: multiple definition of `r5_parameter_set_names'; libcrypto_encrypt_r5nd3pke0d.a(cca_encrypt.o):.../supercop-data/hertz/amd64/try/c/clang_-march=native_-Os_-fwrapv_-Qunused-arguments_-fPIC_-fPIE_-gdwarf-4_-Wall/timingleaks/crypto_encrypt/r5nd3pke0d/ref/work/./r5_parameter_sets.h:66: first defined here
try.c: /usr/bin/ld: libcrypto_encrypt_r5nd3pke0d.a(r5_cpa_pke.o):.../supercop-data/hertz/amd64/try/c/clang_-march=native_-Os_-fwrapv_-Qunused-arguments_-fPIC_-fPIE_-gdwarf-4_-Wall/timingleaks/crypto_encrypt/r5nd3pke0d/ref/work/./r5_parameter_sets.h:63: multiple definition of `r5_parameter_sets'; libcrypto_encrypt_r5nd3pke0d.a(cca_encrypt.o):.../supercop-data/hertz/amd64/try/c/clang_-march=native_-Os_-fwrapv_-Qunused-arguments_-fPIC_-fPIE_-gdwarf-4_-Wall/timingleaks/crypto_encrypt/r5nd3pke0d/ref/work/./r5_parameter_sets.h:63: first defined here
try.c: /usr/bin/ld: libcrypto_encrypt_r5nd3pke0d.a(r5_cpa_pke.o):.../supercop-data/hertz/amd64/try/c/clang_-march=native_-Os_-fwrapv_-Qunused-arguments_-fPIC_-fPIE_-gdwarf-4_-Wall/timingleaks/crypto_encrypt/r5nd3pke0d/ref/work/./r5_parameter_sets.h:66: multiple definition of `r5_parameter_set_names'; libcrypto_encrypt_r5nd3pke0d.a(cca_encrypt.o):.../supercop-data/hertz/amd64/try/c/clang_-march=native_-Os_-fwrapv_-Qunused-arguments_-fPIC_-fPIE_-gdwarf-4_-Wall/timingleaks/crypto_encrypt/r5nd3pke0d/ref/work/./r5_parameter_sets.h:66: first defined here
try.c: /usr/bin/ld: libcrypto_encrypt_r5nd3pke0d.a(r5_core.o):.../supercop-data/hertz/amd64/try/c/clang_-march=native_-Os_-fwrapv_-Qunused-arguments_-fPIC_-fPIE_-gdwarf-4_-Wall/timingleaks/crypto_encrypt/r5nd3pke0d/ref/work/./r5_parameter_sets.h:63: multiple definition of `r5_parameter_sets'; libcrypto_encrypt_r5nd3pke0d.a(cca_encrypt.o):.../supercop-data/hertz/amd64/try/c/clang_-march=native_-Os_-fwrapv_-Qunused-arguments_-fPIC_-fPIE_-gdwarf-4_-Wall/timingleaks/crypto_encrypt/r5nd3pke0d/ref/work/./r5_parameter_sets.h:63: first defined here
try.c: /usr/bin/ld: libcrypto_encrypt_r5nd3pke0d.a(r5_core.o):.../supercop-data/hertz/amd64/try/c/clang_-march=native_-Os_-fwrapv_-Qunused-arguments_-fPIC_-fPIE_-gdwarf-4_-Wall/timingleaks/crypto_encrypt/r5nd3pke0d/ref/work/./r5_parameter_sets.h:66: multiple definition of `r5_parameter_set_names'; libcrypto_encrypt_r5nd3pke0d.a(cca_encrypt.o):.../supercop-data/hertz/amd64/try/c/clang_-march=native_-Os_-fwrapv_-Qunused-arguments_-fPIC_-fPIE_-gdwarf-4_-Wall/timingleaks/crypto_encrypt/r5nd3pke0d/ref/work/./r5_parameter_sets.h:66: first defined here
try.c: /usr/bin/ld: libcrypto_encrypt_r5nd3pke0d.a(a_fixed.o):.../supercop-data/hertz/amd64/try/c/clang_-march=native_-Os_-fwrapv_-Qunused-arguments_-fPIC_-fPIE_-gdwarf-4_-Wall/timingleaks/crypto_encrypt/r5nd3pke0d/ref/work/./r5_parameter_sets.h:63: multiple definition of `r5_parameter_sets'; libcrypto_encrypt_r5nd3pke0d.a(cca_encrypt.o):.../supercop-data/hertz/amd64/try/c/clang_-march=native_-Os_-fwrapv_-Qunused-arguments_-fPIC_-fPIE_-gdwarf-4_-Wall/timingleaks/crypto_encrypt/r5nd3pke0d/ref/work/./r5_parameter_sets.h:63: first defined here
try.c: /usr/bin/ld: libcrypto_encrypt_r5nd3pke0d.a(a_fixed.o):.../supercop-data/hertz/amd64/try/c/clang_-march=native_-Os_-fwrapv_-Qunused-arguments_-fPIC_-fPIE_-gdwarf-4_-Wall/timingleaks/crypto_encrypt/r5nd3pke0d/ref/work/./r5_parameter_sets.h:66: multiple definition of `r5_parameter_set_names'; libcrypto_encrypt_r5nd3pke0d.a(cca_encrypt.o):.../supercop-data/hertz/amd64/try/c/clang_-march=native_-Os_-fwrapv_-Qunused-arguments_-fPIC_-fPIE_-gdwarf-4_-Wall/timingleaks/crypto_encrypt/r5nd3pke0d/ref/work/./r5_parameter_sets.h:66: first defined here
try.c: /usr/bin/ld: libcrypto_encrypt_r5nd3pke0d.a(a_random.o):.../supercop-data/hertz/amd64/try/c/clang_-march=native_-Os_-fwrapv_-Qunused-arguments_-fPIC_-fPIE_-gdwarf-4_-Wall/timingleaks/crypto_encrypt/r5nd3pke0d/ref/work/./r5_parameter_sets.h:63: multiple definition of `r5_parameter_sets'; libcrypto_encrypt_r5nd3pke0d.a(cca_encrypt.o):.../supercop-data/hertz/amd64/try/c/clang_-march=native_-Os_-fwrapv_-Qunused-arguments_-fPIC_-fPIE_-gdwarf-4_-Wall/timingleaks/crypto_encrypt/r5nd3pke0d/ref/work/./r5_parameter_sets.h:63: first defined here
try.c: /usr/bin/ld: libcrypto_encrypt_r5nd3pke0d.a(a_random.o):.../supercop-data/hertz/amd64/try/c/clang_-march=native_-Os_-fwrapv_-Qunused-arguments_-fPIC_-fPIE_-gdwarf-4_-Wall/timingleaks/crypto_encrypt/r5nd3pke0d/ref/work/./r5_parameter_sets.h:66: multiple definition of `r5_parameter_set_names'; libcrypto_encrypt_r5nd3pke0d.a(cca_encrypt.o):.../supercop-data/hertz/amd64/try/c/clang_-march=native_-Os_-fwrapv_-Qunused-arguments_-fPIC_-fPIE_-gdwarf-4_-Wall/timingleaks/crypto_encrypt/r5nd3pke0d/ref/work/./r5_parameter_sets.h:66: first defined here
try.c: clang: error: linker command failed with exit code 1 (use -v to see invocation)

Number of similar (implementation,compiler) pairs: 1, namely:
ImplementationCompiler
T:refclang -march=native -Os -fwrapv -Qunused-arguments -fPIC -fPIE -gdwarf-4 -Wall (Ubuntu_Clang_18.1.3_(1ubuntu1))

Compiler output


try.c: /usr/bin/ld: libcrypto_encrypt_r5nd3pke0d.a(parameters.o):.../supercop-data/hertz/amd64/try/c/gcc_-march=native_-mtune=native_-O2_-fwrapv_-fPIC_-fPIE_-gdwarf-4_-Wall/timingleaks/crypto_encrypt/r5nd3pke0d/ref/work/r5_parameter_sets.h:66: multiple definition of `r5_parameter_set_names'; libcrypto_encrypt_r5nd3pke0d.a(cca_encrypt.o):.../supercop-data/hertz/amd64/try/c/gcc_-march=native_-mtune=native_-O2_-fwrapv_-fPIC_-fPIE_-gdwarf-4_-Wall/timingleaks/crypto_encrypt/r5nd3pke0d/ref/work/r5_parameter_sets.h:66: first defined here
try.c: /usr/bin/ld: libcrypto_encrypt_r5nd3pke0d.a(parameters.o):.../supercop-data/hertz/amd64/try/c/gcc_-march=native_-mtune=native_-O2_-fwrapv_-fPIC_-fPIE_-gdwarf-4_-Wall/timingleaks/crypto_encrypt/r5nd3pke0d/ref/work/r5_parameter_sets.h:63: multiple definition of `r5_parameter_sets'; libcrypto_encrypt_r5nd3pke0d.a(cca_encrypt.o):.../supercop-data/hertz/amd64/try/c/gcc_-march=native_-mtune=native_-O2_-fwrapv_-fPIC_-fPIE_-gdwarf-4_-Wall/timingleaks/crypto_encrypt/r5nd3pke0d/ref/work/r5_parameter_sets.h:63: first defined here
try.c: /usr/bin/ld: libcrypto_encrypt_r5nd3pke0d.a(r5_cca_pke.o):.../supercop-data/hertz/amd64/try/c/gcc_-march=native_-mtune=native_-O2_-fwrapv_-fPIC_-fPIE_-gdwarf-4_-Wall/timingleaks/crypto_encrypt/r5nd3pke0d/ref/work/r5_parameter_sets.h:66: multiple definition of `r5_parameter_set_names'; libcrypto_encrypt_r5nd3pke0d.a(cca_encrypt.o):.../supercop-data/hertz/amd64/try/c/gcc_-march=native_-mtune=native_-O2_-fwrapv_-fPIC_-fPIE_-gdwarf-4_-Wall/timingleaks/crypto_encrypt/r5nd3pke0d/ref/work/r5_parameter_sets.h:66: first defined here
try.c: /usr/bin/ld: libcrypto_encrypt_r5nd3pke0d.a(r5_cca_pke.o):.../supercop-data/hertz/amd64/try/c/gcc_-march=native_-mtune=native_-O2_-fwrapv_-fPIC_-fPIE_-gdwarf-4_-Wall/timingleaks/crypto_encrypt/r5nd3pke0d/ref/work/r5_parameter_sets.h:63: multiple definition of `r5_parameter_sets'; libcrypto_encrypt_r5nd3pke0d.a(cca_encrypt.o):.../supercop-data/hertz/amd64/try/c/gcc_-march=native_-mtune=native_-O2_-fwrapv_-fPIC_-fPIE_-gdwarf-4_-Wall/timingleaks/crypto_encrypt/r5nd3pke0d/ref/work/r5_parameter_sets.h:63: first defined here
try.c: /usr/bin/ld: libcrypto_encrypt_r5nd3pke0d.a(r5_cca_kem.o):.../supercop-data/hertz/amd64/try/c/gcc_-march=native_-mtune=native_-O2_-fwrapv_-fPIC_-fPIE_-gdwarf-4_-Wall/timingleaks/crypto_encrypt/r5nd3pke0d/ref/work/r5_parameter_sets.h:66: multiple definition of `r5_parameter_set_names'; libcrypto_encrypt_r5nd3pke0d.a(cca_encrypt.o):.../supercop-data/hertz/amd64/try/c/gcc_-march=native_-mtune=native_-O2_-fwrapv_-fPIC_-fPIE_-gdwarf-4_-Wall/timingleaks/crypto_encrypt/r5nd3pke0d/ref/work/r5_parameter_sets.h:66: first defined here
try.c: /usr/bin/ld: libcrypto_encrypt_r5nd3pke0d.a(r5_cca_kem.o):.../supercop-data/hertz/amd64/try/c/gcc_-march=native_-mtune=native_-O2_-fwrapv_-fPIC_-fPIE_-gdwarf-4_-Wall/timingleaks/crypto_encrypt/r5nd3pke0d/ref/work/r5_parameter_sets.h:63: multiple definition of `r5_parameter_sets'; libcrypto_encrypt_r5nd3pke0d.a(cca_encrypt.o):.../supercop-data/hertz/amd64/try/c/gcc_-march=native_-mtune=native_-O2_-fwrapv_-fPIC_-fPIE_-gdwarf-4_-Wall/timingleaks/crypto_encrypt/r5nd3pke0d/ref/work/r5_parameter_sets.h:63: first defined here
try.c: /usr/bin/ld: libcrypto_encrypt_r5nd3pke0d.a(r5_cpa_pke.o):.../supercop-data/hertz/amd64/try/c/gcc_-march=native_-mtune=native_-O2_-fwrapv_-fPIC_-fPIE_-gdwarf-4_-Wall/timingleaks/crypto_encrypt/r5nd3pke0d/ref/work/r5_parameter_sets.h:66: multiple definition of `r5_parameter_set_names'; libcrypto_encrypt_r5nd3pke0d.a(cca_encrypt.o):.../supercop-data/hertz/amd64/try/c/gcc_-march=native_-mtune=native_-O2_-fwrapv_-fPIC_-fPIE_-gdwarf-4_-Wall/timingleaks/crypto_encrypt/r5nd3pke0d/ref/work/r5_parameter_sets.h:66: first defined here
try.c: /usr/bin/ld: libcrypto_encrypt_r5nd3pke0d.a(r5_cpa_pke.o):.../supercop-data/hertz/amd64/try/c/gcc_-march=native_-mtune=native_-O2_-fwrapv_-fPIC_-fPIE_-gdwarf-4_-Wall/timingleaks/crypto_encrypt/r5nd3pke0d/ref/work/r5_parameter_sets.h:63: multiple definition of `r5_parameter_sets'; libcrypto_encrypt_r5nd3pke0d.a(cca_encrypt.o):.../supercop-data/hertz/amd64/try/c/gcc_-march=native_-mtune=native_-O2_-fwrapv_-fPIC_-fPIE_-gdwarf-4_-Wall/timingleaks/crypto_encrypt/r5nd3pke0d/ref/work/r5_parameter_sets.h:63: first defined here
try.c: /usr/bin/ld: libcrypto_encrypt_r5nd3pke0d.a(r5_core.o):.../supercop-data/hertz/amd64/try/c/gcc_-march=native_-mtune=native_-O2_-fwrapv_-fPIC_-fPIE_-gdwarf-4_-Wall/timingleaks/crypto_encrypt/r5nd3pke0d/ref/work/r5_parameter_sets.h:66: multiple definition of `r5_parameter_set_names'; libcrypto_encrypt_r5nd3pke0d.a(cca_encrypt.o):.../supercop-data/hertz/amd64/try/c/gcc_-march=native_-mtune=native_-O2_-fwrapv_-fPIC_-fPIE_-gdwarf-4_-Wall/timingleaks/crypto_encrypt/r5nd3pke0d/ref/work/r5_parameter_sets.h:66: first defined here
try.c: /usr/bin/ld: libcrypto_encrypt_r5nd3pke0d.a(r5_core.o):.../supercop-data/hertz/amd64/try/c/gcc_-march=native_-mtune=native_-O2_-fwrapv_-fPIC_-fPIE_-gdwarf-4_-Wall/timingleaks/crypto_encrypt/r5nd3pke0d/ref/work/r5_parameter_sets.h:63: multiple definition of `r5_parameter_sets'; libcrypto_encrypt_r5nd3pke0d.a(cca_encrypt.o):.../supercop-data/hertz/amd64/try/c/gcc_-march=native_-mtune=native_-O2_-fwrapv_-fPIC_-fPIE_-gdwarf-4_-Wall/timingleaks/crypto_encrypt/r5nd3pke0d/ref/work/r5_parameter_sets.h:63: first defined here
try.c: /usr/bin/ld: libcrypto_encrypt_r5nd3pke0d.a(a_fixed.o):.../supercop-data/hertz/amd64/try/c/gcc_-march=native_-mtune=native_-O2_-fwrapv_-fPIC_-fPIE_-gdwarf-4_-Wall/timingleaks/crypto_encrypt/r5nd3pke0d/ref/work/r5_parameter_sets.h:66: multiple definition of `r5_parameter_set_names'; libcrypto_encrypt_r5nd3pke0d.a(cca_encrypt.o):.../supercop-data/hertz/amd64/try/c/gcc_-march=native_-mtune=native_-O2_-fwrapv_-fPIC_-fPIE_-gdwarf-4_-Wall/timingleaks/crypto_encrypt/r5nd3pke0d/ref/work/r5_parameter_sets.h:66: first defined here
try.c: /usr/bin/ld: libcrypto_encrypt_r5nd3pke0d.a(a_fixed.o):.../supercop-data/hertz/amd64/try/c/gcc_-march=native_-mtune=native_-O2_-fwrapv_-fPIC_-fPIE_-gdwarf-4_-Wall/timingleaks/crypto_encrypt/r5nd3pke0d/ref/work/r5_parameter_sets.h:63: multiple definition of `r5_parameter_sets'; libcrypto_encrypt_r5nd3pke0d.a(cca_encrypt.o):.../supercop-data/hertz/amd64/try/c/gcc_-march=native_-mtune=native_-O2_-fwrapv_-fPIC_-fPIE_-gdwarf-4_-Wall/timingleaks/crypto_encrypt/r5nd3pke0d/ref/work/r5_parameter_sets.h:63: first defined here
try.c: /usr/bin/ld: libcrypto_encrypt_r5nd3pke0d.a(a_random.o):.../supercop-data/hertz/amd64/try/c/gcc_-march=native_-mtune=native_-O2_-fwrapv_-fPIC_-fPIE_-gdwarf-4_-Wall/timingleaks/crypto_encrypt/r5nd3pke0d/ref/work/r5_parameter_sets.h:66: multiple definition of `r5_parameter_set_names'; libcrypto_encrypt_r5nd3pke0d.a(cca_encrypt.o):.../supercop-data/hertz/amd64/try/c/gcc_-march=native_-mtune=native_-O2_-fwrapv_-fPIC_-fPIE_-gdwarf-4_-Wall/timingleaks/crypto_encrypt/r5nd3pke0d/ref/work/r5_parameter_sets.h:66: first defined here
try.c: /usr/bin/ld: libcrypto_encrypt_r5nd3pke0d.a(a_random.o):.../supercop-data/hertz/amd64/try/c/gcc_-march=native_-mtune=native_-O2_-fwrapv_-fPIC_-fPIE_-gdwarf-4_-Wall/timingleaks/crypto_encrypt/r5nd3pke0d/ref/work/r5_parameter_sets.h:63: multiple definition of `r5_parameter_sets'; libcrypto_encrypt_r5nd3pke0d.a(cca_encrypt.o):.../supercop-data/hertz/amd64/try/c/gcc_-march=native_-mtune=native_-O2_-fwrapv_-fPIC_-fPIE_-gdwarf-4_-Wall/timingleaks/crypto_encrypt/r5nd3pke0d/ref/work/r5_parameter_sets.h:63: first defined here
try.c: collect2: error: ld returned 1 exit status

Number of similar (implementation,compiler) pairs: 1, namely:
ImplementationCompiler
T:refgcc -march=native -mtune=native -O2 -fwrapv -fPIC -fPIE -gdwarf-4 -Wall (13.2.0)

Compiler output


try.c: /usr/bin/ld: libcrypto_encrypt_r5nd3pke0d.a(parameters.o):.../supercop-data/hertz/amd64/try/c/gcc_-march=native_-mtune=native_-O3_-fwrapv_-fPIC_-fPIE_-gdwarf-4_-Wall/timingleaks/crypto_encrypt/r5nd3pke0d/ref/work/r5_parameter_sets.h:66: multiple definition of `r5_parameter_set_names'; libcrypto_encrypt_r5nd3pke0d.a(cca_encrypt.o):.../supercop-data/hertz/amd64/try/c/gcc_-march=native_-mtune=native_-O3_-fwrapv_-fPIC_-fPIE_-gdwarf-4_-Wall/timingleaks/crypto_encrypt/r5nd3pke0d/ref/work/r5_parameter_sets.h:66: first defined here
try.c: /usr/bin/ld: libcrypto_encrypt_r5nd3pke0d.a(parameters.o):.../supercop-data/hertz/amd64/try/c/gcc_-march=native_-mtune=native_-O3_-fwrapv_-fPIC_-fPIE_-gdwarf-4_-Wall/timingleaks/crypto_encrypt/r5nd3pke0d/ref/work/r5_parameter_sets.h:63: multiple definition of `r5_parameter_sets'; libcrypto_encrypt_r5nd3pke0d.a(cca_encrypt.o):.../supercop-data/hertz/amd64/try/c/gcc_-march=native_-mtune=native_-O3_-fwrapv_-fPIC_-fPIE_-gdwarf-4_-Wall/timingleaks/crypto_encrypt/r5nd3pke0d/ref/work/r5_parameter_sets.h:63: first defined here
try.c: /usr/bin/ld: libcrypto_encrypt_r5nd3pke0d.a(r5_cca_pke.o):.../supercop-data/hertz/amd64/try/c/gcc_-march=native_-mtune=native_-O3_-fwrapv_-fPIC_-fPIE_-gdwarf-4_-Wall/timingleaks/crypto_encrypt/r5nd3pke0d/ref/work/r5_parameter_sets.h:66: multiple definition of `r5_parameter_set_names'; libcrypto_encrypt_r5nd3pke0d.a(cca_encrypt.o):.../supercop-data/hertz/amd64/try/c/gcc_-march=native_-mtune=native_-O3_-fwrapv_-fPIC_-fPIE_-gdwarf-4_-Wall/timingleaks/crypto_encrypt/r5nd3pke0d/ref/work/r5_parameter_sets.h:66: first defined here
try.c: /usr/bin/ld: libcrypto_encrypt_r5nd3pke0d.a(r5_cca_pke.o):.../supercop-data/hertz/amd64/try/c/gcc_-march=native_-mtune=native_-O3_-fwrapv_-fPIC_-fPIE_-gdwarf-4_-Wall/timingleaks/crypto_encrypt/r5nd3pke0d/ref/work/r5_parameter_sets.h:63: multiple definition of `r5_parameter_sets'; libcrypto_encrypt_r5nd3pke0d.a(cca_encrypt.o):.../supercop-data/hertz/amd64/try/c/gcc_-march=native_-mtune=native_-O3_-fwrapv_-fPIC_-fPIE_-gdwarf-4_-Wall/timingleaks/crypto_encrypt/r5nd3pke0d/ref/work/r5_parameter_sets.h:63: first defined here
try.c: /usr/bin/ld: libcrypto_encrypt_r5nd3pke0d.a(r5_cca_kem.o):.../supercop-data/hertz/amd64/try/c/gcc_-march=native_-mtune=native_-O3_-fwrapv_-fPIC_-fPIE_-gdwarf-4_-Wall/timingleaks/crypto_encrypt/r5nd3pke0d/ref/work/r5_parameter_sets.h:66: multiple definition of `r5_parameter_set_names'; libcrypto_encrypt_r5nd3pke0d.a(cca_encrypt.o):.../supercop-data/hertz/amd64/try/c/gcc_-march=native_-mtune=native_-O3_-fwrapv_-fPIC_-fPIE_-gdwarf-4_-Wall/timingleaks/crypto_encrypt/r5nd3pke0d/ref/work/r5_parameter_sets.h:66: first defined here
try.c: /usr/bin/ld: libcrypto_encrypt_r5nd3pke0d.a(r5_cca_kem.o):.../supercop-data/hertz/amd64/try/c/gcc_-march=native_-mtune=native_-O3_-fwrapv_-fPIC_-fPIE_-gdwarf-4_-Wall/timingleaks/crypto_encrypt/r5nd3pke0d/ref/work/r5_parameter_sets.h:63: multiple definition of `r5_parameter_sets'; libcrypto_encrypt_r5nd3pke0d.a(cca_encrypt.o):.../supercop-data/hertz/amd64/try/c/gcc_-march=native_-mtune=native_-O3_-fwrapv_-fPIC_-fPIE_-gdwarf-4_-Wall/timingleaks/crypto_encrypt/r5nd3pke0d/ref/work/r5_parameter_sets.h:63: first defined here
try.c: /usr/bin/ld: libcrypto_encrypt_r5nd3pke0d.a(r5_cpa_pke.o):.../supercop-data/hertz/amd64/try/c/gcc_-march=native_-mtune=native_-O3_-fwrapv_-fPIC_-fPIE_-gdwarf-4_-Wall/timingleaks/crypto_encrypt/r5nd3pke0d/ref/work/r5_parameter_sets.h:66: multiple definition of `r5_parameter_set_names'; libcrypto_encrypt_r5nd3pke0d.a(cca_encrypt.o):.../supercop-data/hertz/amd64/try/c/gcc_-march=native_-mtune=native_-O3_-fwrapv_-fPIC_-fPIE_-gdwarf-4_-Wall/timingleaks/crypto_encrypt/r5nd3pke0d/ref/work/r5_parameter_sets.h:66: first defined here
try.c: /usr/bin/ld: libcrypto_encrypt_r5nd3pke0d.a(r5_cpa_pke.o):.../supercop-data/hertz/amd64/try/c/gcc_-march=native_-mtune=native_-O3_-fwrapv_-fPIC_-fPIE_-gdwarf-4_-Wall/timingleaks/crypto_encrypt/r5nd3pke0d/ref/work/r5_parameter_sets.h:63: multiple definition of `r5_parameter_sets'; libcrypto_encrypt_r5nd3pke0d.a(cca_encrypt.o):.../supercop-data/hertz/amd64/try/c/gcc_-march=native_-mtune=native_-O3_-fwrapv_-fPIC_-fPIE_-gdwarf-4_-Wall/timingleaks/crypto_encrypt/r5nd3pke0d/ref/work/r5_parameter_sets.h:63: first defined here
try.c: /usr/bin/ld: libcrypto_encrypt_r5nd3pke0d.a(r5_core.o):.../supercop-data/hertz/amd64/try/c/gcc_-march=native_-mtune=native_-O3_-fwrapv_-fPIC_-fPIE_-gdwarf-4_-Wall/timingleaks/crypto_encrypt/r5nd3pke0d/ref/work/r5_parameter_sets.h:66: multiple definition of `r5_parameter_set_names'; libcrypto_encrypt_r5nd3pke0d.a(cca_encrypt.o):.../supercop-data/hertz/amd64/try/c/gcc_-march=native_-mtune=native_-O3_-fwrapv_-fPIC_-fPIE_-gdwarf-4_-Wall/timingleaks/crypto_encrypt/r5nd3pke0d/ref/work/r5_parameter_sets.h:66: first defined here
try.c: /usr/bin/ld: libcrypto_encrypt_r5nd3pke0d.a(r5_core.o):.../supercop-data/hertz/amd64/try/c/gcc_-march=native_-mtune=native_-O3_-fwrapv_-fPIC_-fPIE_-gdwarf-4_-Wall/timingleaks/crypto_encrypt/r5nd3pke0d/ref/work/r5_parameter_sets.h:63: multiple definition of `r5_parameter_sets'; libcrypto_encrypt_r5nd3pke0d.a(cca_encrypt.o):.../supercop-data/hertz/amd64/try/c/gcc_-march=native_-mtune=native_-O3_-fwrapv_-fPIC_-fPIE_-gdwarf-4_-Wall/timingleaks/crypto_encrypt/r5nd3pke0d/ref/work/r5_parameter_sets.h:63: first defined here
try.c: /usr/bin/ld: libcrypto_encrypt_r5nd3pke0d.a(a_fixed.o):.../supercop-data/hertz/amd64/try/c/gcc_-march=native_-mtune=native_-O3_-fwrapv_-fPIC_-fPIE_-gdwarf-4_-Wall/timingleaks/crypto_encrypt/r5nd3pke0d/ref/work/r5_parameter_sets.h:66: multiple definition of `r5_parameter_set_names'; libcrypto_encrypt_r5nd3pke0d.a(cca_encrypt.o):.../supercop-data/hertz/amd64/try/c/gcc_-march=native_-mtune=native_-O3_-fwrapv_-fPIC_-fPIE_-gdwarf-4_-Wall/timingleaks/crypto_encrypt/r5nd3pke0d/ref/work/r5_parameter_sets.h:66: first defined here
try.c: /usr/bin/ld: libcrypto_encrypt_r5nd3pke0d.a(a_fixed.o):.../supercop-data/hertz/amd64/try/c/gcc_-march=native_-mtune=native_-O3_-fwrapv_-fPIC_-fPIE_-gdwarf-4_-Wall/timingleaks/crypto_encrypt/r5nd3pke0d/ref/work/r5_parameter_sets.h:63: multiple definition of `r5_parameter_sets'; libcrypto_encrypt_r5nd3pke0d.a(cca_encrypt.o):.../supercop-data/hertz/amd64/try/c/gcc_-march=native_-mtune=native_-O3_-fwrapv_-fPIC_-fPIE_-gdwarf-4_-Wall/timingleaks/crypto_encrypt/r5nd3pke0d/ref/work/r5_parameter_sets.h:63: first defined here
try.c: /usr/bin/ld: libcrypto_encrypt_r5nd3pke0d.a(a_random.o):.../supercop-data/hertz/amd64/try/c/gcc_-march=native_-mtune=native_-O3_-fwrapv_-fPIC_-fPIE_-gdwarf-4_-Wall/timingleaks/crypto_encrypt/r5nd3pke0d/ref/work/r5_parameter_sets.h:66: multiple definition of `r5_parameter_set_names'; libcrypto_encrypt_r5nd3pke0d.a(cca_encrypt.o):.../supercop-data/hertz/amd64/try/c/gcc_-march=native_-mtune=native_-O3_-fwrapv_-fPIC_-fPIE_-gdwarf-4_-Wall/timingleaks/crypto_encrypt/r5nd3pke0d/ref/work/r5_parameter_sets.h:66: first defined here
try.c: /usr/bin/ld: libcrypto_encrypt_r5nd3pke0d.a(a_random.o):.../supercop-data/hertz/amd64/try/c/gcc_-march=native_-mtune=native_-O3_-fwrapv_-fPIC_-fPIE_-gdwarf-4_-Wall/timingleaks/crypto_encrypt/r5nd3pke0d/ref/work/r5_parameter_sets.h:63: multiple definition of `r5_parameter_sets'; libcrypto_encrypt_r5nd3pke0d.a(cca_encrypt.o):.../supercop-data/hertz/amd64/try/c/gcc_-march=native_-mtune=native_-O3_-fwrapv_-fPIC_-fPIE_-gdwarf-4_-Wall/timingleaks/crypto_encrypt/r5nd3pke0d/ref/work/r5_parameter_sets.h:63: first defined here
try.c: collect2: error: ld returned 1 exit status

Number of similar (implementation,compiler) pairs: 1, namely:
ImplementationCompiler
T:refgcc -march=native -mtune=native -O3 -fwrapv -fPIC -fPIE -gdwarf-4 -Wall (13.2.0)

Compiler output


try.c: /usr/bin/ld: libcrypto_encrypt_r5nd3pke0d.a(parameters.o):.../supercop-data/hertz/amd64/try/c/gcc_-march=native_-mtune=native_-Os_-fwrapv_-fPIC_-fPIE_-gdwarf-4_-Wall/timingleaks/crypto_encrypt/r5nd3pke0d/ref/work/r5_parameter_sets.h:66: multiple definition of `r5_parameter_set_names'; libcrypto_encrypt_r5nd3pke0d.a(cca_encrypt.o):.../supercop-data/hertz/amd64/try/c/gcc_-march=native_-mtune=native_-Os_-fwrapv_-fPIC_-fPIE_-gdwarf-4_-Wall/timingleaks/crypto_encrypt/r5nd3pke0d/ref/work/r5_parameter_sets.h:66: first defined here
try.c: /usr/bin/ld: libcrypto_encrypt_r5nd3pke0d.a(parameters.o):.../supercop-data/hertz/amd64/try/c/gcc_-march=native_-mtune=native_-Os_-fwrapv_-fPIC_-fPIE_-gdwarf-4_-Wall/timingleaks/crypto_encrypt/r5nd3pke0d/ref/work/r5_parameter_sets.h:63: multiple definition of `r5_parameter_sets'; libcrypto_encrypt_r5nd3pke0d.a(cca_encrypt.o):.../supercop-data/hertz/amd64/try/c/gcc_-march=native_-mtune=native_-Os_-fwrapv_-fPIC_-fPIE_-gdwarf-4_-Wall/timingleaks/crypto_encrypt/r5nd3pke0d/ref/work/r5_parameter_sets.h:63: first defined here
try.c: /usr/bin/ld: libcrypto_encrypt_r5nd3pke0d.a(r5_cca_pke.o):.../supercop-data/hertz/amd64/try/c/gcc_-march=native_-mtune=native_-Os_-fwrapv_-fPIC_-fPIE_-gdwarf-4_-Wall/timingleaks/crypto_encrypt/r5nd3pke0d/ref/work/r5_parameter_sets.h:66: multiple definition of `r5_parameter_set_names'; libcrypto_encrypt_r5nd3pke0d.a(cca_encrypt.o):.../supercop-data/hertz/amd64/try/c/gcc_-march=native_-mtune=native_-Os_-fwrapv_-fPIC_-fPIE_-gdwarf-4_-Wall/timingleaks/crypto_encrypt/r5nd3pke0d/ref/work/r5_parameter_sets.h:66: first defined here
try.c: /usr/bin/ld: libcrypto_encrypt_r5nd3pke0d.a(r5_cca_pke.o):.../supercop-data/hertz/amd64/try/c/gcc_-march=native_-mtune=native_-Os_-fwrapv_-fPIC_-fPIE_-gdwarf-4_-Wall/timingleaks/crypto_encrypt/r5nd3pke0d/ref/work/r5_parameter_sets.h:63: multiple definition of `r5_parameter_sets'; libcrypto_encrypt_r5nd3pke0d.a(cca_encrypt.o):.../supercop-data/hertz/amd64/try/c/gcc_-march=native_-mtune=native_-Os_-fwrapv_-fPIC_-fPIE_-gdwarf-4_-Wall/timingleaks/crypto_encrypt/r5nd3pke0d/ref/work/r5_parameter_sets.h:63: first defined here
try.c: /usr/bin/ld: libcrypto_encrypt_r5nd3pke0d.a(r5_cca_kem.o):.../supercop-data/hertz/amd64/try/c/gcc_-march=native_-mtune=native_-Os_-fwrapv_-fPIC_-fPIE_-gdwarf-4_-Wall/timingleaks/crypto_encrypt/r5nd3pke0d/ref/work/r5_parameter_sets.h:66: multiple definition of `r5_parameter_set_names'; libcrypto_encrypt_r5nd3pke0d.a(cca_encrypt.o):.../supercop-data/hertz/amd64/try/c/gcc_-march=native_-mtune=native_-Os_-fwrapv_-fPIC_-fPIE_-gdwarf-4_-Wall/timingleaks/crypto_encrypt/r5nd3pke0d/ref/work/r5_parameter_sets.h:66: first defined here
try.c: /usr/bin/ld: libcrypto_encrypt_r5nd3pke0d.a(r5_cca_kem.o):.../supercop-data/hertz/amd64/try/c/gcc_-march=native_-mtune=native_-Os_-fwrapv_-fPIC_-fPIE_-gdwarf-4_-Wall/timingleaks/crypto_encrypt/r5nd3pke0d/ref/work/r5_parameter_sets.h:63: multiple definition of `r5_parameter_sets'; libcrypto_encrypt_r5nd3pke0d.a(cca_encrypt.o):.../supercop-data/hertz/amd64/try/c/gcc_-march=native_-mtune=native_-Os_-fwrapv_-fPIC_-fPIE_-gdwarf-4_-Wall/timingleaks/crypto_encrypt/r5nd3pke0d/ref/work/r5_parameter_sets.h:63: first defined here
try.c: /usr/bin/ld: libcrypto_encrypt_r5nd3pke0d.a(r5_cpa_pke.o):.../supercop-data/hertz/amd64/try/c/gcc_-march=native_-mtune=native_-Os_-fwrapv_-fPIC_-fPIE_-gdwarf-4_-Wall/timingleaks/crypto_encrypt/r5nd3pke0d/ref/work/r5_parameter_sets.h:66: multiple definition of `r5_parameter_set_names'; libcrypto_encrypt_r5nd3pke0d.a(cca_encrypt.o):.../supercop-data/hertz/amd64/try/c/gcc_-march=native_-mtune=native_-Os_-fwrapv_-fPIC_-fPIE_-gdwarf-4_-Wall/timingleaks/crypto_encrypt/r5nd3pke0d/ref/work/r5_parameter_sets.h:66: first defined here
try.c: /usr/bin/ld: libcrypto_encrypt_r5nd3pke0d.a(r5_cpa_pke.o):.../supercop-data/hertz/amd64/try/c/gcc_-march=native_-mtune=native_-Os_-fwrapv_-fPIC_-fPIE_-gdwarf-4_-Wall/timingleaks/crypto_encrypt/r5nd3pke0d/ref/work/r5_parameter_sets.h:63: multiple definition of `r5_parameter_sets'; libcrypto_encrypt_r5nd3pke0d.a(cca_encrypt.o):.../supercop-data/hertz/amd64/try/c/gcc_-march=native_-mtune=native_-Os_-fwrapv_-fPIC_-fPIE_-gdwarf-4_-Wall/timingleaks/crypto_encrypt/r5nd3pke0d/ref/work/r5_parameter_sets.h:63: first defined here
try.c: /usr/bin/ld: libcrypto_encrypt_r5nd3pke0d.a(r5_core.o):.../supercop-data/hertz/amd64/try/c/gcc_-march=native_-mtune=native_-Os_-fwrapv_-fPIC_-fPIE_-gdwarf-4_-Wall/timingleaks/crypto_encrypt/r5nd3pke0d/ref/work/r5_parameter_sets.h:66: multiple definition of `r5_parameter_set_names'; libcrypto_encrypt_r5nd3pke0d.a(cca_encrypt.o):.../supercop-data/hertz/amd64/try/c/gcc_-march=native_-mtune=native_-Os_-fwrapv_-fPIC_-fPIE_-gdwarf-4_-Wall/timingleaks/crypto_encrypt/r5nd3pke0d/ref/work/r5_parameter_sets.h:66: first defined here
try.c: /usr/bin/ld: libcrypto_encrypt_r5nd3pke0d.a(r5_core.o):.../supercop-data/hertz/amd64/try/c/gcc_-march=native_-mtune=native_-Os_-fwrapv_-fPIC_-fPIE_-gdwarf-4_-Wall/timingleaks/crypto_encrypt/r5nd3pke0d/ref/work/r5_parameter_sets.h:63: multiple definition of `r5_parameter_sets'; libcrypto_encrypt_r5nd3pke0d.a(cca_encrypt.o):.../supercop-data/hertz/amd64/try/c/gcc_-march=native_-mtune=native_-Os_-fwrapv_-fPIC_-fPIE_-gdwarf-4_-Wall/timingleaks/crypto_encrypt/r5nd3pke0d/ref/work/r5_parameter_sets.h:63: first defined here
try.c: /usr/bin/ld: libcrypto_encrypt_r5nd3pke0d.a(a_fixed.o):.../supercop-data/hertz/amd64/try/c/gcc_-march=native_-mtune=native_-Os_-fwrapv_-fPIC_-fPIE_-gdwarf-4_-Wall/timingleaks/crypto_encrypt/r5nd3pke0d/ref/work/r5_parameter_sets.h:66: multiple definition of `r5_parameter_set_names'; libcrypto_encrypt_r5nd3pke0d.a(cca_encrypt.o):.../supercop-data/hertz/amd64/try/c/gcc_-march=native_-mtune=native_-Os_-fwrapv_-fPIC_-fPIE_-gdwarf-4_-Wall/timingleaks/crypto_encrypt/r5nd3pke0d/ref/work/r5_parameter_sets.h:66: first defined here
try.c: /usr/bin/ld: libcrypto_encrypt_r5nd3pke0d.a(a_fixed.o):.../supercop-data/hertz/amd64/try/c/gcc_-march=native_-mtune=native_-Os_-fwrapv_-fPIC_-fPIE_-gdwarf-4_-Wall/timingleaks/crypto_encrypt/r5nd3pke0d/ref/work/r5_parameter_sets.h:63: multiple definition of `r5_parameter_sets'; libcrypto_encrypt_r5nd3pke0d.a(cca_encrypt.o):.../supercop-data/hertz/amd64/try/c/gcc_-march=native_-mtune=native_-Os_-fwrapv_-fPIC_-fPIE_-gdwarf-4_-Wall/timingleaks/crypto_encrypt/r5nd3pke0d/ref/work/r5_parameter_sets.h:63: first defined here
try.c: /usr/bin/ld: libcrypto_encrypt_r5nd3pke0d.a(a_random.o):.../supercop-data/hertz/amd64/try/c/gcc_-march=native_-mtune=native_-Os_-fwrapv_-fPIC_-fPIE_-gdwarf-4_-Wall/timingleaks/crypto_encrypt/r5nd3pke0d/ref/work/r5_parameter_sets.h:66: multiple definition of `r5_parameter_set_names'; libcrypto_encrypt_r5nd3pke0d.a(cca_encrypt.o):.../supercop-data/hertz/amd64/try/c/gcc_-march=native_-mtune=native_-Os_-fwrapv_-fPIC_-fPIE_-gdwarf-4_-Wall/timingleaks/crypto_encrypt/r5nd3pke0d/ref/work/r5_parameter_sets.h:66: first defined here
try.c: /usr/bin/ld: libcrypto_encrypt_r5nd3pke0d.a(a_random.o):.../supercop-data/hertz/amd64/try/c/gcc_-march=native_-mtune=native_-Os_-fwrapv_-fPIC_-fPIE_-gdwarf-4_-Wall/timingleaks/crypto_encrypt/r5nd3pke0d/ref/work/r5_parameter_sets.h:63: multiple definition of `r5_parameter_sets'; libcrypto_encrypt_r5nd3pke0d.a(cca_encrypt.o):.../supercop-data/hertz/amd64/try/c/gcc_-march=native_-mtune=native_-Os_-fwrapv_-fPIC_-fPIE_-gdwarf-4_-Wall/timingleaks/crypto_encrypt/r5nd3pke0d/ref/work/r5_parameter_sets.h:63: first defined here
try.c: collect2: error: ld returned 1 exit status

Number of similar (implementation,compiler) pairs: 1, namely:
ImplementationCompiler
T:refgcc -march=native -mtune=native -Os -fwrapv -fPIC -fPIE -gdwarf-4 -Wall (13.2.0)