Implementation notes: amd64, h3neo, crypto_hash/luffa256

Computer: h3neo
Microarchitecture: amd64; K10 45nm (100f63)
Architecture: amd64
CPU ID: AuthenticAMD-00100f63-078bfbff
SUPERCOP version: 20240425
Operation: crypto_hash
Primitive: luffa256
TimeObject sizeTest sizeImplementationCompilerBenchmark dateSUPERCOP version
3630627152 0 039437 804 960T:sphlibgcc_-march=native_-mtune=native_-O2_-fomit-frame-pointer_-fwrapv_-fPIC_-fPIE2024043020240425
3642526704 0 040325 804 960T:sphlibgcc_-march=native_-mtune=native_-O3_-fomit-frame-pointer_-fwrapv_-fPIC_-fPIE2024043020240425
3722815835 320 027451 1172 896T:opt32clang_-march=native_-O2_-fomit-frame-pointer_-fwrapv_-Qunused-arguments_-fPIC_-fPIE2024043020240425
3803121979 0 032320 780 928T:sphlibgcc_-march=native_-mtune=native_-Os_-fomit-frame-pointer_-fwrapv_-fPIC_-fPIE2024043020240425
3835717195 320 029571 1172 896T:opt32clang_-march=native_-O3_-fomit-frame-pointer_-fwrapv_-Qunused-arguments_-fPIC_-fPIE2024043020240425
3870925759 0 037221 804 960T:sphlibgcc_-march=native_-mtune=native_-O_-fomit-frame-pointer_-fwrapv_-fPIC_-fPIE2024043020240425
394063077 0 9615955 844 992T:thomaz/basicclang_-mcpu=native_-O3_-fomit-frame-pointer_-fwrapv_-Qunused-arguments_-fPIC_-fPIE2024043020240425
3979225681 0 036363 844 896T:sphlibclang_-march=native_-O_-fomit-frame-pointer_-fwrapv_-Qunused-arguments_-fPIC_-fPIE2024043020240425
3980325493 0 037107 844 896T:sphlibclang_-march=native_-O2_-fomit-frame-pointer_-fwrapv_-Qunused-arguments_-fPIC_-fPIE2024043020240425
3986319235 320 032067 1172 896T:opt32clang_-mcpu=native_-O3_-fomit-frame-pointer_-fwrapv_-Qunused-arguments_-fPIC_-fPIE2024043020240425
3999225541 0 038091 844 896T:sphlibclang_-march=native_-O3_-fomit-frame-pointer_-fwrapv_-Qunused-arguments_-fPIC_-fPIE2024043020240425
400323088 0 9615531 844 992T:thomaz/basicclang_-march=native_-O3_-fomit-frame-pointer_-fwrapv_-Qunused-arguments_-fPIC_-fPIE2024043020240425
400613088 0 9614611 844 992T:thomaz/basicclang_-march=native_-O2_-fomit-frame-pointer_-fwrapv_-Qunused-arguments_-fPIC_-fPIE2024043020240425
4044025840 0 038843 844 896T:sphlibclang_-mcpu=native_-O3_-fomit-frame-pointer_-fwrapv_-Qunused-arguments_-fPIC_-fPIE2024043020240425
4045524783 0 034837 836 896T:sphlibclang_-march=native_-Os_-fomit-frame-pointer_-fwrapv_-Qunused-arguments_-fPIC_-fPIE2024043020240425
416992123 0 9612707 844 992T:thomaz/basicclang_-march=native_-O_-fomit-frame-pointer_-fwrapv_-Qunused-arguments_-fPIC_-fPIE2024043020240425
4270016719 320 030349 1132 960T:opt32gcc_-march=native_-mtune=native_-O3_-fomit-frame-pointer_-fwrapv_-fPIC_-fPIE2024043020240425
4506211398 0 54424941 804 1504T:sse2gcc_-march=native_-mtune=native_-O3_-fomit-frame-pointer_-fwrapv_-fPIC_-fPIE2024043020240425
4546310291 0 54422525 804 1504T:sse2gcc_-march=native_-mtune=native_-O2_-fomit-frame-pointer_-fwrapv_-fPIC_-fPIE2024043020240425
4549810636 0 54422003 844 1440T:sse2clang_-march=native_-O2_-fomit-frame-pointer_-fwrapv_-Qunused-arguments_-fPIC_-fPIE2024043020240425
4551011296 0 54424035 844 1440T:sse2clang_-mcpu=native_-O3_-fomit-frame-pointer_-fwrapv_-Qunused-arguments_-fPIC_-fPIE2024043020240425
4567810877 0 54423139 844 1440T:sse2clang_-march=native_-O3_-fomit-frame-pointer_-fwrapv_-Qunused-arguments_-fPIC_-fPIE2024043020240425
4681910771 320 023077 1132 960T:opt32gcc_-march=native_-mtune=native_-O2_-fomit-frame-pointer_-fwrapv_-fPIC_-fPIE2024043020240425
470809144 0 54419125 836 1440T:sse2clang_-march=native_-Os_-fomit-frame-pointer_-fwrapv_-Qunused-arguments_-fPIC_-fPIE2024043020240425
4760311177 320 021851 1172 896T:opt32clang_-march=native_-O_-fomit-frame-pointer_-fwrapv_-Qunused-arguments_-fPIC_-fPIE2024043020240425
476248551 0 54418832 780 1472T:sse2gcc_-march=native_-mtune=native_-Os_-fomit-frame-pointer_-fwrapv_-fPIC_-fPIE2024043020240425
476549425 320 019461 1164 896T:opt32clang_-march=native_-Os_-fomit-frame-pointer_-fwrapv_-Qunused-arguments_-fPIC_-fPIE2024043020240425
491399914 0 54420499 844 1440T:sse2clang_-march=native_-O_-fomit-frame-pointer_-fwrapv_-Qunused-arguments_-fPIC_-fPIE2024043020240425
4996610737 0 54422052 796 1504T:sse2gcc_-march=native_-mtune=native_-O_-fomit-frame-pointer_-fwrapv_-fPIC_-fPIE2024043020240425
509229198 320 019536 1108 928T:opt32gcc_-march=native_-mtune=native_-Os_-fomit-frame-pointer_-fwrapv_-fPIC_-fPIE2024043020240425
5180010480 320 021868 1124 960T:opt32gcc_-march=native_-mtune=native_-O_-fomit-frame-pointer_-fwrapv_-fPIC_-fPIE2024043020240425
1558453269 0 9616797 804 1056T:thomaz/basicgcc_-march=native_-mtune=native_-O3_-fomit-frame-pointer_-fwrapv_-fPIC_-fPIE2024043020240425
1593172438 0 9614621 804 1056T:thomaz/basicgcc_-march=native_-mtune=native_-O2_-fomit-frame-pointer_-fwrapv_-fPIC_-fPIE2024043020240425
2651081988 0 9613316 796 1056T:thomaz/basicgcc_-march=native_-mtune=native_-O_-fomit-frame-pointer_-fwrapv_-fPIC_-fPIE2024043020240425
2673692055 0 9612021 836 992T:thomaz/basicclang_-march=native_-Os_-fomit-frame-pointer_-fwrapv_-Qunused-arguments_-fPIC_-fPIE2024043020240425
2708301888 0 9612176 780 1024T:thomaz/basicgcc_-march=native_-mtune=native_-Os_-fomit-frame-pointer_-fwrapv_-fPIC_-fPIE2024043020240425

Compiler output

Implementation: T:sse2_x64asm
Security model: timingleaks
Compiler: clang -march=native -O2 -fomit-frame-pointer -fwrapv -Qunused-arguments -fPIC -fPIE
luffa_x64asm.s: luffa_x64asm.s:780:13: error: unknown token in expression
luffa_x64asm.s: movaps %xmm0, [IV ]
luffa_x64asm.s: ^
luffa_x64asm.s: luffa_x64asm.s:781:13: error: unknown token in expression
luffa_x64asm.s: movaps %xmm1, [IV+16]
luffa_x64asm.s: ^
luffa_x64asm.s: luffa_x64asm.s:782:13: error: unknown token in expression
luffa_x64asm.s: movaps %xmm2, [IV+32]
luffa_x64asm.s: ^
luffa_x64asm.s: luffa_x64asm.s:783:13: error: unknown token in expression
luffa_x64asm.s: movaps %xmm3, [IV+48]
luffa_x64asm.s: ^
luffa_x64asm.s: luffa_x64asm.s:784:13: error: unknown token in expression
luffa_x64asm.s: movaps %xmm4, [IV+64]
luffa_x64asm.s: ^
luffa_x64asm.s: luffa_x64asm.s:785:13: error: unknown token in expression
luffa_x64asm.s: movaps %xmm5, [IV+80]
luffa_x64asm.s: ^
luffa_x64asm.s: luffa_x64asm.s:786:14: error: unknown token in expression
luffa_x64asm.s: movups [%rdi ], %xmm0
luffa_x64asm.s: ^
luffa_x64asm.s: luffa_x64asm.s:787:14: error: unknown token in expression
luffa_x64asm.s: movups [%rdi+16], %xmm1
luffa_x64asm.s: ^
luffa_x64asm.s: luffa_x64asm.s:788:14: error: unknown token in expression
luffa_x64asm.s: ...

Number of similar (compiler,implementation) pairs: 10, namely:
CompilerImplementations
clang -march=native -O2 -fomit-frame-pointer -fwrapv -Qunused-arguments -fPIC -fPIE T:sse2_x64asm
clang -march=native -O3 -fomit-frame-pointer -fwrapv -Qunused-arguments -fPIC -fPIE T:sse2_x64asm
clang -march=native -O -fomit-frame-pointer -fwrapv -Qunused-arguments -fPIC -fPIE T:sse2_x64asm
clang -march=native -Os -fomit-frame-pointer -fwrapv -Qunused-arguments -fPIC -fPIE T:sse2_x64asm
clang -mcpu=native -O3 -fomit-frame-pointer -fwrapv -Qunused-arguments -fPIC -fPIE T:sse2_x64asm
clang -march=native -O2 -fomit-frame-pointer -fwrapv -Qunused-arguments -fPIC -fPIE T:ssse3_x64asm
clang -march=native -O3 -fomit-frame-pointer -fwrapv -Qunused-arguments -fPIC -fPIE T:ssse3_x64asm
clang -march=native -O -fomit-frame-pointer -fwrapv -Qunused-arguments -fPIC -fPIE T:ssse3_x64asm
clang -march=native -Os -fomit-frame-pointer -fwrapv -Qunused-arguments -fPIC -fPIE T:ssse3_x64asm
clang -mcpu=native -O3 -fomit-frame-pointer -fwrapv -Qunused-arguments -fPIC -fPIE T:ssse3_x64asm

Compiler output

Implementation: T:sse2_x64asm
Security model: timingleaks
Compiler: gcc -march=native -mtune=native -O2 -fomit-frame-pointer -fwrapv -fPIC -fPIE
try.c: /usr/bin/ld: libcrypto_hash_luffa256.a(luffa_x64asm.o): relocation R_X86_64_32S against symbol `IV' can not be used when making a PIE object; recompile with -fPIE
try.c: /usr/bin/ld: failed to set dynamic section sizes: bad value
try.c: collect2: error: ld returned 1 exit status

Number of similar (compiler,implementation) pairs: 16, namely:
CompilerImplementations
gcc -march=native -mtune=native -O2 -fomit-frame-pointer -fwrapv -fPIC -fPIE T:sse2_x64asm
gcc -march=native -mtune=native -O3 -fomit-frame-pointer -fwrapv -fPIC -fPIE T:sse2_x64asm
gcc -march=native -mtune=native -O -fomit-frame-pointer -fwrapv -fPIC -fPIE T:sse2_x64asm
gcc -march=native -mtune=native -Os -fomit-frame-pointer -fwrapv -fPIC -fPIE T:sse2_x64asm
gcc -march=native -mtune=native -O2 -fomit-frame-pointer -fwrapv -fPIC -fPIE T:sse2_x64asm-2
gcc -march=native -mtune=native -O3 -fomit-frame-pointer -fwrapv -fPIC -fPIE T:sse2_x64asm-2
gcc -march=native -mtune=native -O -fomit-frame-pointer -fwrapv -fPIC -fPIE T:sse2_x64asm-2
gcc -march=native -mtune=native -Os -fomit-frame-pointer -fwrapv -fPIC -fPIE T:sse2_x64asm-2
gcc -march=native -mtune=native -O2 -fomit-frame-pointer -fwrapv -fPIC -fPIE T:ssse3_x64asm
gcc -march=native -mtune=native -O3 -fomit-frame-pointer -fwrapv -fPIC -fPIE T:ssse3_x64asm
gcc -march=native -mtune=native -O -fomit-frame-pointer -fwrapv -fPIC -fPIE T:ssse3_x64asm
gcc -march=native -mtune=native -Os -fomit-frame-pointer -fwrapv -fPIC -fPIE T:ssse3_x64asm
gcc -march=native -mtune=native -O2 -fomit-frame-pointer -fwrapv -fPIC -fPIE T:ssse3_x64asm-2
gcc -march=native -mtune=native -O3 -fomit-frame-pointer -fwrapv -fPIC -fPIE T:ssse3_x64asm-2
gcc -march=native -mtune=native -O -fomit-frame-pointer -fwrapv -fPIC -fPIE T:ssse3_x64asm-2
gcc -march=native -mtune=native -Os -fomit-frame-pointer -fwrapv -fPIC -fPIE T:ssse3_x64asm-2

Compiler output

Implementation: T:sse2_x64asm-2
Security model: timingleaks
Compiler: clang -march=native -O2 -fomit-frame-pointer -fwrapv -Qunused-arguments -fPIC -fPIE
luffa_x64asm.s: luffa_x64asm.s:780:13: error: unknown token in expression
luffa_x64asm.s: movdqa %xmm0, [IV ]
luffa_x64asm.s: ^
luffa_x64asm.s: luffa_x64asm.s:781:13: error: unknown token in expression
luffa_x64asm.s: movdqa %xmm1, [IV+16]
luffa_x64asm.s: ^
luffa_x64asm.s: luffa_x64asm.s:782:13: error: unknown token in expression
luffa_x64asm.s: movdqa %xmm2, [IV+32]
luffa_x64asm.s: ^
luffa_x64asm.s: luffa_x64asm.s:783:13: error: unknown token in expression
luffa_x64asm.s: movdqa %xmm3, [IV+48]
luffa_x64asm.s: ^
luffa_x64asm.s: luffa_x64asm.s:784:13: error: unknown token in expression
luffa_x64asm.s: movdqa %xmm4, [IV+64]
luffa_x64asm.s: ^
luffa_x64asm.s: luffa_x64asm.s:785:13: error: unknown token in expression
luffa_x64asm.s: movdqa %xmm5, [IV+80]
luffa_x64asm.s: ^
luffa_x64asm.s: luffa_x64asm.s:786:14: error: unknown token in expression
luffa_x64asm.s: movups [%rdi ], %xmm0
luffa_x64asm.s: ^
luffa_x64asm.s: luffa_x64asm.s:787:14: error: unknown token in expression
luffa_x64asm.s: movups [%rdi+16], %xmm1
luffa_x64asm.s: ^
luffa_x64asm.s: luffa_x64asm.s:788:14: error: unknown token in expression
luffa_x64asm.s: ...

Number of similar (compiler,implementation) pairs: 10, namely:
CompilerImplementations
clang -march=native -O2 -fomit-frame-pointer -fwrapv -Qunused-arguments -fPIC -fPIE T:sse2_x64asm-2
clang -march=native -O3 -fomit-frame-pointer -fwrapv -Qunused-arguments -fPIC -fPIE T:sse2_x64asm-2
clang -march=native -O -fomit-frame-pointer -fwrapv -Qunused-arguments -fPIC -fPIE T:sse2_x64asm-2
clang -march=native -Os -fomit-frame-pointer -fwrapv -Qunused-arguments -fPIC -fPIE T:sse2_x64asm-2
clang -mcpu=native -O3 -fomit-frame-pointer -fwrapv -Qunused-arguments -fPIC -fPIE T:sse2_x64asm-2
clang -march=native -O2 -fomit-frame-pointer -fwrapv -Qunused-arguments -fPIC -fPIE T:ssse3_x64asm-2
clang -march=native -O3 -fomit-frame-pointer -fwrapv -Qunused-arguments -fPIC -fPIE T:ssse3_x64asm-2
clang -march=native -O -fomit-frame-pointer -fwrapv -Qunused-arguments -fPIC -fPIE T:ssse3_x64asm-2
clang -march=native -Os -fomit-frame-pointer -fwrapv -Qunused-arguments -fPIC -fPIE T:ssse3_x64asm-2
clang -mcpu=native -O3 -fomit-frame-pointer -fwrapv -Qunused-arguments -fPIC -fPIE T:ssse3_x64asm-2

Compiler output

Implementation: T:ssse3_x64asm-PS
Security model: timingleaks
Compiler: clang -march=native -O2 -fomit-frame-pointer -fwrapv -Qunused-arguments -fPIC -fPIE
luffa256_x64asm.s: luffa256_x64asm.s:297:9: error: unknown token in expression
luffa256_x64asm.s: movaps %xmm0, [IV ]
luffa256_x64asm.s: ^
luffa256_x64asm.s: luffa256_x64asm.s:298:9: error: unknown token in expression
luffa256_x64asm.s: movaps %xmm1, [IV+16]
luffa256_x64asm.s: ^
luffa256_x64asm.s: luffa256_x64asm.s:299:9: error: unknown token in expression
luffa256_x64asm.s: movaps %xmm2, [IV+32]
luffa256_x64asm.s: ^
luffa256_x64asm.s: luffa256_x64asm.s:300:9: error: unknown token in expression
luffa256_x64asm.s: movaps %xmm3, [IV+48]
luffa256_x64asm.s: ^
luffa256_x64asm.s: luffa256_x64asm.s:301:9: error: unknown token in expression
luffa256_x64asm.s: movaps %xmm4, [IV+64]
luffa256_x64asm.s: ^
luffa256_x64asm.s: luffa256_x64asm.s:302:9: error: unknown token in expression
luffa256_x64asm.s: movaps %xmm5, [IV+80]
luffa256_x64asm.s: ^
luffa256_x64asm.s: luffa256_x64asm.s:303:10: error: unknown token in expression
luffa256_x64asm.s: movups [%rdi ], %xmm0
luffa256_x64asm.s: ^
luffa256_x64asm.s: luffa256_x64asm.s:304:10: error: unknown token in expression
luffa256_x64asm.s: movups [%rdi+16], %xmm1
luffa256_x64asm.s: ^
luffa256_x64asm.s: luffa256_x64asm.s:305:10: error: unknown token in expression
luffa256_x64asm.s: ...

Number of similar (compiler,implementation) pairs: 5, namely:
CompilerImplementations
clang -march=native -O2 -fomit-frame-pointer -fwrapv -Qunused-arguments -fPIC -fPIE T:ssse3_x64asm-PS
clang -march=native -O3 -fomit-frame-pointer -fwrapv -Qunused-arguments -fPIC -fPIE T:ssse3_x64asm-PS
clang -march=native -O -fomit-frame-pointer -fwrapv -Qunused-arguments -fPIC -fPIE T:ssse3_x64asm-PS
clang -march=native -Os -fomit-frame-pointer -fwrapv -Qunused-arguments -fPIC -fPIE T:ssse3_x64asm-PS
clang -mcpu=native -O3 -fomit-frame-pointer -fwrapv -Qunused-arguments -fPIC -fPIE T:ssse3_x64asm-PS

Compiler output

Implementation: T:ssse3_x64asm-PS
Security model: timingleaks
Compiler: gcc -march=native -mtune=native -O2 -fomit-frame-pointer -fwrapv -fPIC -fPIE
try.c: /usr/bin/ld: libcrypto_hash_luffa256.a(luffa256_x64asm.o): relocation R_X86_64_32S against `.rodata' can not be used when making a PIE object; recompile with -fPIE
try.c: /usr/bin/ld: failed to set dynamic section sizes: bad value
try.c: collect2: error: ld returned 1 exit status

Number of similar (compiler,implementation) pairs: 8, namely:
CompilerImplementations
gcc -march=native -mtune=native -O2 -fomit-frame-pointer -fwrapv -fPIC -fPIE T:ssse3_x64asm-PS
gcc -march=native -mtune=native -O3 -fomit-frame-pointer -fwrapv -fPIC -fPIE T:ssse3_x64asm-PS
gcc -march=native -mtune=native -O -fomit-frame-pointer -fwrapv -fPIC -fPIE T:ssse3_x64asm-PS
gcc -march=native -mtune=native -Os -fomit-frame-pointer -fwrapv -fPIC -fPIE T:ssse3_x64asm-PS
gcc -march=native -mtune=native -O2 -fomit-frame-pointer -fwrapv -fPIC -fPIE T:ssse3_x64asm-PS-2
gcc -march=native -mtune=native -O3 -fomit-frame-pointer -fwrapv -fPIC -fPIE T:ssse3_x64asm-PS-2
gcc -march=native -mtune=native -O -fomit-frame-pointer -fwrapv -fPIC -fPIE T:ssse3_x64asm-PS-2
gcc -march=native -mtune=native -Os -fomit-frame-pointer -fwrapv -fPIC -fPIE T:ssse3_x64asm-PS-2

Compiler output

Implementation: T:ssse3_x64asm-PS-2
Security model: timingleaks
Compiler: clang -march=native -O2 -fomit-frame-pointer -fwrapv -Qunused-arguments -fPIC -fPIE
luffa256_x64asm.s: luffa256_x64asm.s:297:9: error: unknown token in expression
luffa256_x64asm.s: movdqa %xmm0, [IV ]
luffa256_x64asm.s: ^
luffa256_x64asm.s: luffa256_x64asm.s:298:9: error: unknown token in expression
luffa256_x64asm.s: movdqa %xmm1, [IV+16]
luffa256_x64asm.s: ^
luffa256_x64asm.s: luffa256_x64asm.s:299:9: error: unknown token in expression
luffa256_x64asm.s: movdqa %xmm2, [IV+32]
luffa256_x64asm.s: ^
luffa256_x64asm.s: luffa256_x64asm.s:300:9: error: unknown token in expression
luffa256_x64asm.s: movdqa %xmm3, [IV+48]
luffa256_x64asm.s: ^
luffa256_x64asm.s: luffa256_x64asm.s:301:9: error: unknown token in expression
luffa256_x64asm.s: movdqa %xmm4, [IV+64]
luffa256_x64asm.s: ^
luffa256_x64asm.s: luffa256_x64asm.s:302:9: error: unknown token in expression
luffa256_x64asm.s: movdqa %xmm5, [IV+80]
luffa256_x64asm.s: ^
luffa256_x64asm.s: luffa256_x64asm.s:303:10: error: unknown token in expression
luffa256_x64asm.s: movdqu [%rdi ], %xmm0
luffa256_x64asm.s: ^
luffa256_x64asm.s: luffa256_x64asm.s:304:10: error: unknown token in expression
luffa256_x64asm.s: movdqu [%rdi+16], %xmm1
luffa256_x64asm.s: ^
luffa256_x64asm.s: luffa256_x64asm.s:305:10: error: unknown token in expression
luffa256_x64asm.s: ...

Number of similar (compiler,implementation) pairs: 5, namely:
CompilerImplementations
clang -march=native -O2 -fomit-frame-pointer -fwrapv -Qunused-arguments -fPIC -fPIE T:ssse3_x64asm-PS-2
clang -march=native -O3 -fomit-frame-pointer -fwrapv -Qunused-arguments -fPIC -fPIE T:ssse3_x64asm-PS-2
clang -march=native -O -fomit-frame-pointer -fwrapv -Qunused-arguments -fPIC -fPIE T:ssse3_x64asm-PS-2
clang -march=native -Os -fomit-frame-pointer -fwrapv -Qunused-arguments -fPIC -fPIE T:ssse3_x64asm-PS-2
clang -mcpu=native -O3 -fomit-frame-pointer -fwrapv -Qunused-arguments -fPIC -fPIE T:ssse3_x64asm-PS-2

Compiler output

Implementation: T:thomaz/asm-PS
Security model: timingleaks
Compiler: clang -march=native -O2 -fomit-frame-pointer -fwrapv -Qunused-arguments -fPIC -fPIE
hash.c: hash.c:32:12: warning: passing 'const unsigned char *' to parameter of type 'unsigned char *' discards qualifiers [-Wincompatible-pointer-types-discards-qualifiers]
hash.c: fLuffa256(in, out, inlen);
hash.c: ^~
hash.c: hash.c:29:31: note: passing argument to parameter 'input' here
hash.c: void fLuffa256(unsigned char *input, unsigned char *output, int len);
hash.c: ^
hash.c: 1 warning generated.
luffa_256.s: <instantiation>:1:8: error: unknown token in expression
luffa_256.s: pshufb %xmm6, %xmm12
luffa_256.s: ^
luffa_256.s: <instantiation>:1:1: note: while in macro instantiation
luffa_256.s: mPSSTEPI %xmm6, %xmm7, %xmm12
luffa_256.s: ^
luffa_256.s: luffa_256.s:232:2: note: while in macro instantiation
luffa_256.s: mPS %xmm6, %xmm7, %xmm8, %xmm9, %xmm10, %xmm11
luffa_256.s: ^
luffa_256.s: <instantiation>:2:9: error: unknown token in expression
luffa_256.s: pshufb %xmm7, %xmm12
luffa_256.s: ^
luffa_256.s: <instantiation>:1:1: note: while in macro instantiation
luffa_256.s: mPSSTEPI %xmm6, %xmm7, %xmm12
luffa_256.s: ^
luffa_256.s: luffa_256.s:232:2: note: while in macro instantiation
luffa_256.s: mPS %xmm6, %xmm7, %xmm8, %xmm9, %xmm10, %xmm11
luffa_256.s: ^
luffa_256.s: <instantiation>:1:8: error: unknown token in expression
luffa_256.s: movaps %xmm8, %xmm6
luffa_256.s: ^
luffa_256.s: <instantiation>:2:2: note: while in macro instantiation
luffa_256.s: mPSSTEPII %xmm6, %xmm7, %xmm8, %xmm9, %xmm10, %xmm11
luffa_256.s: ^
luffa_256.s: luffa_256.s:232:2: note: while in macro instantiation
luffa_256.s: ...

Number of similar (compiler,implementation) pairs: 10, namely:
CompilerImplementations
clang -march=native -O2 -fomit-frame-pointer -fwrapv -Qunused-arguments -fPIC -fPIE T:thomaz/asm-PS
clang -march=native -O3 -fomit-frame-pointer -fwrapv -Qunused-arguments -fPIC -fPIE T:thomaz/asm-PS
clang -march=native -O -fomit-frame-pointer -fwrapv -Qunused-arguments -fPIC -fPIE T:thomaz/asm-PS
clang -march=native -Os -fomit-frame-pointer -fwrapv -Qunused-arguments -fPIC -fPIE T:thomaz/asm-PS
clang -mcpu=native -O3 -fomit-frame-pointer -fwrapv -Qunused-arguments -fPIC -fPIE T:thomaz/asm-PS
clang -march=native -O2 -fomit-frame-pointer -fwrapv -Qunused-arguments -fPIC -fPIE T:thomaz/asm-PS-v2-FP
clang -march=native -O3 -fomit-frame-pointer -fwrapv -Qunused-arguments -fPIC -fPIE T:thomaz/asm-PS-v2-FP
clang -march=native -O -fomit-frame-pointer -fwrapv -Qunused-arguments -fPIC -fPIE T:thomaz/asm-PS-v2-FP
clang -march=native -Os -fomit-frame-pointer -fwrapv -Qunused-arguments -fPIC -fPIE T:thomaz/asm-PS-v2-FP
clang -mcpu=native -O3 -fomit-frame-pointer -fwrapv -Qunused-arguments -fPIC -fPIE T:thomaz/asm-PS-v2-FP

Compiler output

Implementation: T:thomaz/asm-PS
Security model: timingleaks
Compiler: gcc -march=native -mtune=native -O2 -fomit-frame-pointer -fwrapv -fPIC -fPIE
hash.c: hash.c: In function 'crypto_hash_luffa256_thomaz_asm_PS_timingleaks':
hash.c: hash.c:32:19: warning: passing argument 1 of 'fLuffa256' discards 'const' qualifier from pointer target type [-Wdiscarded-qualifiers]
hash.c: 32 | fLuffa256(in, out, inlen);
hash.c: | ^~
hash.c: hash.c:29:31: note: expected 'unsigned char *' but argument is of type 'const unsigned char *'
hash.c: 29 | void fLuffa256(unsigned char *input, unsigned char *output, int len);
hash.c: | ~~~~~~~~~~~~~~~^~~~~
try.c: /usr/bin/ld: libcrypto_hash_luffa256.a(luffa_256.o): relocation R_X86_64_32S against `.rodata' can not be used when making a PIE object; recompile with -fPIE
try.c: /usr/bin/ld: failed to set dynamic section sizes: bad value
try.c: collect2: error: ld returned 1 exit status

Number of similar (compiler,implementation) pairs: 4, namely:
CompilerImplementations
gcc -march=native -mtune=native -O2 -fomit-frame-pointer -fwrapv -fPIC -fPIE T:thomaz/asm-PS
gcc -march=native -mtune=native -O3 -fomit-frame-pointer -fwrapv -fPIC -fPIE T:thomaz/asm-PS
gcc -march=native -mtune=native -O -fomit-frame-pointer -fwrapv -fPIC -fPIE T:thomaz/asm-PS
gcc -march=native -mtune=native -Os -fomit-frame-pointer -fwrapv -fPIC -fPIE T:thomaz/asm-PS

Compiler output

Implementation: T:thomaz/asm-PS-v2-FP
Security model: timingleaks
Compiler: gcc -march=native -mtune=native -O2 -fomit-frame-pointer -fwrapv -fPIC -fPIE
hash.c: hash.c: In function 'crypto_hash_luffa256_thomaz_asm_PS_v2_FP_timingleaks':
hash.c: hash.c:32:19: warning: passing argument 1 of 'fLuffa256' discards 'const' qualifier from pointer target type [-Wdiscarded-qualifiers]
hash.c: 32 | fLuffa256(in, out, inlen);
hash.c: | ^~
hash.c: hash.c:29:31: note: expected 'unsigned char *' but argument is of type 'const unsigned char *'
hash.c: 29 | void fLuffa256(unsigned char *input, unsigned char *output, int len);
hash.c: | ~~~~~~~~~~~~~~~^~~~~
try.c: /usr/bin/ld: libcrypto_hash_luffa256.a(luffa_256.o): relocation R_X86_64_32S against `.rodata' can not be used when making a PIE object; recompile with -fPIE
try.c: /usr/bin/ld: failed to set dynamic section sizes: bad value
try.c: collect2: error: ld returned 1 exit status

Number of similar (compiler,implementation) pairs: 4, namely:
CompilerImplementations
gcc -march=native -mtune=native -O2 -fomit-frame-pointer -fwrapv -fPIC -fPIE T:thomaz/asm-PS-v2-FP
gcc -march=native -mtune=native -O3 -fomit-frame-pointer -fwrapv -fPIC -fPIE T:thomaz/asm-PS-v2-FP
gcc -march=native -mtune=native -O -fomit-frame-pointer -fwrapv -fPIC -fPIE T:thomaz/asm-PS-v2-FP
gcc -march=native -mtune=native -Os -fomit-frame-pointer -fwrapv -fPIC -fPIE T:thomaz/asm-PS-v2-FP

Compiler output

Implementation: T:thomaz/asm-PS-v2-INT
Security model: timingleaks
Compiler: clang -march=native -O2 -fomit-frame-pointer -fwrapv -Qunused-arguments -fPIC -fPIE
hash.c: hash.c:32:12: warning: passing 'const unsigned char *' to parameter of type 'unsigned char *' discards qualifiers [-Wincompatible-pointer-types-discards-qualifiers]
hash.c: fLuffa256(in, out, inlen);
hash.c: ^~
hash.c: hash.c:29:31: note: passing argument to parameter 'input' here
hash.c: void fLuffa256(unsigned char *input, unsigned char *output, int len);
hash.c: ^
hash.c: 1 warning generated.
luffa_256.s: <instantiation>:1:8: error: unknown token in expression
luffa_256.s: pshufb %xmm6, %xmm12
luffa_256.s: ^
luffa_256.s: <instantiation>:1:1: note: while in macro instantiation
luffa_256.s: mPSSTEPI %xmm6, %xmm7, %xmm12
luffa_256.s: ^
luffa_256.s: luffa_256.s:232:2: note: while in macro instantiation
luffa_256.s: mPS %xmm6, %xmm7, %xmm8, %xmm9, %xmm10, %xmm11
luffa_256.s: ^
luffa_256.s: <instantiation>:2:9: error: unknown token in expression
luffa_256.s: pshufb %xmm7, %xmm12
luffa_256.s: ^
luffa_256.s: <instantiation>:1:1: note: while in macro instantiation
luffa_256.s: mPSSTEPI %xmm6, %xmm7, %xmm12
luffa_256.s: ^
luffa_256.s: luffa_256.s:232:2: note: while in macro instantiation
luffa_256.s: mPS %xmm6, %xmm7, %xmm8, %xmm9, %xmm10, %xmm11
luffa_256.s: ^
luffa_256.s: <instantiation>:1:8: error: unknown token in expression
luffa_256.s: movdqa %xmm8, %xmm6
luffa_256.s: ^
luffa_256.s: <instantiation>:2:2: note: while in macro instantiation
luffa_256.s: mPSSTEPII %xmm6, %xmm7, %xmm8, %xmm9, %xmm10, %xmm11
luffa_256.s: ^
luffa_256.s: luffa_256.s:232:2: note: while in macro instantiation
luffa_256.s: ...

Number of similar (compiler,implementation) pairs: 5, namely:
CompilerImplementations
clang -march=native -O2 -fomit-frame-pointer -fwrapv -Qunused-arguments -fPIC -fPIE T:thomaz/asm-PS-v2-INT
clang -march=native -O3 -fomit-frame-pointer -fwrapv -Qunused-arguments -fPIC -fPIE T:thomaz/asm-PS-v2-INT
clang -march=native -O -fomit-frame-pointer -fwrapv -Qunused-arguments -fPIC -fPIE T:thomaz/asm-PS-v2-INT
clang -march=native -Os -fomit-frame-pointer -fwrapv -Qunused-arguments -fPIC -fPIE T:thomaz/asm-PS-v2-INT
clang -mcpu=native -O3 -fomit-frame-pointer -fwrapv -Qunused-arguments -fPIC -fPIE T:thomaz/asm-PS-v2-INT

Compiler output

Implementation: T:thomaz/asm-PS-v2-INT
Security model: timingleaks
Compiler: gcc -march=native -mtune=native -O2 -fomit-frame-pointer -fwrapv -fPIC -fPIE
hash.c: hash.c: In function 'crypto_hash_luffa256_thomaz_asm_PS_v2_INT_timingleaks':
hash.c: hash.c:32:19: warning: passing argument 1 of 'fLuffa256' discards 'const' qualifier from pointer target type [-Wdiscarded-qualifiers]
hash.c: 32 | fLuffa256(in, out, inlen);
hash.c: | ^~
hash.c: hash.c:29:31: note: expected 'unsigned char *' but argument is of type 'const unsigned char *'
hash.c: 29 | void fLuffa256(unsigned char *input, unsigned char *output, int len);
hash.c: | ~~~~~~~~~~~~~~~^~~~~
try.c: /usr/bin/ld: libcrypto_hash_luffa256.a(luffa_256.o): relocation R_X86_64_32S against `.rodata' can not be used when making a PIE object; recompile with -fPIE
try.c: /usr/bin/ld: failed to set dynamic section sizes: bad value
try.c: collect2: error: ld returned 1 exit status

Number of similar (compiler,implementation) pairs: 4, namely:
CompilerImplementations
gcc -march=native -mtune=native -O2 -fomit-frame-pointer -fwrapv -fPIC -fPIE T:thomaz/asm-PS-v2-INT
gcc -march=native -mtune=native -O3 -fomit-frame-pointer -fwrapv -fPIC -fPIE T:thomaz/asm-PS-v2-INT
gcc -march=native -mtune=native -O -fomit-frame-pointer -fwrapv -fPIC -fPIE T:thomaz/asm-PS-v2-INT
gcc -march=native -mtune=native -Os -fomit-frame-pointer -fwrapv -fPIC -fPIE T:thomaz/asm-PS-v2-INT

Compiler output

Implementation: T:thomaz/asm-PSPar-v2-FP
Security model: timingleaks
Compiler: clang -march=native -O2 -fomit-frame-pointer -fwrapv -Qunused-arguments -fPIC -fPIE
hash.c: hash.c:32:12: warning: passing 'const unsigned char *' to parameter of type 'unsigned char *' discards qualifiers [-Wincompatible-pointer-types-discards-qualifiers]
hash.c: fLuffa256(in, out, inlen);
hash.c: ^~
hash.c: hash.c:29:31: note: passing argument to parameter 'input' here
hash.c: void fLuffa256(unsigned char *input, unsigned char *output, int len);
hash.c: ^
hash.c: 1 warning generated.
luffa256.s: <instantiation>:1:8: error: unknown token in expression
luffa256.s: pshufb %xmm6, maskShufLittleEndian
luffa256.s: ^
luffa256.s: <instantiation>:1:1: note: while in macro instantiation
luffa256.s: mPSSTEPI %xmm6, %xmm7, maskShufLittleEndian
luffa256.s: ^
luffa256.s: luffa256.s:445:2: note: while in macro instantiation
luffa256.s: mPS %xmm6, %xmm7, %xmm8, %xmm9, %xmm10, %xmm11
luffa256.s: ^
luffa256.s: <instantiation>:2:9: error: unknown token in expression
luffa256.s: pshufb %xmm7, maskShufLittleEndian
luffa256.s: ^
luffa256.s: <instantiation>:1:1: note: while in macro instantiation
luffa256.s: mPSSTEPI %xmm6, %xmm7, maskShufLittleEndian
luffa256.s: ^
luffa256.s: luffa256.s:445:2: note: while in macro instantiation
luffa256.s: mPS %xmm6, %xmm7, %xmm8, %xmm9, %xmm10, %xmm11
luffa256.s: ^
luffa256.s: <instantiation>:1:8: error: unknown token in expression
luffa256.s: movaps %xmm8, %xmm6
luffa256.s: ^
luffa256.s: <instantiation>:2:2: note: while in macro instantiation
luffa256.s: mPSSTEPII %xmm6, %xmm7, %xmm8, %xmm9, %xmm10, %xmm11
luffa256.s: ^
luffa256.s: luffa256.s:445:2: note: while in macro instantiation
luffa256.s: ...

Number of similar (compiler,implementation) pairs: 5, namely:
CompilerImplementations
clang -march=native -O2 -fomit-frame-pointer -fwrapv -Qunused-arguments -fPIC -fPIE T:thomaz/asm-PSPar-v2-FP
clang -march=native -O3 -fomit-frame-pointer -fwrapv -Qunused-arguments -fPIC -fPIE T:thomaz/asm-PSPar-v2-FP
clang -march=native -O -fomit-frame-pointer -fwrapv -Qunused-arguments -fPIC -fPIE T:thomaz/asm-PSPar-v2-FP
clang -march=native -Os -fomit-frame-pointer -fwrapv -Qunused-arguments -fPIC -fPIE T:thomaz/asm-PSPar-v2-FP
clang -mcpu=native -O3 -fomit-frame-pointer -fwrapv -Qunused-arguments -fPIC -fPIE T:thomaz/asm-PSPar-v2-FP

Compiler output

Implementation: T:thomaz/asm-PSPar-v2-FP
Security model: timingleaks
Compiler: gcc -march=native -mtune=native -O2 -fomit-frame-pointer -fwrapv -fPIC -fPIE
hash.c: hash.c: In function 'crypto_hash_luffa256_thomaz_asm_PSPar_v2_FP_timingleaks':
hash.c: hash.c:32:19: warning: passing argument 1 of 'fLuffa256' discards 'const' qualifier from pointer target type [-Wdiscarded-qualifiers]
hash.c: 32 | fLuffa256(in, out, inlen);
hash.c: | ^~
hash.c: hash.c:29:31: note: expected 'unsigned char *' but argument is of type 'const unsigned char *'
hash.c: 29 | void fLuffa256(unsigned char *input, unsigned char *output, int len);
hash.c: | ~~~~~~~~~~~~~~~^~~~~
try.c: /usr/bin/ld: libcrypto_hash_luffa256.a(luffa256.o): relocation R_X86_64_32S against `.rodata' can not be used when making a PIE object; recompile with -fPIE
try.c: /usr/bin/ld: failed to set dynamic section sizes: bad value
try.c: collect2: error: ld returned 1 exit status

Number of similar (compiler,implementation) pairs: 4, namely:
CompilerImplementations
gcc -march=native -mtune=native -O2 -fomit-frame-pointer -fwrapv -fPIC -fPIE T:thomaz/asm-PSPar-v2-FP
gcc -march=native -mtune=native -O3 -fomit-frame-pointer -fwrapv -fPIC -fPIE T:thomaz/asm-PSPar-v2-FP
gcc -march=native -mtune=native -O -fomit-frame-pointer -fwrapv -fPIC -fPIE T:thomaz/asm-PSPar-v2-FP
gcc -march=native -mtune=native -Os -fomit-frame-pointer -fwrapv -fPIC -fPIE T:thomaz/asm-PSPar-v2-FP

Compiler output

Implementation: T:thomaz/asm-PSPar-v2-INT
Security model: timingleaks
Compiler: clang -march=native -O2 -fomit-frame-pointer -fwrapv -Qunused-arguments -fPIC -fPIE
hash.c: hash.c:32:12: warning: passing 'const unsigned char *' to parameter of type 'unsigned char *' discards qualifiers [-Wincompatible-pointer-types-discards-qualifiers]
hash.c: fLuffa256(in, out, inlen);
hash.c: ^~
hash.c: hash.c:29:31: note: passing argument to parameter 'input' here
hash.c: void fLuffa256(unsigned char *input, unsigned char *output, int len);
hash.c: ^
hash.c: 1 warning generated.
luffa256.s: <instantiation>:1:8: error: unknown token in expression
luffa256.s: pshufb %xmm6, maskShufLittleEndian
luffa256.s: ^
luffa256.s: <instantiation>:1:1: note: while in macro instantiation
luffa256.s: mPSSTEPI %xmm6, %xmm7, maskShufLittleEndian
luffa256.s: ^
luffa256.s: luffa256.s:445:2: note: while in macro instantiation
luffa256.s: mPS %xmm6, %xmm7, %xmm8, %xmm9, %xmm10, %xmm11
luffa256.s: ^
luffa256.s: <instantiation>:2:9: error: unknown token in expression
luffa256.s: pshufb %xmm7, maskShufLittleEndian
luffa256.s: ^
luffa256.s: <instantiation>:1:1: note: while in macro instantiation
luffa256.s: mPSSTEPI %xmm6, %xmm7, maskShufLittleEndian
luffa256.s: ^
luffa256.s: luffa256.s:445:2: note: while in macro instantiation
luffa256.s: mPS %xmm6, %xmm7, %xmm8, %xmm9, %xmm10, %xmm11
luffa256.s: ^
luffa256.s: <instantiation>:1:8: error: unknown token in expression
luffa256.s: movdqa %xmm8, %xmm6
luffa256.s: ^
luffa256.s: <instantiation>:2:2: note: while in macro instantiation
luffa256.s: mPSSTEPII %xmm6, %xmm7, %xmm8, %xmm9, %xmm10, %xmm11
luffa256.s: ^
luffa256.s: luffa256.s:445:2: note: while in macro instantiation
luffa256.s: ...

Number of similar (compiler,implementation) pairs: 5, namely:
CompilerImplementations
clang -march=native -O2 -fomit-frame-pointer -fwrapv -Qunused-arguments -fPIC -fPIE T:thomaz/asm-PSPar-v2-INT
clang -march=native -O3 -fomit-frame-pointer -fwrapv -Qunused-arguments -fPIC -fPIE T:thomaz/asm-PSPar-v2-INT
clang -march=native -O -fomit-frame-pointer -fwrapv -Qunused-arguments -fPIC -fPIE T:thomaz/asm-PSPar-v2-INT
clang -march=native -Os -fomit-frame-pointer -fwrapv -Qunused-arguments -fPIC -fPIE T:thomaz/asm-PSPar-v2-INT
clang -mcpu=native -O3 -fomit-frame-pointer -fwrapv -Qunused-arguments -fPIC -fPIE T:thomaz/asm-PSPar-v2-INT

Compiler output

Implementation: T:thomaz/asm-PSPar-v2-INT
Security model: timingleaks
Compiler: gcc -march=native -mtune=native -O2 -fomit-frame-pointer -fwrapv -fPIC -fPIE
hash.c: hash.c: In function 'crypto_hash_luffa256_thomaz_asm_PSPar_v2_INT_timingleaks':
hash.c: hash.c:32:19: warning: passing argument 1 of 'fLuffa256' discards 'const' qualifier from pointer target type [-Wdiscarded-qualifiers]
hash.c: 32 | fLuffa256(in, out, inlen);
hash.c: | ^~
hash.c: hash.c:29:31: note: expected 'unsigned char *' but argument is of type 'const unsigned char *'
hash.c: 29 | void fLuffa256(unsigned char *input, unsigned char *output, int len);
hash.c: | ~~~~~~~~~~~~~~~^~~~~
try.c: /usr/bin/ld: libcrypto_hash_luffa256.a(luffa256.o): relocation R_X86_64_32S against `.rodata' can not be used when making a PIE object; recompile with -fPIE
try.c: /usr/bin/ld: failed to set dynamic section sizes: bad value
try.c: collect2: error: ld returned 1 exit status

Number of similar (compiler,implementation) pairs: 4, namely:
CompilerImplementations
gcc -march=native -mtune=native -O2 -fomit-frame-pointer -fwrapv -fPIC -fPIE T:thomaz/asm-PSPar-v2-INT
gcc -march=native -mtune=native -O3 -fomit-frame-pointer -fwrapv -fPIC -fPIE T:thomaz/asm-PSPar-v2-INT
gcc -march=native -mtune=native -O -fomit-frame-pointer -fwrapv -fPIC -fPIE T:thomaz/asm-PSPar-v2-INT
gcc -march=native -mtune=native -Os -fomit-frame-pointer -fwrapv -fPIC -fPIE T:thomaz/asm-PSPar-v2-INT