Test results for amd64, h2atom, crypto_hash/asconhashv12

[Page version: 20260919 18:54:16]

Measurements for amd64, h2atom, crypto_hash Test results for amd64, h2atom, crypto_hash Test results for crypto_hash/asconhashv12
Computer: h2atom
Microarchitecture: amd64; Bonnell (106ca)
Architecture: amd64
CPU ID: GenuineIntel-000106ca-bfe9fbff
SUPERCOP version: 20260330
Operation: crypto_hash
Primitive: asconhashv12
TimeObject sizeTest sizeImplementationCompilerBenchmark dateSUPERCOP version
644456377 0 027036 1240 1480opt64clang -march=native -O -fwrapv -Qunused-arguments -fPIC -fPIE -gdwarf-4 -Wall2026051420260330
646376377 0 028300 1240 1480opt64clang -march=native -O2 -fwrapv -Qunused-arguments -fPIC -fPIE -gdwarf-4 -Wall2026051420260330
646376377 0 029492 1240 1480opt64clang -march=native -O3 -fwrapv -Qunused-arguments -fPIC -fPIE -gdwarf-4 -Wall2026051420260330
646426362 0 026406 1232 1480opt64clang -march=native -Os -fwrapv -Qunused-arguments -fPIC -fPIE -gdwarf-4 -Wall2026051420260330
649686795 0 026993 1200 1544opt64gcc -march=native -mtune=native -Os -fwrapv -fPIC -fPIE -gdwarf-4 -Wall2026051420260330
704716876 0 029123 1224 1576opt64gcc -march=native -mtune=native -O2 -fwrapv -fPIC -fPIE -gdwarf-4 -Wall2026051420260330
704716876 0 030219 1224 1576opt64gcc -march=native -mtune=native -O3 -fwrapv -fPIC -fPIE -gdwarf-4 -Wall2026051420260330
712146345 0 029492 1240 1480opt64clang -mcpu=native -O3 -fwrapv -Qunused-arguments -fPIC -fPIE -gdwarf-4 -Wall2026051420260330
769252683 0 025796 1240 1480refclang -march=native -O3 -fwrapv -Qunused-arguments -fPIC -fPIE -gdwarf-4 -Wall2026051420260330
769472683 0 024604 1240 1480refclang -march=native -O2 -fwrapv -Qunused-arguments -fPIC -fPIE -gdwarf-4 -Wall2026051420260330
78631746 0 022676 1240 1480opt64_lowsizeclang -march=native -O2 -fwrapv -Qunused-arguments -fPIC -fPIE -gdwarf-4 -Wall2026051420260330
78631746 0 023868 1240 1480opt64_lowsizeclang -march=native -O3 -fwrapv -Qunused-arguments -fPIC -fPIE -gdwarf-4 -Wall2026051420260330
78817708 0 020758 1232 1480opt64_lowsizeclang -march=native -Os -fwrapv -Qunused-arguments -fPIC -fPIE -gdwarf-4 -Wall2026051420260330
78828719 0 021380 1240 1480opt64_lowsizeclang -march=native -O -fwrapv -Qunused-arguments -fPIC -fPIE -gdwarf-4 -Wall2026051420260330
80655855 0 021081 1200 1544opt64_lowsizegcc -march=native -mtune=native -Os -fwrapv -fPIC -fPIE -gdwarf-4 -Wall2026051420260330
82689924 0 023211 1224 1576opt64_lowsizegcc -march=native -mtune=native -O2 -fwrapv -fPIC -fPIE -gdwarf-4 -Wall2026051420260330
82689924 0 024307 1224 1576opt64_lowsizegcc -march=native -mtune=native -O3 -fwrapv -fPIC -fPIE -gdwarf-4 -Wall2026051420260330
831538332 0 028374 1232 1480opt32clang -march=native -Os -fwrapv -Qunused-arguments -fPIC -fPIE -gdwarf-4 -Wall2026051420260330
831618350 0 030268 1240 1480opt32clang -march=native -O2 -fwrapv -Qunused-arguments -fPIC -fPIE -gdwarf-4 -Wall2026051420260330
831618350 0 031460 1240 1480opt32clang -march=native -O3 -fwrapv -Qunused-arguments -fPIC -fPIE -gdwarf-4 -Wall2026051420260330
832277738 0 031123 1224 1576refgcc -march=native -mtune=native -O3 -fwrapv -fPIC -fPIE -gdwarf-4 -Wall2026051420260330
852002795 0 023452 1240 1480refclang -march=native -O -fwrapv -Qunused-arguments -fPIC -fPIE -gdwarf-4 -Wall2026051420260330
856558350 0 029004 1240 1480opt32clang -march=native -O -fwrapv -Qunused-arguments -fPIC -fPIE -gdwarf-4 -Wall2026051420260330
867882924 0 022966 1232 1480refclang -march=native -Os -fwrapv -Qunused-arguments -fPIC -fPIE -gdwarf-4 -Wall2026051420260330
876868413 0 028617 1200 1544opt32gcc -march=native -mtune=native -Os -fwrapv -fPIC -fPIE -gdwarf-4 -Wall2026051420260330
891407659 0 029955 1224 1576refgcc -march=native -mtune=native -O2 -fwrapv -fPIC -fPIE -gdwarf-4 -Wall2026051420260330
972082753 0 025908 1240 1480refclang -mcpu=native -O3 -fwrapv -Qunused-arguments -fPIC -fPIE -gdwarf-4 -Wall2026051420260330
97265762 0 021420 1240 1480opt32_lowsizeclang -march=native -O -fwrapv -Qunused-arguments -fPIC -fPIE -gdwarf-4 -Wall2026051420260330
981687388 0 028866 1216 1576opt64gcc -march=native -mtune=native -O -fwrapv -fPIC -fPIE -gdwarf-4 -Wall2026051420260330
987458991 0 031243 1224 1576opt32gcc -march=native -mtune=native -O2 -fwrapv -fPIC -fPIE -gdwarf-4 -Wall2026051420260330
987458991 0 032339 1224 1576opt32gcc -march=native -mtune=native -O3 -fwrapv -fPIC -fPIE -gdwarf-4 -Wall2026051420260330
99212749 0 020798 1232 1480opt32_lowsizeclang -march=native -Os -fwrapv -Qunused-arguments -fPIC -fPIE -gdwarf-4 -Wall2026051420260330
99408789 0 022716 1240 1480opt32_lowsizeclang -march=native -O2 -fwrapv -Qunused-arguments -fPIC -fPIE -gdwarf-4 -Wall2026051420260330
99408789 0 023908 1240 1480opt32_lowsizeclang -march=native -O3 -fwrapv -Qunused-arguments -fPIC -fPIE -gdwarf-4 -Wall2026051420260330
102381751 0 023900 1240 1480opt64_lowsizeclang -mcpu=native -O3 -fwrapv -Qunused-arguments -fPIC -fPIE -gdwarf-4 -Wall2026051420260330
1026677733 0 029250 1216 1576refgcc -march=native -mtune=native -O -fwrapv -fPIC -fPIE -gdwarf-4 -Wall2026051420260330
1055068704 0 031844 1240 1480opt32clang -mcpu=native -O3 -fwrapv -Qunused-arguments -fPIC -fPIE -gdwarf-4 -Wall2026051420260330
107115939 0 021161 1200 1544opt32_lowsizegcc -march=native -mtune=native -Os -fwrapv -fPIC -fPIE -gdwarf-4 -Wall2026051420260330
1132901434 0 022914 1216 1576opt64_lowsizegcc -march=native -mtune=native -O -fwrapv -fPIC -fPIE -gdwarf-4 -Wall2026051420260330
116991892 0 021145 1200 1544refgcc -march=native -mtune=native -Os -fwrapv -fPIC -fPIE -gdwarf-4 -Wall2026051420260330
1211051005 0 023283 1224 1576opt32_lowsizegcc -march=native -mtune=native -O2 -fwrapv -fPIC -fPIE -gdwarf-4 -Wall2026051420260330
1211121005 0 024379 1224 1576opt32_lowsizegcc -march=native -mtune=native -O3 -fwrapv -fPIC -fPIE -gdwarf-4 -Wall2026051420260330
1256279804 0 031282 1216 1576opt32gcc -march=native -mtune=native -O -fwrapv -fPIC -fPIE -gdwarf-4 -Wall2026051420260330
129822795 0 023932 1240 1480opt32_lowsizeclang -mcpu=native -O3 -fwrapv -Qunused-arguments -fPIC -fPIE -gdwarf-4 -Wall2026051420260330
1419231517 0 023002 1216 1576opt32_lowsizegcc -march=native -mtune=native -O -fwrapv -fPIC -fPIE -gdwarf-4 -Wall2026051420260330
1740725904 0 028972 1240 1480bi32clang -march=native -O3 -fwrapv -Qunused-arguments -fPIC -fPIE -gdwarf-4 -Wall2026051420260330
1740795474 0 027348 1240 1480bi32clang -march=native -O2 -fwrapv -Qunused-arguments -fPIC -fPIE -gdwarf-4 -Wall2026051420260330
1742755471 0 025470 1232 1480bi32clang -march=native -Os -fwrapv -Qunused-arguments -fPIC -fPIE -gdwarf-4 -Wall2026051420260330
1838695697 0 025793 1200 1544bi32gcc -march=native -mtune=native -Os -fwrapv -fPIC -fPIE -gdwarf-4 -Wall2026051420260330
1848575490 0 026100 1240 1480bi32clang -march=native -O -fwrapv -Qunused-arguments -fPIC -fPIE -gdwarf-4 -Wall2026051420260330
1902353039 0 026180 1240 1480bi32_lowregclang -march=native -O3 -fwrapv -Qunused-arguments -fPIC -fPIE -gdwarf-4 -Wall2026051420260330
1902463039 0 024988 1240 1480bi32_lowregclang -march=native -O2 -fwrapv -Qunused-arguments -fPIC -fPIE -gdwarf-4 -Wall2026051420260330
1902592943 0 023014 1232 1480bi32_lowregclang -march=native -Os -fwrapv -Qunused-arguments -fPIC -fPIE -gdwarf-4 -Wall2026051420260330
1922836024 0 028175 1224 1576bi32gcc -march=native -mtune=native -O2 -fwrapv -fPIC -fPIE -gdwarf-4 -Wall2026051420260330
1922956024 0 029271 1224 1576bi32gcc -march=native -mtune=native -O3 -fwrapv -fPIC -fPIE -gdwarf-4 -Wall2026051420260330
2008221520 0 024636 1240 1480bi32_lowsizeclang -march=native -O3 -fwrapv -Qunused-arguments -fPIC -fPIE -gdwarf-4 -Wall2026051420260330
2008311520 0 023444 1240 1480bi32_lowsizeclang -march=native -O2 -fwrapv -Qunused-arguments -fPIC -fPIE -gdwarf-4 -Wall2026051420260330
2021551445 0 021470 1232 1480bi32_lowsizeclang -march=native -Os -fwrapv -Qunused-arguments -fPIC -fPIE -gdwarf-4 -Wall2026051420260330
2047773023 0 023708 1240 1480bi32_lowregclang -march=native -O -fwrapv -Qunused-arguments -fPIC -fPIE -gdwarf-4 -Wall2026051420260330
2087975855 0 028956 1240 1480bi32clang -mcpu=native -O3 -fwrapv -Qunused-arguments -fPIC -fPIE -gdwarf-4 -Wall2026051420260330
2097602779 0 022993 1200 1544bi32_lowreggcc -march=native -mtune=native -Os -fwrapv -fPIC -fPIE -gdwarf-4 -Wall2026051420260330
2172413550 0 025811 1224 1576bi32_lowreggcc -march=native -mtune=native -O2 -fwrapv -fPIC -fPIE -gdwarf-4 -Wall2026051420260330
2172473550 0 026907 1224 1576bi32_lowreggcc -march=native -mtune=native -O3 -fwrapv -fPIC -fPIE -gdwarf-4 -Wall2026051420260330
2226636316 0 027678 1216 1576bi32gcc -march=native -mtune=native -O -fwrapv -fPIC -fPIE -gdwarf-4 -Wall2026051420260330
2242361596 0 021753 1200 1544bi32_lowsizegcc -march=native -mtune=native -Os -fwrapv -fPIC -fPIE -gdwarf-4 -Wall2026051420260330
2282761483 0 022132 1240 1480bi32_lowsizeclang -march=native -O -fwrapv -Qunused-arguments -fPIC -fPIE -gdwarf-4 -Wall2026051420260330
2466641703 0 025011 1224 1576bi32_lowsizegcc -march=native -mtune=native -O3 -fwrapv -fPIC -fPIE -gdwarf-4 -Wall2026051420260330
2467351703 0 023915 1224 1576bi32_lowsizegcc -march=native -mtune=native -O2 -fwrapv -fPIC -fPIE -gdwarf-4 -Wall2026051420260330
2536883878 0 025354 1216 1576bi32_lowreggcc -march=native -mtune=native -O -fwrapv -fPIC -fPIE -gdwarf-4 -Wall2026051420260330
2538383005 0 026180 1240 1480bi32_lowregclang -mcpu=native -O3 -fwrapv -Qunused-arguments -fPIC -fPIE -gdwarf-4 -Wall2026051420260330
2768921919 0 023346 1216 1576bi32_lowsizegcc -march=native -mtune=native -O -fwrapv -fPIC -fPIE -gdwarf-4 -Wall2026051420260330
2783411511 0 024644 1240 1480bi32_lowsizeclang -mcpu=native -O3 -fwrapv -Qunused-arguments -fPIC -fPIE -gdwarf-4 -Wall2026051420260330
6004472508 0 024444 1240 1480opt8clang -march=native -O2 -fwrapv -Qunused-arguments -fPIC -fPIE -gdwarf-4 -Wall2026051420260330
6042592356 0 024268 1240 1480opt8_lowsizeclang -march=native -O2 -fwrapv -Qunused-arguments -fPIC -fPIE -gdwarf-4 -Wall2026051420260330
6523972423 0 022478 1232 1480opt8clang -march=native -Os -fwrapv -Qunused-arguments -fPIC -fPIE -gdwarf-4 -Wall2026051420260330
6554962378 0 022406 1232 1480opt8_lowsizeclang -march=native -Os -fwrapv -Qunused-arguments -fPIC -fPIE -gdwarf-4 -Wall2026051420260330
7814993353 0 023022 1232 1480bi8clang -march=native -Os -fwrapv -Qunused-arguments -fPIC -fPIE -gdwarf-4 -Wall2026051420260330
7820723802 0 026540 1240 1480bi8clang -march=native -O3 -fwrapv -Qunused-arguments -fPIC -fPIE -gdwarf-4 -Wall2026051420260330
7821313802 0 025348 1240 1480bi8clang -march=native -O2 -fwrapv -Qunused-arguments -fPIC -fPIE -gdwarf-4 -Wall2026051420260330
7964073481 0 023748 1240 1480bi8clang -march=native -O -fwrapv -Qunused-arguments -fPIC -fPIE -gdwarf-4 -Wall2026051420260330
8659533851 0 026620 1240 1480bi8clang -mcpu=native -O3 -fwrapv -Qunused-arguments -fPIC -fPIE -gdwarf-4 -Wall2026051420260330
8977484392 0 026163 1224 1576bi8gcc -march=native -mtune=native -O2 -fwrapv -fPIC -fPIE -gdwarf-4 -Wall2026051420260330
8979114360 0 027227 1224 1576bi8gcc -march=native -mtune=native -O3 -fwrapv -fPIC -fPIE -gdwarf-4 -Wall2026051420260330
9058804251 0 023985 1200 1544bi8gcc -march=native -mtune=native -Os -fwrapv -fPIC -fPIE -gdwarf-4 -Wall2026051420260330
9330223352 0 026452 1240 1480opt8clang -march=native -O3 -fwrapv -Qunused-arguments -fPIC -fPIE -gdwarf-4 -Wall2026051420260330
9486673631 0 026708 1240 1480opt8_lowsizeclang -march=native -O3 -fwrapv -Qunused-arguments -fPIC -fPIE -gdwarf-4 -Wall2026051420260330
10233652423 0 023068 1240 1480opt8_lowsizeclang -march=native -O -fwrapv -Qunused-arguments -fPIC -fPIE -gdwarf-4 -Wall2026051420260330
11019273970 0 027100 1240 1480opt8clang -mcpu=native -O3 -fwrapv -Qunused-arguments -fPIC -fPIE -gdwarf-4 -Wall2026051420260330
11152053861 0 026996 1240 1480opt8_lowsizeclang -mcpu=native -O3 -fwrapv -Qunused-arguments -fPIC -fPIE -gdwarf-4 -Wall2026051420260330
11239574999 0 025986 1216 1576bi8gcc -march=native -mtune=native -O -fwrapv -fPIC -fPIE -gdwarf-4 -Wall2026051420260330
11818084301 0 026587 1224 1576opt8gcc -march=native -mtune=native -O2 -fwrapv -fPIC -fPIE -gdwarf-4 -Wall2026051420260330
11828714034 0 026283 1224 1576opt8_lowsizegcc -march=native -mtune=native -O2 -fwrapv -fPIC -fPIE -gdwarf-4 -Wall2026051420260330
17583392761 0 023436 1240 1480opt8clang -march=native -O -fwrapv -Qunused-arguments -fPIC -fPIE -gdwarf-4 -Wall2026051420260330
18463595661 0 029027 1224 1576opt8gcc -march=native -mtune=native -O3 -fwrapv -fPIC -fPIE -gdwarf-4 -Wall2026051420260330
18549935136 0 028467 1224 1576opt8_lowsizegcc -march=native -mtune=native -O3 -fwrapv -fPIC -fPIE -gdwarf-4 -Wall2026051420260330
19615653836 0 024041 1200 1544opt8gcc -march=native -mtune=native -Os -fwrapv -fPIC -fPIE -gdwarf-4 -Wall2026051420260330
19622173828 0 024001 1200 1544opt8_lowsizegcc -march=native -mtune=native -Os -fwrapv -fPIC -fPIE -gdwarf-4 -Wall2026051420260330
20962494607 0 026090 1216 1576opt8gcc -march=native -mtune=native -O -fwrapv -fPIC -fPIE -gdwarf-4 -Wall2026051420260330
20970964520 0 025954 1216 1576opt8_lowsizegcc -march=native -mtune=native -O -fwrapv -fPIC -fPIE -gdwarf-4 -Wall2026051420260330

Compiler output


ascon.S: ascon.S:1:10: fatal error: 'xtensa/coreasm.h' file not found
ascon.S:     1 | #include <xtensa/coreasm.h>
ascon.S:       |          ^~~~~~~~~~~~~~~~~~
ascon.S: 1 error generated.

Number of similar (implementation,compiler) pairs: 5, namely:
ImplementationCompiler
T:asm_esp32clang -march=native -O2 -fwrapv -Qunused-arguments -fPIC -fPIE -gdwarf-4 -Wall (Ubuntu_Clang_18.1.3_(1ubuntu1))
T:asm_esp32clang -march=native -O3 -fwrapv -Qunused-arguments -fPIC -fPIE -gdwarf-4 -Wall (Ubuntu_Clang_18.1.3_(1ubuntu1))
T:asm_esp32clang -march=native -O -fwrapv -Qunused-arguments -fPIC -fPIE -gdwarf-4 -Wall (Ubuntu_Clang_18.1.3_(1ubuntu1))
T:asm_esp32clang -march=native -Os -fwrapv -Qunused-arguments -fPIC -fPIE -gdwarf-4 -Wall (Ubuntu_Clang_18.1.3_(1ubuntu1))
T:asm_esp32clang -mcpu=native -O3 -fwrapv -Qunused-arguments -fPIC -fPIE -gdwarf-4 -Wall (Ubuntu_Clang_18.1.3_(1ubuntu1))

Compiler output


ascon.S: ascon.S:1:10: fatal error: xtensa/coreasm.h: No such file or directory
ascon.S:     1 | #include <xtensa/coreasm.h>
ascon.S:       |          ^~~~~~~~~~~~~~~~~~
ascon.S: compilation terminated.

Number of similar (implementation,compiler) pairs: 4, namely:
ImplementationCompiler
T:asm_esp32gcc -march=native -mtune=native -O2 -fwrapv -fPIC -fPIE -gdwarf-4 -Wall (13.3.0)
T:asm_esp32gcc -march=native -mtune=native -O3 -fwrapv -fPIC -fPIE -gdwarf-4 -Wall (13.3.0)
T:asm_esp32gcc -march=native -mtune=native -O -fwrapv -fPIC -fPIE -gdwarf-4 -Wall (13.3.0)
T:asm_esp32gcc -march=native -mtune=native -Os -fwrapv -fPIC -fPIE -gdwarf-4 -Wall (13.3.0)

Compiler output


permutations.S: permutations.S:29:10: fatal error: 'avr/io.h' file not found
permutations.S: #include "avr/io.h"
permutations.S:          ^~~~~~~~~~
permutations.S: 1 error generated.

Number of similar (implementation,compiler) pairs: 10, namely:
ImplementationCompiler
avrclang -march=native -O2 -fwrapv -Qunused-arguments -fPIC -fPIE -gdwarf-4 -Wall (Ubuntu_Clang_18.1.3_(1ubuntu1))
avrclang -march=native -O3 -fwrapv -Qunused-arguments -fPIC -fPIE -gdwarf-4 -Wall (Ubuntu_Clang_18.1.3_(1ubuntu1))
avrclang -march=native -O -fwrapv -Qunused-arguments -fPIC -fPIE -gdwarf-4 -Wall (Ubuntu_Clang_18.1.3_(1ubuntu1))
avrclang -march=native -Os -fwrapv -Qunused-arguments -fPIC -fPIE -gdwarf-4 -Wall (Ubuntu_Clang_18.1.3_(1ubuntu1))
avrclang -mcpu=native -O3 -fwrapv -Qunused-arguments -fPIC -fPIE -gdwarf-4 -Wall (Ubuntu_Clang_18.1.3_(1ubuntu1))
avr_lowsizeclang -march=native -O2 -fwrapv -Qunused-arguments -fPIC -fPIE -gdwarf-4 -Wall (Ubuntu_Clang_18.1.3_(1ubuntu1))
avr_lowsizeclang -march=native -O3 -fwrapv -Qunused-arguments -fPIC -fPIE -gdwarf-4 -Wall (Ubuntu_Clang_18.1.3_(1ubuntu1))
avr_lowsizeclang -march=native -O -fwrapv -Qunused-arguments -fPIC -fPIE -gdwarf-4 -Wall (Ubuntu_Clang_18.1.3_(1ubuntu1))
avr_lowsizeclang -march=native -Os -fwrapv -Qunused-arguments -fPIC -fPIE -gdwarf-4 -Wall (Ubuntu_Clang_18.1.3_(1ubuntu1))
avr_lowsizeclang -mcpu=native -O3 -fwrapv -Qunused-arguments -fPIC -fPIE -gdwarf-4 -Wall (Ubuntu_Clang_18.1.3_(1ubuntu1))

Compiler output


hash.c: In file included from round.h:8,
hash.c:                  from permutations.h:11,
hash.c:                  from hash.c:4:
hash.c: word.h:61:11: warning: 'crypto_int64_bitmod_01' is static but used in inline function 'NOTZERO' which is not static
hash.c:    61 |   return (crypto_int64_bitmod_01(((int)(result & 0xff) - 1),8)) - 1;
hash.c:       |           ^~~~~~~~~~~~~~~~~~~~~~
permutations.S: permutations.S:29:10: fatal error: avr/io.h: No such file or directory
permutations.S:    29 | #include "avr/io.h"
permutations.S:       |          ^~~~~~~~~~
permutations.S: compilation terminated.

Number of similar (implementation,compiler) pairs: 4, namely:
ImplementationCompiler
avrgcc -march=native -mtune=native -O2 -fwrapv -fPIC -fPIE -gdwarf-4 -Wall (13.3.0)
avrgcc -march=native -mtune=native -O3 -fwrapv -fPIC -fPIE -gdwarf-4 -Wall (13.3.0)
avrgcc -march=native -mtune=native -O -fwrapv -fPIC -fPIE -gdwarf-4 -Wall (13.3.0)
avrgcc -march=native -mtune=native -Os -fwrapv -fPIC -fPIE -gdwarf-4 -Wall (13.3.0)

Compiler output


hash.c: In file included from round.h:8,
hash.c:                  from permutations.h:11,
hash.c:                  from hash.c:4:
hash.c: word.h:61:11: warning: 'crypto_int64_bitmod_01' is static but used in inline function 'NOTZERO' which is not static
hash.c:    61 |   return (crypto_int64_bitmod_01(((int)(result & 0xff) - 1),8)) - 1;
hash.c:       |           ^~~~~~~~~~~~~~~~~~~~~~
update.c: In file included from round.h:8,
update.c:                  from permutations.h:11,
update.c:                  from update.c:3:
update.c: word.h:61:11: warning: 'crypto_int64_bitmod_01' is static but used in inline function 'NOTZERO' which is not static
update.c:    61 |   return (crypto_int64_bitmod_01(((int)(result & 0xff) - 1),8)) - 1;
update.c:       |           ^~~~~~~~~~~~~~~~~~~~~~
permutations.S: permutations.S:29:10: fatal error: avr/io.h: No such file or directory
permutations.S:    29 | #include "avr/io.h"
permutations.S:       |          ^~~~~~~~~~
permutations.S: compilation terminated.

Number of similar (implementation,compiler) pairs: 4, namely:
ImplementationCompiler
avr_lowsizegcc -march=native -mtune=native -O2 -fwrapv -fPIC -fPIE -gdwarf-4 -Wall (13.3.0)
avr_lowsizegcc -march=native -mtune=native -O3 -fwrapv -fPIC -fPIE -gdwarf-4 -Wall (13.3.0)
avr_lowsizegcc -march=native -mtune=native -O -fwrapv -fPIC -fPIE -gdwarf-4 -Wall (13.3.0)
avr_lowsizegcc -march=native -mtune=native -Os -fwrapv -fPIC -fPIE -gdwarf-4 -Wall (13.3.0)

Compiler output


try.c: /usr/bin/ld: /tmp/try-small-6f8eba.o: in function `doit':
try.c: .../supercop-data/h2atom/amd64/try/c/clang_-march=native_-O2_-fwrapv_-Qunused-arguments_-fPIC_-fPIE_-gdwarf-4_-Wall/timingleaks/crypto_hash/asconhashv12/esp32/work/./try.c:76:(.text+0x...): undefined reference to `crypto_hash_asconhashv12_esp32_timingleaks'
try.c: /usr/bin/ld: /tmp/try-small-6f8eba.o: in function `test':
try.c: .../supercop-data/h2atom/amd64/try/c/clang_-march=native_-O2_-fwrapv_-Qunused-arguments_-fPIC_-fPIE_-gdwarf-4_-Wall/timingleaks/crypto_hash/asconhashv12/esp32/work/./try.c:90:(.text+0x...): undefined reference to `crypto_hash_asconhashv12_esp32_timingleaks'
try.c: /usr/bin/ld: .../supercop-data/h2atom/amd64/try/c/clang_-march=native_-O2_-fwrapv_-Qunused-arguments_-fPIC_-fPIE_-gdwarf-4_-Wall/timingleaks/crypto_hash/asconhashv12/esp32/work/./try.c:102:(.text+0x...): undefined reference to `crypto_hash_asconhashv12_esp32_timingleaks'
try.c: /usr/bin/ld: .../supercop-data/h2atom/amd64/try/c/clang_-march=native_-O2_-fwrapv_-Qunused-arguments_-fPIC_-fPIE_-gdwarf-4_-Wall/timingleaks/crypto_hash/asconhashv12/esp32/work/./try.c:112:(.text+0x...): undefined reference to `crypto_hash_asconhashv12_esp32_timingleaks'
try.c: clang: error: linker command failed with exit code 1 (use -v to see invocation)

Number of similar (implementation,compiler) pairs: 1, namely:
ImplementationCompiler
T:esp32clang -march=native -O2 -fwrapv -Qunused-arguments -fPIC -fPIE -gdwarf-4 -Wall (Ubuntu_Clang_18.1.3_(1ubuntu1))

Compiler output


try.c: /usr/bin/ld: /tmp/try-small-bee206.o: in function `doit':
try.c: .../supercop-data/h2atom/amd64/try/c/clang_-march=native_-O3_-fwrapv_-Qunused-arguments_-fPIC_-fPIE_-gdwarf-4_-Wall/timingleaks/crypto_hash/asconhashv12/esp32/work/./try.c:76:(.text+0x...): undefined reference to `crypto_hash_asconhashv12_esp32_timingleaks'
try.c: /usr/bin/ld: /tmp/try-small-bee206.o: in function `test':
try.c: .../supercop-data/h2atom/amd64/try/c/clang_-march=native_-O3_-fwrapv_-Qunused-arguments_-fPIC_-fPIE_-gdwarf-4_-Wall/timingleaks/crypto_hash/asconhashv12/esp32/work/./try.c:90:(.text+0x...): undefined reference to `crypto_hash_asconhashv12_esp32_timingleaks'
try.c: /usr/bin/ld: .../supercop-data/h2atom/amd64/try/c/clang_-march=native_-O3_-fwrapv_-Qunused-arguments_-fPIC_-fPIE_-gdwarf-4_-Wall/timingleaks/crypto_hash/asconhashv12/esp32/work/./try.c:102:(.text+0x...): undefined reference to `crypto_hash_asconhashv12_esp32_timingleaks'
try.c: /usr/bin/ld: .../supercop-data/h2atom/amd64/try/c/clang_-march=native_-O3_-fwrapv_-Qunused-arguments_-fPIC_-fPIE_-gdwarf-4_-Wall/timingleaks/crypto_hash/asconhashv12/esp32/work/./try.c:112:(.text+0x...): undefined reference to `crypto_hash_asconhashv12_esp32_timingleaks'
try.c: clang: error: linker command failed with exit code 1 (use -v to see invocation)

Number of similar (implementation,compiler) pairs: 1, namely:
ImplementationCompiler
T:esp32clang -march=native -O3 -fwrapv -Qunused-arguments -fPIC -fPIE -gdwarf-4 -Wall (Ubuntu_Clang_18.1.3_(1ubuntu1))

Compiler output


try.c: /usr/bin/ld: /tmp/try-small-563fbf.o: in function `doit':
try.c: .../supercop-data/h2atom/amd64/try/c/clang_-march=native_-O_-fwrapv_-Qunused-arguments_-fPIC_-fPIE_-gdwarf-4_-Wall/timingleaks/crypto_hash/asconhashv12/esp32/work/./try.c:76:(.text+0x...): undefined reference to `crypto_hash_asconhashv12_esp32_timingleaks'
try.c: /usr/bin/ld: /tmp/try-small-563fbf.o: in function `test':
try.c: .../supercop-data/h2atom/amd64/try/c/clang_-march=native_-O_-fwrapv_-Qunused-arguments_-fPIC_-fPIE_-gdwarf-4_-Wall/timingleaks/crypto_hash/asconhashv12/esp32/work/./try.c:90:(.text+0x...): undefined reference to `crypto_hash_asconhashv12_esp32_timingleaks'
try.c: /usr/bin/ld: .../supercop-data/h2atom/amd64/try/c/clang_-march=native_-O_-fwrapv_-Qunused-arguments_-fPIC_-fPIE_-gdwarf-4_-Wall/timingleaks/crypto_hash/asconhashv12/esp32/work/./try.c:102:(.text+0x...): undefined reference to `crypto_hash_asconhashv12_esp32_timingleaks'
try.c: /usr/bin/ld: .../supercop-data/h2atom/amd64/try/c/clang_-march=native_-O_-fwrapv_-Qunused-arguments_-fPIC_-fPIE_-gdwarf-4_-Wall/timingleaks/crypto_hash/asconhashv12/esp32/work/./try.c:112:(.text+0x...): undefined reference to `crypto_hash_asconhashv12_esp32_timingleaks'
try.c: clang: error: linker command failed with exit code 1 (use -v to see invocation)

Number of similar (implementation,compiler) pairs: 1, namely:
ImplementationCompiler
T:esp32clang -march=native -O -fwrapv -Qunused-arguments -fPIC -fPIE -gdwarf-4 -Wall (Ubuntu_Clang_18.1.3_(1ubuntu1))

Compiler output


try.c: /usr/bin/ld: /tmp/try-small-0f6d80.o: in function `doit':
try.c: .../supercop-data/h2atom/amd64/try/c/clang_-march=native_-Os_-fwrapv_-Qunused-arguments_-fPIC_-fPIE_-gdwarf-4_-Wall/timingleaks/crypto_hash/asconhashv12/esp32/work/./try.c:76:(.text+0x...): undefined reference to `crypto_hash_asconhashv12_esp32_timingleaks'
try.c: /usr/bin/ld: /tmp/try-small-0f6d80.o: in function `test':
try.c: .../supercop-data/h2atom/amd64/try/c/clang_-march=native_-Os_-fwrapv_-Qunused-arguments_-fPIC_-fPIE_-gdwarf-4_-Wall/timingleaks/crypto_hash/asconhashv12/esp32/work/./try.c:90:(.text+0x...): undefined reference to `crypto_hash_asconhashv12_esp32_timingleaks'
try.c: /usr/bin/ld: .../supercop-data/h2atom/amd64/try/c/clang_-march=native_-Os_-fwrapv_-Qunused-arguments_-fPIC_-fPIE_-gdwarf-4_-Wall/timingleaks/crypto_hash/asconhashv12/esp32/work/./try.c:102:(.text+0x...): undefined reference to `crypto_hash_asconhashv12_esp32_timingleaks'
try.c: /usr/bin/ld: .../supercop-data/h2atom/amd64/try/c/clang_-march=native_-Os_-fwrapv_-Qunused-arguments_-fPIC_-fPIE_-gdwarf-4_-Wall/timingleaks/crypto_hash/asconhashv12/esp32/work/./try.c:112:(.text+0x...): undefined reference to `crypto_hash_asconhashv12_esp32_timingleaks'
try.c: clang: error: linker command failed with exit code 1 (use -v to see invocation)

Number of similar (implementation,compiler) pairs: 1, namely:
ImplementationCompiler
T:esp32clang -march=native -Os -fwrapv -Qunused-arguments -fPIC -fPIE -gdwarf-4 -Wall (Ubuntu_Clang_18.1.3_(1ubuntu1))

Compiler output


try.c: /usr/bin/ld: /tmp/try-small-e75f39.o: in function `doit':
try.c: .../supercop-data/h2atom/amd64/try/c/clang_-mcpu=native_-O3_-fwrapv_-Qunused-arguments_-fPIC_-fPIE_-gdwarf-4_-Wall/timingleaks/crypto_hash/asconhashv12/esp32/work/./try.c:76:(.text+0x...): undefined reference to `crypto_hash_asconhashv12_esp32_timingleaks'
try.c: /usr/bin/ld: /tmp/try-small-e75f39.o: in function `test':
try.c: .../supercop-data/h2atom/amd64/try/c/clang_-mcpu=native_-O3_-fwrapv_-Qunused-arguments_-fPIC_-fPIE_-gdwarf-4_-Wall/timingleaks/crypto_hash/asconhashv12/esp32/work/./try.c:90:(.text+0x...): undefined reference to `crypto_hash_asconhashv12_esp32_timingleaks'
try.c: /usr/bin/ld: .../supercop-data/h2atom/amd64/try/c/clang_-mcpu=native_-O3_-fwrapv_-Qunused-arguments_-fPIC_-fPIE_-gdwarf-4_-Wall/timingleaks/crypto_hash/asconhashv12/esp32/work/./try.c:102:(.text+0x...): undefined reference to `crypto_hash_asconhashv12_esp32_timingleaks'
try.c: /usr/bin/ld: .../supercop-data/h2atom/amd64/try/c/clang_-mcpu=native_-O3_-fwrapv_-Qunused-arguments_-fPIC_-fPIE_-gdwarf-4_-Wall/timingleaks/crypto_hash/asconhashv12/esp32/work/./try.c:112:(.text+0x...): undefined reference to `crypto_hash_asconhashv12_esp32_timingleaks'
try.c: clang: error: linker command failed with exit code 1 (use -v to see invocation)

Number of similar (implementation,compiler) pairs: 1, namely:
ImplementationCompiler
T:esp32clang -mcpu=native -O3 -fwrapv -Qunused-arguments -fPIC -fPIE -gdwarf-4 -Wall (Ubuntu_Clang_18.1.3_(1ubuntu1))

Compiler output


try.c: /usr/bin/ld: /tmp/ccp99Ipv.o: in function `test':
try.c: .../supercop-data/h2atom/amd64/try/c/gcc_-march=native_-mtune=native_-O2_-fwrapv_-fPIC_-fPIE_-gdwarf-4_-Wall/timingleaks/crypto_hash/asconhashv12/esp32/work/try.c:112:(.text+0x...): undefined reference to `crypto_hash_asconhashv12_esp32_timingleaks'
try.c: /usr/bin/ld: .../supercop-data/h2atom/amd64/try/c/gcc_-march=native_-mtune=native_-O2_-fwrapv_-fPIC_-fPIE_-gdwarf-4_-Wall/timingleaks/crypto_hash/asconhashv12/esp32/work/try.c:90:(.text+0x...): undefined reference to `crypto_hash_asconhashv12_esp32_timingleaks'
try.c: /usr/bin/ld: .../supercop-data/h2atom/amd64/try/c/gcc_-march=native_-mtune=native_-O2_-fwrapv_-fPIC_-fPIE_-gdwarf-4_-Wall/timingleaks/crypto_hash/asconhashv12/esp32/work/try.c:102:(.text+0x...): undefined reference to `crypto_hash_asconhashv12_esp32_timingleaks'
try.c: /usr/bin/ld: /tmp/ccp99Ipv.o: in function `doit':
try.c: .../supercop-data/h2atom/amd64/try/c/gcc_-march=native_-mtune=native_-O2_-fwrapv_-fPIC_-fPIE_-gdwarf-4_-Wall/timingleaks/crypto_hash/asconhashv12/esp32/work/try.c:76:(.text+0x...): undefined reference to `crypto_hash_asconhashv12_esp32_timingleaks'
try.c: collect2: error: ld returned 1 exit status

Number of similar (implementation,compiler) pairs: 1, namely:
ImplementationCompiler
T:esp32gcc -march=native -mtune=native -O2 -fwrapv -fPIC -fPIE -gdwarf-4 -Wall (13.3.0)

Compiler output


try.c: /usr/bin/ld: /tmp/ccbBGcMP.o: in function `test':
try.c: .../supercop-data/h2atom/amd64/try/c/gcc_-march=native_-mtune=native_-O3_-fwrapv_-fPIC_-fPIE_-gdwarf-4_-Wall/timingleaks/crypto_hash/asconhashv12/esp32/work/try.c:112:(.text+0x...): undefined reference to `crypto_hash_asconhashv12_esp32_timingleaks'
try.c: /usr/bin/ld: .../supercop-data/h2atom/amd64/try/c/gcc_-march=native_-mtune=native_-O3_-fwrapv_-fPIC_-fPIE_-gdwarf-4_-Wall/timingleaks/crypto_hash/asconhashv12/esp32/work/try.c:90:(.text+0x...): undefined reference to `crypto_hash_asconhashv12_esp32_timingleaks'
try.c: /usr/bin/ld: .../supercop-data/h2atom/amd64/try/c/gcc_-march=native_-mtune=native_-O3_-fwrapv_-fPIC_-fPIE_-gdwarf-4_-Wall/timingleaks/crypto_hash/asconhashv12/esp32/work/try.c:102:(.text+0x...): undefined reference to `crypto_hash_asconhashv12_esp32_timingleaks'
try.c: /usr/bin/ld: /tmp/ccbBGcMP.o: in function `doit':
try.c: .../supercop-data/h2atom/amd64/try/c/gcc_-march=native_-mtune=native_-O3_-fwrapv_-fPIC_-fPIE_-gdwarf-4_-Wall/timingleaks/crypto_hash/asconhashv12/esp32/work/try.c:76:(.text+0x...): undefined reference to `crypto_hash_asconhashv12_esp32_timingleaks'
try.c: collect2: error: ld returned 1 exit status

Number of similar (implementation,compiler) pairs: 1, namely:
ImplementationCompiler
T:esp32gcc -march=native -mtune=native -O3 -fwrapv -fPIC -fPIE -gdwarf-4 -Wall (13.3.0)

Compiler output


try.c: /usr/bin/ld: /tmp/ccD7nHMz.o: in function `doit':
try.c: .../supercop-data/h2atom/amd64/try/c/gcc_-march=native_-mtune=native_-O_-fwrapv_-fPIC_-fPIE_-gdwarf-4_-Wall/timingleaks/crypto_hash/asconhashv12/esp32/work/try.c:76:(.text+0x...): undefined reference to `crypto_hash_asconhashv12_esp32_timingleaks'
try.c: /usr/bin/ld: /tmp/ccD7nHMz.o: in function `test':
try.c: .../supercop-data/h2atom/amd64/try/c/gcc_-march=native_-mtune=native_-O_-fwrapv_-fPIC_-fPIE_-gdwarf-4_-Wall/timingleaks/crypto_hash/asconhashv12/esp32/work/try.c:90:(.text+0x...): undefined reference to `crypto_hash_asconhashv12_esp32_timingleaks'
try.c: /usr/bin/ld: .../supercop-data/h2atom/amd64/try/c/gcc_-march=native_-mtune=native_-O_-fwrapv_-fPIC_-fPIE_-gdwarf-4_-Wall/timingleaks/crypto_hash/asconhashv12/esp32/work/try.c:102:(.text+0x...): undefined reference to `crypto_hash_asconhashv12_esp32_timingleaks'
try.c: /usr/bin/ld: .../supercop-data/h2atom/amd64/try/c/gcc_-march=native_-mtune=native_-O_-fwrapv_-fPIC_-fPIE_-gdwarf-4_-Wall/timingleaks/crypto_hash/asconhashv12/esp32/work/try.c:112:(.text+0x...): undefined reference to `crypto_hash_asconhashv12_esp32_timingleaks'
try.c: collect2: error: ld returned 1 exit status

Number of similar (implementation,compiler) pairs: 1, namely:
ImplementationCompiler
T:esp32gcc -march=native -mtune=native -O -fwrapv -fPIC -fPIE -gdwarf-4 -Wall (13.3.0)

Compiler output


try.c: /usr/bin/ld: /tmp/cctfX80a.o: in function `test':
try.c: .../supercop-data/h2atom/amd64/try/c/gcc_-march=native_-mtune=native_-Os_-fwrapv_-fPIC_-fPIE_-gdwarf-4_-Wall/timingleaks/crypto_hash/asconhashv12/esp32/work/try.c:90:(.text+0x...): undefined reference to `crypto_hash_asconhashv12_esp32_timingleaks'
try.c: /usr/bin/ld: .../supercop-data/h2atom/amd64/try/c/gcc_-march=native_-mtune=native_-Os_-fwrapv_-fPIC_-fPIE_-gdwarf-4_-Wall/timingleaks/crypto_hash/asconhashv12/esp32/work/try.c:102:(.text+0x...): undefined reference to `crypto_hash_asconhashv12_esp32_timingleaks'
try.c: /usr/bin/ld: .../supercop-data/h2atom/amd64/try/c/gcc_-march=native_-mtune=native_-Os_-fwrapv_-fPIC_-fPIE_-gdwarf-4_-Wall/timingleaks/crypto_hash/asconhashv12/esp32/work/try.c:112:(.text+0x...): undefined reference to `crypto_hash_asconhashv12_esp32_timingleaks'
try.c: /usr/bin/ld: /tmp/cctfX80a.o: in function `doit':
try.c: .../supercop-data/h2atom/amd64/try/c/gcc_-march=native_-mtune=native_-Os_-fwrapv_-fPIC_-fPIE_-gdwarf-4_-Wall/timingleaks/crypto_hash/asconhashv12/esp32/work/try.c:76:(.text+0x...): undefined reference to `crypto_hash_asconhashv12_esp32_timingleaks'
try.c: collect2: error: ld returned 1 exit status

Number of similar (implementation,compiler) pairs: 1, namely:
ImplementationCompiler
T:esp32gcc -march=native -mtune=native -Os -fwrapv -fPIC -fPIE -gdwarf-4 -Wall (13.3.0)

Namespace violations


constants.o constants R
interleave.o B R
permutations.o P12 T

Number of similar (implementation,compiler) pairs: 9, namely:
ImplementationCompiler
bi32clang -march=native -O2 -fwrapv -Qunused-arguments -fPIC -fPIE -gdwarf-4 -Wall (Ubuntu_Clang_18.1.3_(1ubuntu1))
bi32clang -march=native -O3 -fwrapv -Qunused-arguments -fPIC -fPIE -gdwarf-4 -Wall (Ubuntu_Clang_18.1.3_(1ubuntu1))
bi32clang -march=native -O -fwrapv -Qunused-arguments -fPIC -fPIE -gdwarf-4 -Wall (Ubuntu_Clang_18.1.3_(1ubuntu1))
bi32clang -march=native -Os -fwrapv -Qunused-arguments -fPIC -fPIE -gdwarf-4 -Wall (Ubuntu_Clang_18.1.3_(1ubuntu1))
bi32clang -mcpu=native -O3 -fwrapv -Qunused-arguments -fPIC -fPIE -gdwarf-4 -Wall (Ubuntu_Clang_18.1.3_(1ubuntu1))
bi32gcc -march=native -mtune=native -O2 -fwrapv -fPIC -fPIE -gdwarf-4 -Wall (13.3.0)
bi32gcc -march=native -mtune=native -O3 -fwrapv -fPIC -fPIE -gdwarf-4 -Wall (13.3.0)
bi32gcc -march=native -mtune=native -O -fwrapv -fPIC -fPIE -gdwarf-4 -Wall (13.3.0)
bi32gcc -march=native -mtune=native -Os -fwrapv -fPIC -fPIE -gdwarf-4 -Wall (13.3.0)

Namespace violations


constants.o constants R
hash.o ascon_absorb T
hash.o ascon_inithash T
hash.o ascon_squeeze T
interleave.o B R

Number of similar (implementation,compiler) pairs: 9, namely:
ImplementationCompiler
bi32_lowregclang -march=native -O2 -fwrapv -Qunused-arguments -fPIC -fPIE -gdwarf-4 -Wall (Ubuntu_Clang_18.1.3_(1ubuntu1))
bi32_lowregclang -march=native -O3 -fwrapv -Qunused-arguments -fPIC -fPIE -gdwarf-4 -Wall (Ubuntu_Clang_18.1.3_(1ubuntu1))
bi32_lowregclang -march=native -O -fwrapv -Qunused-arguments -fPIC -fPIE -gdwarf-4 -Wall (Ubuntu_Clang_18.1.3_(1ubuntu1))
bi32_lowregclang -march=native -Os -fwrapv -Qunused-arguments -fPIC -fPIE -gdwarf-4 -Wall (Ubuntu_Clang_18.1.3_(1ubuntu1))
bi32_lowregclang -mcpu=native -O3 -fwrapv -Qunused-arguments -fPIC -fPIE -gdwarf-4 -Wall (Ubuntu_Clang_18.1.3_(1ubuntu1))
bi32_lowreggcc -march=native -mtune=native -O2 -fwrapv -fPIC -fPIE -gdwarf-4 -Wall (13.3.0)
bi32_lowreggcc -march=native -mtune=native -O3 -fwrapv -fPIC -fPIE -gdwarf-4 -Wall (13.3.0)
bi32_lowreggcc -march=native -mtune=native -O -fwrapv -fPIC -fPIE -gdwarf-4 -Wall (13.3.0)
bi32_lowreggcc -march=native -mtune=native -Os -fwrapv -fPIC -fPIE -gdwarf-4 -Wall (13.3.0)

Namespace violations


constants.o constants R
interleave.o B R
interleave.o FROMBI T
interleave.o TOBI T
permutations.o P T

Number of similar (implementation,compiler) pairs: 9, namely:
ImplementationCompiler
bi32_lowsizeclang -march=native -O2 -fwrapv -Qunused-arguments -fPIC -fPIE -gdwarf-4 -Wall (Ubuntu_Clang_18.1.3_(1ubuntu1))
bi32_lowsizeclang -march=native -O3 -fwrapv -Qunused-arguments -fPIC -fPIE -gdwarf-4 -Wall (Ubuntu_Clang_18.1.3_(1ubuntu1))
bi32_lowsizeclang -march=native -O -fwrapv -Qunused-arguments -fPIC -fPIE -gdwarf-4 -Wall (Ubuntu_Clang_18.1.3_(1ubuntu1))
bi32_lowsizeclang -march=native -Os -fwrapv -Qunused-arguments -fPIC -fPIE -gdwarf-4 -Wall (Ubuntu_Clang_18.1.3_(1ubuntu1))
bi32_lowsizeclang -mcpu=native -O3 -fwrapv -Qunused-arguments -fPIC -fPIE -gdwarf-4 -Wall (Ubuntu_Clang_18.1.3_(1ubuntu1))
bi32_lowsizegcc -march=native -mtune=native -O2 -fwrapv -fPIC -fPIE -gdwarf-4 -Wall (13.3.0)
bi32_lowsizegcc -march=native -mtune=native -O3 -fwrapv -fPIC -fPIE -gdwarf-4 -Wall (13.3.0)
bi32_lowsizegcc -march=native -mtune=native -O -fwrapv -fPIC -fPIE -gdwarf-4 -Wall (13.3.0)
bi32_lowsizegcc -march=native -mtune=native -Os -fwrapv -fPIC -fPIE -gdwarf-4 -Wall (13.3.0)

Namespace violations


constants.o constants R
interleave.o FROMBI T
interleave.o TOBI T
permutations.o P T

Number of similar (implementation,compiler) pairs: 9, namely:
ImplementationCompiler
bi8clang -march=native -O2 -fwrapv -Qunused-arguments -fPIC -fPIE -gdwarf-4 -Wall (Ubuntu_Clang_18.1.3_(1ubuntu1))
bi8clang -march=native -O3 -fwrapv -Qunused-arguments -fPIC -fPIE -gdwarf-4 -Wall (Ubuntu_Clang_18.1.3_(1ubuntu1))
bi8clang -march=native -O -fwrapv -Qunused-arguments -fPIC -fPIE -gdwarf-4 -Wall (Ubuntu_Clang_18.1.3_(1ubuntu1))
bi8clang -march=native -Os -fwrapv -Qunused-arguments -fPIC -fPIE -gdwarf-4 -Wall (Ubuntu_Clang_18.1.3_(1ubuntu1))
bi8clang -mcpu=native -O3 -fwrapv -Qunused-arguments -fPIC -fPIE -gdwarf-4 -Wall (Ubuntu_Clang_18.1.3_(1ubuntu1))
bi8gcc -march=native -mtune=native -O2 -fwrapv -fPIC -fPIE -gdwarf-4 -Wall (13.3.0)
bi8gcc -march=native -mtune=native -O3 -fwrapv -fPIC -fPIE -gdwarf-4 -Wall (13.3.0)
bi8gcc -march=native -mtune=native -O -fwrapv -fPIC -fPIE -gdwarf-4 -Wall (13.3.0)
bi8gcc -march=native -mtune=native -Os -fwrapv -fPIC -fPIE -gdwarf-4 -Wall (13.3.0)

Namespace violations


permutations.o P T

Number of similar (implementation,compiler) pairs: 18, namely:
ImplementationCompiler
opt32_lowsizeclang -march=native -O2 -fwrapv -Qunused-arguments -fPIC -fPIE -gdwarf-4 -Wall (Ubuntu_Clang_18.1.3_(1ubuntu1))
opt32_lowsizeclang -march=native -O3 -fwrapv -Qunused-arguments -fPIC -fPIE -gdwarf-4 -Wall (Ubuntu_Clang_18.1.3_(1ubuntu1))
opt32_lowsizeclang -march=native -O -fwrapv -Qunused-arguments -fPIC -fPIE -gdwarf-4 -Wall (Ubuntu_Clang_18.1.3_(1ubuntu1))
opt32_lowsizeclang -march=native -Os -fwrapv -Qunused-arguments -fPIC -fPIE -gdwarf-4 -Wall (Ubuntu_Clang_18.1.3_(1ubuntu1))
opt32_lowsizeclang -mcpu=native -O3 -fwrapv -Qunused-arguments -fPIC -fPIE -gdwarf-4 -Wall (Ubuntu_Clang_18.1.3_(1ubuntu1))
opt32_lowsizegcc -march=native -mtune=native -O2 -fwrapv -fPIC -fPIE -gdwarf-4 -Wall (13.3.0)
opt32_lowsizegcc -march=native -mtune=native -O3 -fwrapv -fPIC -fPIE -gdwarf-4 -Wall (13.3.0)
opt32_lowsizegcc -march=native -mtune=native -O -fwrapv -fPIC -fPIE -gdwarf-4 -Wall (13.3.0)
opt32_lowsizegcc -march=native -mtune=native -Os -fwrapv -fPIC -fPIE -gdwarf-4 -Wall (13.3.0)
opt64_lowsizeclang -march=native -O2 -fwrapv -Qunused-arguments -fPIC -fPIE -gdwarf-4 -Wall (Ubuntu_Clang_18.1.3_(1ubuntu1))
opt64_lowsizeclang -march=native -O3 -fwrapv -Qunused-arguments -fPIC -fPIE -gdwarf-4 -Wall (Ubuntu_Clang_18.1.3_(1ubuntu1))
opt64_lowsizeclang -march=native -O -fwrapv -Qunused-arguments -fPIC -fPIE -gdwarf-4 -Wall (Ubuntu_Clang_18.1.3_(1ubuntu1))
opt64_lowsizeclang -march=native -Os -fwrapv -Qunused-arguments -fPIC -fPIE -gdwarf-4 -Wall (Ubuntu_Clang_18.1.3_(1ubuntu1))
opt64_lowsizeclang -mcpu=native -O3 -fwrapv -Qunused-arguments -fPIC -fPIE -gdwarf-4 -Wall (Ubuntu_Clang_18.1.3_(1ubuntu1))
opt64_lowsizegcc -march=native -mtune=native -O2 -fwrapv -fPIC -fPIE -gdwarf-4 -Wall (13.3.0)
opt64_lowsizegcc -march=native -mtune=native -O3 -fwrapv -fPIC -fPIE -gdwarf-4 -Wall (13.3.0)
opt64_lowsizegcc -march=native -mtune=native -O -fwrapv -fPIC -fPIE -gdwarf-4 -Wall (13.3.0)
opt64_lowsizegcc -march=native -mtune=native -Os -fwrapv -fPIC -fPIE -gdwarf-4 -Wall (13.3.0)

Namespace violations


hash.o ascon_absorb T
hash.o ascon_inithash T
hash.o ascon_squeeze T
permutations.o P T

Number of similar (implementation,compiler) pairs: 9, namely:
ImplementationCompiler
opt8clang -march=native -O2 -fwrapv -Qunused-arguments -fPIC -fPIE -gdwarf-4 -Wall (Ubuntu_Clang_18.1.3_(1ubuntu1))
opt8clang -march=native -O3 -fwrapv -Qunused-arguments -fPIC -fPIE -gdwarf-4 -Wall (Ubuntu_Clang_18.1.3_(1ubuntu1))
opt8clang -march=native -O -fwrapv -Qunused-arguments -fPIC -fPIE -gdwarf-4 -Wall (Ubuntu_Clang_18.1.3_(1ubuntu1))
opt8clang -march=native -Os -fwrapv -Qunused-arguments -fPIC -fPIE -gdwarf-4 -Wall (Ubuntu_Clang_18.1.3_(1ubuntu1))
opt8clang -mcpu=native -O3 -fwrapv -Qunused-arguments -fPIC -fPIE -gdwarf-4 -Wall (Ubuntu_Clang_18.1.3_(1ubuntu1))
opt8gcc -march=native -mtune=native -O2 -fwrapv -fPIC -fPIE -gdwarf-4 -Wall (13.3.0)
opt8gcc -march=native -mtune=native -O3 -fwrapv -fPIC -fPIE -gdwarf-4 -Wall (13.3.0)
opt8gcc -march=native -mtune=native -O -fwrapv -fPIC -fPIE -gdwarf-4 -Wall (13.3.0)
opt8gcc -march=native -mtune=native -Os -fwrapv -fPIC -fPIE -gdwarf-4 -Wall (13.3.0)

Namespace violations


permutations.o P T
update.o ascon_update T

Number of similar (implementation,compiler) pairs: 9, namely:
ImplementationCompiler
opt8_lowsizeclang -march=native -O2 -fwrapv -Qunused-arguments -fPIC -fPIE -gdwarf-4 -Wall (Ubuntu_Clang_18.1.3_(1ubuntu1))
opt8_lowsizeclang -march=native -O3 -fwrapv -Qunused-arguments -fPIC -fPIE -gdwarf-4 -Wall (Ubuntu_Clang_18.1.3_(1ubuntu1))
opt8_lowsizeclang -march=native -O -fwrapv -Qunused-arguments -fPIC -fPIE -gdwarf-4 -Wall (Ubuntu_Clang_18.1.3_(1ubuntu1))
opt8_lowsizeclang -march=native -Os -fwrapv -Qunused-arguments -fPIC -fPIE -gdwarf-4 -Wall (Ubuntu_Clang_18.1.3_(1ubuntu1))
opt8_lowsizeclang -mcpu=native -O3 -fwrapv -Qunused-arguments -fPIC -fPIE -gdwarf-4 -Wall (Ubuntu_Clang_18.1.3_(1ubuntu1))
opt8_lowsizegcc -march=native -mtune=native -O2 -fwrapv -fPIC -fPIE -gdwarf-4 -Wall (13.3.0)
opt8_lowsizegcc -march=native -mtune=native -O3 -fwrapv -fPIC -fPIE -gdwarf-4 -Wall (13.3.0)
opt8_lowsizegcc -march=native -mtune=native -O -fwrapv -fPIC -fPIE -gdwarf-4 -Wall (13.3.0)
opt8_lowsizegcc -march=native -mtune=native -Os -fwrapv -fPIC -fPIE -gdwarf-4 -Wall (13.3.0)

Passed TIMECOP


TIMECOP iterations: 10

Number of similar (implementation,compiler) pairs: 99, namely:
ImplementationCompiler
bi32clang -march=native -O2 -fwrapv -Qunused-arguments -fPIC -fPIE -gdwarf-4 -Wall (Ubuntu_Clang_18.1.3_(1ubuntu1))
bi32clang -march=native -O3 -fwrapv -Qunused-arguments -fPIC -fPIE -gdwarf-4 -Wall (Ubuntu_Clang_18.1.3_(1ubuntu1))
bi32clang -march=native -O -fwrapv -Qunused-arguments -fPIC -fPIE -gdwarf-4 -Wall (Ubuntu_Clang_18.1.3_(1ubuntu1))
bi32clang -march=native -Os -fwrapv -Qunused-arguments -fPIC -fPIE -gdwarf-4 -Wall (Ubuntu_Clang_18.1.3_(1ubuntu1))
bi32clang -mcpu=native -O3 -fwrapv -Qunused-arguments -fPIC -fPIE -gdwarf-4 -Wall (Ubuntu_Clang_18.1.3_(1ubuntu1))
bi32gcc -march=native -mtune=native -O2 -fwrapv -fPIC -fPIE -gdwarf-4 -Wall (13.3.0)
bi32gcc -march=native -mtune=native -O3 -fwrapv -fPIC -fPIE -gdwarf-4 -Wall (13.3.0)
bi32gcc -march=native -mtune=native -O -fwrapv -fPIC -fPIE -gdwarf-4 -Wall (13.3.0)
bi32gcc -march=native -mtune=native -Os -fwrapv -fPIC -fPIE -gdwarf-4 -Wall (13.3.0)
bi32_lowregclang -march=native -O2 -fwrapv -Qunused-arguments -fPIC -fPIE -gdwarf-4 -Wall (Ubuntu_Clang_18.1.3_(1ubuntu1))
bi32_lowregclang -march=native -O3 -fwrapv -Qunused-arguments -fPIC -fPIE -gdwarf-4 -Wall (Ubuntu_Clang_18.1.3_(1ubuntu1))
bi32_lowregclang -march=native -O -fwrapv -Qunused-arguments -fPIC -fPIE -gdwarf-4 -Wall (Ubuntu_Clang_18.1.3_(1ubuntu1))
bi32_lowregclang -march=native -Os -fwrapv -Qunused-arguments -fPIC -fPIE -gdwarf-4 -Wall (Ubuntu_Clang_18.1.3_(1ubuntu1))
bi32_lowregclang -mcpu=native -O3 -fwrapv -Qunused-arguments -fPIC -fPIE -gdwarf-4 -Wall (Ubuntu_Clang_18.1.3_(1ubuntu1))
bi32_lowreggcc -march=native -mtune=native -O2 -fwrapv -fPIC -fPIE -gdwarf-4 -Wall (13.3.0)
bi32_lowreggcc -march=native -mtune=native -O3 -fwrapv -fPIC -fPIE -gdwarf-4 -Wall (13.3.0)
bi32_lowreggcc -march=native -mtune=native -O -fwrapv -fPIC -fPIE -gdwarf-4 -Wall (13.3.0)
bi32_lowreggcc -march=native -mtune=native -Os -fwrapv -fPIC -fPIE -gdwarf-4 -Wall (13.3.0)
bi32_lowsizeclang -march=native -O2 -fwrapv -Qunused-arguments -fPIC -fPIE -gdwarf-4 -Wall (Ubuntu_Clang_18.1.3_(1ubuntu1))
bi32_lowsizeclang -march=native -O3 -fwrapv -Qunused-arguments -fPIC -fPIE -gdwarf-4 -Wall (Ubuntu_Clang_18.1.3_(1ubuntu1))
bi32_lowsizeclang -march=native -O -fwrapv -Qunused-arguments -fPIC -fPIE -gdwarf-4 -Wall (Ubuntu_Clang_18.1.3_(1ubuntu1))
bi32_lowsizeclang -march=native -Os -fwrapv -Qunused-arguments -fPIC -fPIE -gdwarf-4 -Wall (Ubuntu_Clang_18.1.3_(1ubuntu1))
bi32_lowsizeclang -mcpu=native -O3 -fwrapv -Qunused-arguments -fPIC -fPIE -gdwarf-4 -Wall (Ubuntu_Clang_18.1.3_(1ubuntu1))
bi32_lowsizegcc -march=native -mtune=native -O2 -fwrapv -fPIC -fPIE -gdwarf-4 -Wall (13.3.0)
bi32_lowsizegcc -march=native -mtune=native -O3 -fwrapv -fPIC -fPIE -gdwarf-4 -Wall (13.3.0)
bi32_lowsizegcc -march=native -mtune=native -O -fwrapv -fPIC -fPIE -gdwarf-4 -Wall (13.3.0)
bi32_lowsizegcc -march=native -mtune=native -Os -fwrapv -fPIC -fPIE -gdwarf-4 -Wall (13.3.0)
bi8clang -march=native -O2 -fwrapv -Qunused-arguments -fPIC -fPIE -gdwarf-4 -Wall (Ubuntu_Clang_18.1.3_(1ubuntu1))
bi8clang -march=native -O3 -fwrapv -Qunused-arguments -fPIC -fPIE -gdwarf-4 -Wall (Ubuntu_Clang_18.1.3_(1ubuntu1))
bi8clang -march=native -O -fwrapv -Qunused-arguments -fPIC -fPIE -gdwarf-4 -Wall (Ubuntu_Clang_18.1.3_(1ubuntu1))
bi8clang -march=native -Os -fwrapv -Qunused-arguments -fPIC -fPIE -gdwarf-4 -Wall (Ubuntu_Clang_18.1.3_(1ubuntu1))
bi8clang -mcpu=native -O3 -fwrapv -Qunused-arguments -fPIC -fPIE -gdwarf-4 -Wall (Ubuntu_Clang_18.1.3_(1ubuntu1))
bi8gcc -march=native -mtune=native -O2 -fwrapv -fPIC -fPIE -gdwarf-4 -Wall (13.3.0)
bi8gcc -march=native -mtune=native -O3 -fwrapv -fPIC -fPIE -gdwarf-4 -Wall (13.3.0)
bi8gcc -march=native -mtune=native -O -fwrapv -fPIC -fPIE -gdwarf-4 -Wall (13.3.0)
bi8gcc -march=native -mtune=native -Os -fwrapv -fPIC -fPIE -gdwarf-4 -Wall (13.3.0)
opt32clang -march=native -O2 -fwrapv -Qunused-arguments -fPIC -fPIE -gdwarf-4 -Wall (Ubuntu_Clang_18.1.3_(1ubuntu1))
opt32clang -march=native -O3 -fwrapv -Qunused-arguments -fPIC -fPIE -gdwarf-4 -Wall (Ubuntu_Clang_18.1.3_(1ubuntu1))
opt32clang -march=native -O -fwrapv -Qunused-arguments -fPIC -fPIE -gdwarf-4 -Wall (Ubuntu_Clang_18.1.3_(1ubuntu1))
opt32clang -march=native -Os -fwrapv -Qunused-arguments -fPIC -fPIE -gdwarf-4 -Wall (Ubuntu_Clang_18.1.3_(1ubuntu1))
opt32clang -mcpu=native -O3 -fwrapv -Qunused-arguments -fPIC -fPIE -gdwarf-4 -Wall (Ubuntu_Clang_18.1.3_(1ubuntu1))
opt32gcc -march=native -mtune=native -O2 -fwrapv -fPIC -fPIE -gdwarf-4 -Wall (13.3.0)
opt32gcc -march=native -mtune=native -O3 -fwrapv -fPIC -fPIE -gdwarf-4 -Wall (13.3.0)
opt32gcc -march=native -mtune=native -O -fwrapv -fPIC -fPIE -gdwarf-4 -Wall (13.3.0)
opt32gcc -march=native -mtune=native -Os -fwrapv -fPIC -fPIE -gdwarf-4 -Wall (13.3.0)
opt32_lowsizeclang -march=native -O2 -fwrapv -Qunused-arguments -fPIC -fPIE -gdwarf-4 -Wall (Ubuntu_Clang_18.1.3_(1ubuntu1))
opt32_lowsizeclang -march=native -O3 -fwrapv -Qunused-arguments -fPIC -fPIE -gdwarf-4 -Wall (Ubuntu_Clang_18.1.3_(1ubuntu1))
opt32_lowsizeclang -march=native -O -fwrapv -Qunused-arguments -fPIC -fPIE -gdwarf-4 -Wall (Ubuntu_Clang_18.1.3_(1ubuntu1))
opt32_lowsizeclang -march=native -Os -fwrapv -Qunused-arguments -fPIC -fPIE -gdwarf-4 -Wall (Ubuntu_Clang_18.1.3_(1ubuntu1))
opt32_lowsizeclang -mcpu=native -O3 -fwrapv -Qunused-arguments -fPIC -fPIE -gdwarf-4 -Wall (Ubuntu_Clang_18.1.3_(1ubuntu1))
opt32_lowsizegcc -march=native -mtune=native -O2 -fwrapv -fPIC -fPIE -gdwarf-4 -Wall (13.3.0)
opt32_lowsizegcc -march=native -mtune=native -O3 -fwrapv -fPIC -fPIE -gdwarf-4 -Wall (13.3.0)
opt32_lowsizegcc -march=native -mtune=native -O -fwrapv -fPIC -fPIE -gdwarf-4 -Wall (13.3.0)
opt32_lowsizegcc -march=native -mtune=native -Os -fwrapv -fPIC -fPIE -gdwarf-4 -Wall (13.3.0)
opt64clang -march=native -O2 -fwrapv -Qunused-arguments -fPIC -fPIE -gdwarf-4 -Wall (Ubuntu_Clang_18.1.3_(1ubuntu1))
opt64clang -march=native -O3 -fwrapv -Qunused-arguments -fPIC -fPIE -gdwarf-4 -Wall (Ubuntu_Clang_18.1.3_(1ubuntu1))
opt64clang -march=native -O -fwrapv -Qunused-arguments -fPIC -fPIE -gdwarf-4 -Wall (Ubuntu_Clang_18.1.3_(1ubuntu1))
opt64clang -march=native -Os -fwrapv -Qunused-arguments -fPIC -fPIE -gdwarf-4 -Wall (Ubuntu_Clang_18.1.3_(1ubuntu1))
opt64clang -mcpu=native -O3 -fwrapv -Qunused-arguments -fPIC -fPIE -gdwarf-4 -Wall (Ubuntu_Clang_18.1.3_(1ubuntu1))
opt64gcc -march=native -mtune=native -O2 -fwrapv -fPIC -fPIE -gdwarf-4 -Wall (13.3.0)
opt64gcc -march=native -mtune=native -O3 -fwrapv -fPIC -fPIE -gdwarf-4 -Wall (13.3.0)
opt64gcc -march=native -mtune=native -O -fwrapv -fPIC -fPIE -gdwarf-4 -Wall (13.3.0)
opt64gcc -march=native -mtune=native -Os -fwrapv -fPIC -fPIE -gdwarf-4 -Wall (13.3.0)
opt64_lowsizeclang -march=native -O2 -fwrapv -Qunused-arguments -fPIC -fPIE -gdwarf-4 -Wall (Ubuntu_Clang_18.1.3_(1ubuntu1))
opt64_lowsizeclang -march=native -O3 -fwrapv -Qunused-arguments -fPIC -fPIE -gdwarf-4 -Wall (Ubuntu_Clang_18.1.3_(1ubuntu1))
opt64_lowsizeclang -march=native -O -fwrapv -Qunused-arguments -fPIC -fPIE -gdwarf-4 -Wall (Ubuntu_Clang_18.1.3_(1ubuntu1))
opt64_lowsizeclang -march=native -Os -fwrapv -Qunused-arguments -fPIC -fPIE -gdwarf-4 -Wall (Ubuntu_Clang_18.1.3_(1ubuntu1))
opt64_lowsizeclang -mcpu=native -O3 -fwrapv -Qunused-arguments -fPIC -fPIE -gdwarf-4 -Wall (Ubuntu_Clang_18.1.3_(1ubuntu1))
opt64_lowsizegcc -march=native -mtune=native -O2 -fwrapv -fPIC -fPIE -gdwarf-4 -Wall (13.3.0)
opt64_lowsizegcc -march=native -mtune=native -O3 -fwrapv -fPIC -fPIE -gdwarf-4 -Wall (13.3.0)
opt64_lowsizegcc -march=native -mtune=native -O -fwrapv -fPIC -fPIE -gdwarf-4 -Wall (13.3.0)
opt64_lowsizegcc -march=native -mtune=native -Os -fwrapv -fPIC -fPIE -gdwarf-4 -Wall (13.3.0)
opt8clang -march=native -O2 -fwrapv -Qunused-arguments -fPIC -fPIE -gdwarf-4 -Wall (Ubuntu_Clang_18.1.3_(1ubuntu1))
opt8clang -march=native -O3 -fwrapv -Qunused-arguments -fPIC -fPIE -gdwarf-4 -Wall (Ubuntu_Clang_18.1.3_(1ubuntu1))
opt8clang -march=native -O -fwrapv -Qunused-arguments -fPIC -fPIE -gdwarf-4 -Wall (Ubuntu_Clang_18.1.3_(1ubuntu1))
opt8clang -march=native -Os -fwrapv -Qunused-arguments -fPIC -fPIE -gdwarf-4 -Wall (Ubuntu_Clang_18.1.3_(1ubuntu1))
opt8clang -mcpu=native -O3 -fwrapv -Qunused-arguments -fPIC -fPIE -gdwarf-4 -Wall (Ubuntu_Clang_18.1.3_(1ubuntu1))
opt8gcc -march=native -mtune=native -O2 -fwrapv -fPIC -fPIE -gdwarf-4 -Wall (13.3.0)
opt8gcc -march=native -mtune=native -O3 -fwrapv -fPIC -fPIE -gdwarf-4 -Wall (13.3.0)
opt8gcc -march=native -mtune=native -O -fwrapv -fPIC -fPIE -gdwarf-4 -Wall (13.3.0)
opt8gcc -march=native -mtune=native -Os -fwrapv -fPIC -fPIE -gdwarf-4 -Wall (13.3.0)
opt8_lowsizeclang -march=native -O2 -fwrapv -Qunused-arguments -fPIC -fPIE -gdwarf-4 -Wall (Ubuntu_Clang_18.1.3_(1ubuntu1))
opt8_lowsizeclang -march=native -O3 -fwrapv -Qunused-arguments -fPIC -fPIE -gdwarf-4 -Wall (Ubuntu_Clang_18.1.3_(1ubuntu1))
opt8_lowsizeclang -march=native -O -fwrapv -Qunused-arguments -fPIC -fPIE -gdwarf-4 -Wall (Ubuntu_Clang_18.1.3_(1ubuntu1))
opt8_lowsizeclang -march=native -Os -fwrapv -Qunused-arguments -fPIC -fPIE -gdwarf-4 -Wall (Ubuntu_Clang_18.1.3_(1ubuntu1))
opt8_lowsizeclang -mcpu=native -O3 -fwrapv -Qunused-arguments -fPIC -fPIE -gdwarf-4 -Wall (Ubuntu_Clang_18.1.3_(1ubuntu1))
opt8_lowsizegcc -march=native -mtune=native -O2 -fwrapv -fPIC -fPIE -gdwarf-4 -Wall (13.3.0)
opt8_lowsizegcc -march=native -mtune=native -O3 -fwrapv -fPIC -fPIE -gdwarf-4 -Wall (13.3.0)
opt8_lowsizegcc -march=native -mtune=native -O -fwrapv -fPIC -fPIE -gdwarf-4 -Wall (13.3.0)
opt8_lowsizegcc -march=native -mtune=native -Os -fwrapv -fPIC -fPIE -gdwarf-4 -Wall (13.3.0)
refclang -march=native -O2 -fwrapv -Qunused-arguments -fPIC -fPIE -gdwarf-4 -Wall (Ubuntu_Clang_18.1.3_(1ubuntu1))
refclang -march=native -O3 -fwrapv -Qunused-arguments -fPIC -fPIE -gdwarf-4 -Wall (Ubuntu_Clang_18.1.3_(1ubuntu1))
refclang -march=native -O -fwrapv -Qunused-arguments -fPIC -fPIE -gdwarf-4 -Wall (Ubuntu_Clang_18.1.3_(1ubuntu1))
refclang -march=native -Os -fwrapv -Qunused-arguments -fPIC -fPIE -gdwarf-4 -Wall (Ubuntu_Clang_18.1.3_(1ubuntu1))
refclang -mcpu=native -O3 -fwrapv -Qunused-arguments -fPIC -fPIE -gdwarf-4 -Wall (Ubuntu_Clang_18.1.3_(1ubuntu1))
refgcc -march=native -mtune=native -O2 -fwrapv -fPIC -fPIE -gdwarf-4 -Wall (13.3.0)
refgcc -march=native -mtune=native -O3 -fwrapv -fPIC -fPIE -gdwarf-4 -Wall (13.3.0)
refgcc -march=native -mtune=native -O -fwrapv -fPIC -fPIE -gdwarf-4 -Wall (13.3.0)
refgcc -march=native -mtune=native -Os -fwrapv -fPIC -fPIE -gdwarf-4 -Wall (13.3.0)