Implementation notes: amd64, cubi10, crypto_aead/aegis128l

Computer: cubi10
Microarchitecture: amd64; Comet Lake (806ec)
Architecture: amd64
CPU ID: GenuineIntel-000806ec-bfebfbff
SUPERCOP version: 20240425
Operation: crypto_aead
Primitive: aegis128l
TimeObject sizeTest sizeImplementationCompilerBenchmark dateSUPERCOP version
189010149 0 027056 812 1048T:aesnicclang_-march=native_-O2_-fomit-frame-pointer_-fwrapv_-Qunused-arguments_-fPIC_-fPIE2024042620240425
189610293 0 027296 812 1048T:aesnicclang_-march=native_-O3_-fomit-frame-pointer_-fwrapv_-Qunused-arguments_-fPIC_-fPIE2024042620240425
19095872 0 022752 812 1048T:aesnibclang_-march=native_-O2_-fomit-frame-pointer_-fwrapv_-Qunused-arguments_-fPIC_-fPIE2024042620240425
19115872 0 022848 812 1048T:aesnibclang_-march=native_-O3_-fomit-frame-pointer_-fwrapv_-Qunused-arguments_-fPIC_-fPIE2024042620240425
19134917 0 027832 780 1080sodium-aesnigcc_-march=native_-mtune=native_-O3_-fomit-frame-pointer_-fwrapv_-fPIC_-fPIE2024042620240425
19204596 0 026920 812 1016sodium-aesniclang_-mcpu=native_-O3_-fomit-frame-pointer_-fwrapv_-Qunused-arguments_-fPIC_-fPIE2024042620240425
19244622 0 027592 812 1048sodium-aesniclang_-march=native_-O2_-fomit-frame-pointer_-fwrapv_-Qunused-arguments_-fPIC_-fPIE2024042620240425
19253133 0 022718 804 1016sodium-aesniclang_-march=native_-Os_-fomit-frame-pointer_-fwrapv_-Qunused-arguments_-fPIC_-fPIE2024042620240425
19304622 0 027688 812 1048sodium-aesniclang_-march=native_-O3_-fomit-frame-pointer_-fwrapv_-Qunused-arguments_-fPIC_-fPIE2024042620240425
19374141 0 025120 780 1080sodium-aesnigcc_-march=native_-mtune=native_-O2_-fomit-frame-pointer_-fwrapv_-fPIC_-fPIE2024042620240425
19564315 32 025176 820 1080jasmin-aesnigcc_-march=native_-mtune=native_-O2_-fomit-frame-pointer_-fwrapv_-fPIC_-fPIE2024042620240425
19614311 32 027232 852 1048jasmin-aesniclang_-march=native_-O2_-fomit-frame-pointer_-fwrapv_-Qunused-arguments_-fPIC_-fPIE2024042620240425
19614256 32 023766 844 1016jasmin-aesniclang_-march=native_-Os_-fomit-frame-pointer_-fwrapv_-Qunused-arguments_-fPIC_-fPIE2024042620240425
19624311 32 027312 852 1048jasmin-aesniclang_-march=native_-O3_-fomit-frame-pointer_-fwrapv_-Qunused-arguments_-fPIC_-fPIE2024042620240425
19624311 32 026576 852 1016jasmin-aesniclang_-mcpu=native_-O3_-fomit-frame-pointer_-fwrapv_-Qunused-arguments_-fPIC_-fPIE2024042620240425
19643902 0 018408 780 1080T:aesnibgcc_-march=native_-mtune=native_-O2_-fomit-frame-pointer_-fwrapv_-fPIC_-fPIE2024042620240425
19657654 0 024128 780 1080T:aesnicgcc_-march=native_-mtune=native_-O3_-fomit-frame-pointer_-fwrapv_-fPIC_-fPIE2024042620240425
19696009 0 022464 780 1080T:aesnibgcc_-march=native_-mtune=native_-O3_-fomit-frame-pointer_-fwrapv_-fPIC_-fPIE2024042620240425
19714207 32 022963 796 1048jasmin-aesnigcc_-march=native_-mtune=native_-Os_-fomit-frame-pointer_-fwrapv_-fPIC_-fPIE2024042620240425
19724361 0 017870 804 1016T:aesnicclang_-march=native_-Os_-fomit-frame-pointer_-fwrapv_-Qunused-arguments_-fPIC_-fPIE2024042620240425
19765745 0 022184 780 1080T:aesniagcc_-march=native_-mtune=native_-O3_-fomit-frame-pointer_-fwrapv_-fPIC_-fPIE2024042620240425
19765627 0 020152 780 1080T:aesnicgcc_-march=native_-mtune=native_-O2_-fomit-frame-pointer_-fwrapv_-fPIC_-fPIE2024042620240425
19784315 32 027136 820 1080jasmin-aesnigcc_-march=native_-mtune=native_-O3_-fomit-frame-pointer_-fwrapv_-fPIC_-fPIE2024042620240425
19784229 32 024543 812 1080jasmin-aesnigcc_-march=native_-mtune=native_-O_-fomit-frame-pointer_-fwrapv_-fPIC_-fPIE2024042620240425
19834466 0 018960 780 1080T:aesniagcc_-march=native_-mtune=native_-O2_-fomit-frame-pointer_-fwrapv_-fPIC_-fPIE2024042620240425
19904127 0 017982 804 1016T:aesnicclang_-march=native_-O_-fomit-frame-pointer_-fwrapv_-Qunused-arguments_-fPIC_-fPIE2024042620240425
19904244 32 023926 844 1016jasmin-aesniclang_-march=native_-O_-fomit-frame-pointer_-fwrapv_-Qunused-arguments_-fPIC_-fPIE2024042620240425
19964100 0 017582 804 1016T:aesnibclang_-march=native_-Os_-fomit-frame-pointer_-fwrapv_-Qunused-arguments_-fPIC_-fPIE2024042620240425
19992748 0 016590 804 1016T:aesnibclang_-march=native_-O_-fomit-frame-pointer_-fwrapv_-Qunused-arguments_-fPIC_-fPIE2024042620240425
20043798 0 017847 772 1080T:aesnibgcc_-march=native_-mtune=native_-O_-fomit-frame-pointer_-fwrapv_-fPIC_-fPIE2024042620240425
20154243 0 018287 772 1080T:aesniagcc_-march=native_-mtune=native_-O_-fomit-frame-pointer_-fwrapv_-fPIC_-fPIE2024042620240425
20264973 0 019055 772 1080T:aesnicgcc_-march=native_-mtune=native_-O_-fomit-frame-pointer_-fwrapv_-fPIC_-fPIE2024042620240425
20382527 0 015427 756 1048T:aesnibgcc_-march=native_-mtune=native_-Os_-fomit-frame-pointer_-fwrapv_-fPIC_-fPIE2024042620240425
20383712 0 016635 756 1048T:aesnicgcc_-march=native_-mtune=native_-Os_-fomit-frame-pointer_-fwrapv_-fPIC_-fPIE2024042620240425
20683918 0 017398 804 1016T:aesniaclang_-march=native_-Os_-fomit-frame-pointer_-fwrapv_-Qunused-arguments_-fPIC_-fPIE2024042620240425
25335713 0 022584 812 1048T:aesniaclang_-march=native_-O2_-fomit-frame-pointer_-fwrapv_-Qunused-arguments_-fPIC_-fPIE2024042620240425
25395745 0 022712 812 1048T:aesniaclang_-march=native_-O3_-fomit-frame-pointer_-fwrapv_-Qunused-arguments_-fPIC_-fPIE2024042620240425
27303728 0 024256 780 1080sodium-aesnigcc_-march=native_-mtune=native_-O_-fomit-frame-pointer_-fwrapv_-fPIC_-fPIE2024042620240425
32801791 0 020691 756 1048sodium-aesnigcc_-march=native_-mtune=native_-Os_-fomit-frame-pointer_-fwrapv_-fPIC_-fPIE2024042620240425
33802358 0 022230 804 1016sodium-aesniclang_-march=native_-O_-fomit-frame-pointer_-fwrapv_-Qunused-arguments_-fPIC_-fPIE2024042620240425
389637131 4096 023608 4884 1080T:refgcc_-march=native_-mtune=native_-O3_-fomit-frame-pointer_-fwrapv_-fPIC_-fPIE2024042620240425
5696048259 0 030648 812 1016T:sodium-softaesclang_-mcpu=native_-O3_-fomit-frame-pointer_-fwrapv_-Qunused-arguments_-fPIC_-fPIE2024042620240425
6099179891 0 032936 812 1048T:sodium-softaesclang_-march=native_-O2_-fomit-frame-pointer_-fwrapv_-Qunused-arguments_-fPIC_-fPIE2024042620240425
6103299891 0 033048 812 1048T:sodium-softaesclang_-march=native_-O3_-fomit-frame-pointer_-fwrapv_-Qunused-arguments_-fPIC_-fPIE2024042620240425
7041506280 0 025966 804 1016T:sodium-softaesclang_-march=native_-Os_-fomit-frame-pointer_-fwrapv_-Qunused-arguments_-fPIC_-fPIE2024042620240425
70798211630 1024 034568 1812 1080T:sodium-softaesgcc_-march=native_-mtune=native_-O3_-fomit-frame-pointer_-fwrapv_-fPIC_-fPIE2024042620240425
7094598446 1024 029440 1812 1080T:sodium-softaesgcc_-march=native_-mtune=native_-O2_-fomit-frame-pointer_-fwrapv_-fPIC_-fPIE2024042620240425
7249269300 1024 029816 1812 1080T:sodium-softaesgcc_-march=native_-mtune=native_-O_-fomit-frame-pointer_-fwrapv_-fPIC_-fPIE2024042620240425
7452104215 1024 023163 1788 1048T:sodium-softaesgcc_-march=native_-mtune=native_-Os_-fomit-frame-pointer_-fwrapv_-fPIC_-fPIE2024042620240425
8125646600 0 026550 804 1016T:sodium-softaesclang_-march=native_-O_-fomit-frame-pointer_-fwrapv_-Qunused-arguments_-fPIC_-fPIE2024042620240425

Compiler output

Implementation: T:aesnia
Security model: timingleaks
Compiler: clang -march=native -O -fomit-frame-pointer -fwrapv -Qunused-arguments -fPIC -fPIE
try.c: /usr/bin/ld: libcrypto_aead_aegis128l.a(encrypt.o): in function `crypto_aead_aegis128l_aesnia_timingleaks_encrypt':
try.c: encrypt.c:(.text+0x...): undefined reference to `aegis128L_enc_aut_step'
try.c: /usr/bin/ld: encrypt.c:(.text+0x...): undefined reference to `aegis128L_enc_aut_step'
try.c: /usr/bin/ld: encrypt.c:(.text+0x...): undefined reference to `aegis128L_enc_aut_step'
try.c: /usr/bin/ld: encrypt.c:(.text+0x...): undefined reference to `aegis128L_enc_aut_step'
try.c: /usr/bin/ld: libcrypto_aead_aegis128l.a(encrypt.o): in function `crypto_aead_aegis128l_aesnia_timingleaks_decrypt':
try.c: encrypt.c:(.text+0x...): undefined reference to `aegis128L_enc_aut_step'
try.c: /usr/bin/ld: libcrypto_aead_aegis128l.a(encrypt.o):encrypt.c:(.text+0x...): more undefined references to `aegis128L_enc_aut_step' follow
try.c: /usr/bin/ld: libcrypto_aead_aegis128l.a(encrypt.o): in function `crypto_aead_aegis128l_aesnia_timingleaks_decrypt':
try.c: encrypt.c:(.text+0x...): undefined reference to `aegis128L_dec_aut_step'
try.c: /usr/bin/ld: encrypt.c:(.text+0x...): undefined reference to `aegis128L_dec_aut_step'
try.c: clang: error: linker command failed with exit code 1 (use -v to see invocation)

Number of similar (compiler,implementation) pairs: 1, namely:
CompilerImplementations
clang -march=native -O -fomit-frame-pointer -fwrapv -Qunused-arguments -fPIC -fPIE T:aesnia

Compiler output

Implementation: T:aesnia
Security model: timingleaks
Compiler: clang -mcpu=native -O3 -fomit-frame-pointer -fwrapv -Qunused-arguments -fPIC -fPIE
encrypt.c: encrypt.c:34:25: error: always_inline function '_mm_aesenc_si128' requires target feature 'aes', but would be inlined into function 'aegis128L_initialization' that is compiled without support for 'aes'
encrypt.c: state[7] = _mm_aesenc_si128(state[6],state[7]);
encrypt.c: ^
encrypt.c: encrypt.c:35:25: error: always_inline function '_mm_aesenc_si128' requires target feature 'aes', but would be inlined into function 'aegis128L_initialization' that is compiled without support for 'aes'
encrypt.c: state[6] = _mm_aesenc_si128(state[5],state[6]);
encrypt.c: ^
encrypt.c: encrypt.c:36:25: error: always_inline function '_mm_aesenc_si128' requires target feature 'aes', but would be inlined into function 'aegis128L_initialization' that is compiled without support for 'aes'
encrypt.c: state[5] = _mm_aesenc_si128(state[4],state[5]);
encrypt.c: ^
encrypt.c: encrypt.c:37:25: error: always_inline function '_mm_aesenc_si128' requires target feature 'aes', but would be inlined into function 'aegis128L_initialization' that is compiled without support for 'aes'
encrypt.c: state[4] = _mm_aesenc_si128(state[3],state[4]);
encrypt.c: ^
encrypt.c: encrypt.c:38:25: error: always_inline function '_mm_aesenc_si128' requires target feature 'aes', but would be inlined into function 'aegis128L_initialization' that is compiled without support for 'aes'
encrypt.c: state[3] = _mm_aesenc_si128(state[2],state[3]);
encrypt.c: ^
encrypt.c: encrypt.c:39:25: error: always_inline function '_mm_aesenc_si128' requires target feature 'aes', but would be inlined into function 'aegis128L_initialization' that is compiled without support for 'aes'
encrypt.c: state[2] = _mm_aesenc_si128(state[1],state[2]);
encrypt.c: ^
encrypt.c: encrypt.c:40:25: error: always_inline function '_mm_aesenc_si128' requires target feature 'aes', but would be inlined into function 'aegis128L_initialization' that is compiled without support for 'aes'
encrypt.c: state[1] = _mm_aesenc_si128(state[0],state[1]);
encrypt.c: ^
encrypt.c: encrypt.c:41:25: error: always_inline function '_mm_aesenc_si128' requires target feature 'aes', but would be inlined into function 'aegis128L_initialization' that is compiled without support for 'aes'
encrypt.c: state[0] = _mm_aesenc_si128(tmp,state[0]);
encrypt.c: ^
encrypt.c: 8 errors generated.

Number of similar (compiler,implementation) pairs: 3, namely:
CompilerImplementations
clang -mcpu=native -O3 -fomit-frame-pointer -fwrapv -Qunused-arguments -fPIC -fPIE T:aesnia T:aesnib T:aesnic

Compiler output

Implementation: T:aesnia
Security model: timingleaks
Compiler: gcc -march=native -mtune=native -Os -fomit-frame-pointer -fwrapv -fPIC -fPIE
try.c: /usr/bin/ld: libcrypto_aead_aegis128l.a(encrypt.o): in function `crypto_aead_aegis128l_aesnia_timingleaks_encrypt':
try.c: encrypt.c:(.text+0x...): undefined reference to `aegis128L_enc_aut_step'
try.c: /usr/bin/ld: encrypt.c:(.text+0x...): undefined reference to `aegis128L_enc_aut_step'
try.c: /usr/bin/ld: encrypt.c:(.text+0x...): undefined reference to `aegis128L_enc_aut_step'
try.c: /usr/bin/ld: encrypt.c:(.text+0x...): undefined reference to `aegis128L_enc_aut_step'
try.c: /usr/bin/ld: libcrypto_aead_aegis128l.a(encrypt.o): in function `crypto_aead_aegis128l_aesnia_timingleaks_decrypt':
try.c: encrypt.c:(.text+0x...): undefined reference to `aegis128L_enc_aut_step'
try.c: /usr/bin/ld: libcrypto_aead_aegis128l.a(encrypt.o):encrypt.c:(.text+0x...): more undefined references to `aegis128L_enc_aut_step' follow
try.c: /usr/bin/ld: libcrypto_aead_aegis128l.a(encrypt.o): in function `crypto_aead_aegis128l_aesnia_timingleaks_decrypt':
try.c: encrypt.c:(.text+0x...): undefined reference to `aegis128L_dec_aut_step'
try.c: /usr/bin/ld: encrypt.c:(.text+0x...): undefined reference to `aegis128L_dec_aut_step'
try.c: collect2: error: ld returned 1 exit status

Number of similar (compiler,implementation) pairs: 1, namely:
CompilerImplementations
gcc -march=native -mtune=native -Os -fomit-frame-pointer -fwrapv -fPIC -fPIE T:aesnia

Compiler output

Implementation: T:ref
Security model: timingleaks
Compiler: clang -march=native -O2 -fomit-frame-pointer -fwrapv -Qunused-arguments -fPIC -fPIE
try.c: /usr/bin/ld: libcrypto_aead_aegis128l.a(ecrypt.o): in function `crypto_aead_aegis128l_ref_timingleaks_encrypt':
try.c: ecrypt.c:(.text+0x...): undefined reference to `aegis128L_enc_aut_step'
try.c: /usr/bin/ld: ecrypt.c:(.text+0x...): undefined reference to `aegis128L_enc_aut_step'
try.c: /usr/bin/ld: ecrypt.c:(.text+0x...): undefined reference to `aegis128L_enc_aut_step'
try.c: /usr/bin/ld: ecrypt.c:(.text+0x...): undefined reference to `aegis128L_enc_aut_step'
try.c: /usr/bin/ld: libcrypto_aead_aegis128l.a(ecrypt.o): in function `crypto_aead_aegis128l_ref_timingleaks_decrypt':
try.c: ecrypt.c:(.text+0x...): undefined reference to `aegis128L_enc_aut_step'
try.c: /usr/bin/ld: libcrypto_aead_aegis128l.a(ecrypt.o):ecrypt.c:(.text+0x...): more undefined references to `aegis128L_enc_aut_step' follow
try.c: /usr/bin/ld: libcrypto_aead_aegis128l.a(ecrypt.o): in function `crypto_aead_aegis128l_ref_timingleaks_decrypt':
try.c: ecrypt.c:(.text+0x...): undefined reference to `aegis128L_dec_aut_step'
try.c: /usr/bin/ld: ecrypt.c:(.text+0x...): undefined reference to `aegis128L_dec_aut_step'
try.c: clang: error: linker command failed with exit code 1 (use -v to see invocation)

Number of similar (compiler,implementation) pairs: 5, namely:
CompilerImplementations
clang -march=native -O2 -fomit-frame-pointer -fwrapv -Qunused-arguments -fPIC -fPIE T:ref
clang -march=native -O3 -fomit-frame-pointer -fwrapv -Qunused-arguments -fPIC -fPIE T:ref
clang -march=native -O -fomit-frame-pointer -fwrapv -Qunused-arguments -fPIC -fPIE T:ref
clang -march=native -Os -fomit-frame-pointer -fwrapv -Qunused-arguments -fPIC -fPIE T:ref
clang -mcpu=native -O3 -fomit-frame-pointer -fwrapv -Qunused-arguments -fPIC -fPIE T:ref

Compiler output

Implementation: T:ref
Security model: timingleaks
Compiler: gcc -march=native -mtune=native -O2 -fomit-frame-pointer -fwrapv -fPIC -fPIE
try.c: /usr/bin/ld: libcrypto_aead_aegis128l.a(ecrypt.o): in function `crypto_aead_aegis128l_ref_timingleaks_encrypt':
try.c: ecrypt.c:(.text+0x...): undefined reference to `aegis128L_enc_aut_step'
try.c: /usr/bin/ld: ecrypt.c:(.text+0x...): undefined reference to `aegis128L_enc_aut_step'
try.c: /usr/bin/ld: ecrypt.c:(.text+0x...): undefined reference to `aegis128L_enc_aut_step'
try.c: /usr/bin/ld: ecrypt.c:(.text+0x...): undefined reference to `aegis128L_enc_aut_step'
try.c: /usr/bin/ld: libcrypto_aead_aegis128l.a(ecrypt.o): in function `crypto_aead_aegis128l_ref_timingleaks_decrypt':
try.c: ecrypt.c:(.text+0x...): undefined reference to `aegis128L_enc_aut_step'
try.c: /usr/bin/ld: ecrypt.c:(.text+0x...): undefined reference to `aegis128L_dec_aut_step'
try.c: /usr/bin/ld: ecrypt.c:(.text+0x...): undefined reference to `aegis128L_enc_aut_step'
try.c: /usr/bin/ld: ecrypt.c:(.text+0x...): undefined reference to `aegis128L_dec_aut_step'
try.c: collect2: error: ld returned 1 exit status

Number of similar (compiler,implementation) pairs: 2, namely:
CompilerImplementations
gcc -march=native -mtune=native -O2 -fomit-frame-pointer -fwrapv -fPIC -fPIE T:ref
gcc -march=native -mtune=native -O -fomit-frame-pointer -fwrapv -fPIC -fPIE T:ref

Compiler output

Implementation: T:ref
Security model: timingleaks
Compiler: gcc -march=native -mtune=native -Os -fomit-frame-pointer -fwrapv -fPIC -fPIE
try.c: /usr/bin/ld: libcrypto_aead_aegis128l.a(ecrypt.o): in function `crypto_aead_aegis128l_ref_timingleaks_encrypt':
try.c: ecrypt.c:(.text+0x...): undefined reference to `aegis128L_enc_aut_step'
try.c: /usr/bin/ld: ecrypt.c:(.text+0x...): undefined reference to `aegis128L_enc_aut_step'
try.c: /usr/bin/ld: ecrypt.c:(.text+0x...): undefined reference to `aegis128L_enc_aut_step'
try.c: /usr/bin/ld: ecrypt.c:(.text+0x...): undefined reference to `aegis128L_enc_aut_step'
try.c: /usr/bin/ld: libcrypto_aead_aegis128l.a(ecrypt.o): in function `crypto_aead_aegis128l_ref_timingleaks_decrypt':
try.c: ecrypt.c:(.text+0x...): undefined reference to `aegis128L_enc_aut_step'
try.c: /usr/bin/ld: libcrypto_aead_aegis128l.a(ecrypt.o):ecrypt.c:(.text+0x...): more undefined references to `aegis128L_enc_aut_step' follow
try.c: /usr/bin/ld: libcrypto_aead_aegis128l.a(ecrypt.o): in function `crypto_aead_aegis128l_ref_timingleaks_decrypt':
try.c: ecrypt.c:(.text+0x...): undefined reference to `aegis128L_dec_aut_step'
try.c: /usr/bin/ld: ecrypt.c:(.text+0x...): undefined reference to `aegis128L_dec_aut_step'
try.c: collect2: error: ld returned 1 exit status

Number of similar (compiler,implementation) pairs: 1, namely:
CompilerImplementations
gcc -march=native -mtune=native -Os -fomit-frame-pointer -fwrapv -fPIC -fPIE T:ref