Implementation notes: amd64, alder, crypto_sign/sphincsf256sha256robust

Computer: alder
Microarchitecture: amd64; Golden Cove (90675-00)
Architecture: amd64
CPU ID: GenuineIntel-00090675-00-bfebfbff
SUPERCOP version: 20231107
Operation: crypto_sign
Primitive: sphincsf256sha256robust

Compiler output

Implementation: T:avx2
Security model: timingleaks
Compiler: clang -march=native -O2 -fomit-frame-pointer -fwrapv -Qunused-arguments -fPIC -fPIE
try.c: /usr/bin/ld: libcrypto_sign_sphincsf256sha256robust.a(hash_sha256.o):(.bss+0x0): multiple definition of `state_seeded'; libcrypto_sign_sphincsf256sha256robust.a(thash_sha256_robust.o):(.bss+0x0): first defined here
try.c: /usr/bin/ld: libcrypto_sign_sphincsf256sha256robust.a(hash_sha256x8.o):(.bss+0x0): multiple definition of `state_seeded'; libcrypto_sign_sphincsf256sha256robust.a(thash_sha256_robust.o):(.bss+0x0): first defined here
try.c: /usr/bin/ld: libcrypto_sign_sphincsf256sha256robust.a(sha256.o):(.bss+0x0): multiple definition of `state_seeded'; libcrypto_sign_sphincsf256sha256robust.a(thash_sha256_robust.o):(.bss+0x0): first defined here
try.c: /usr/bin/ld: libcrypto_sign_sphincsf256sha256robust.a(thash_sha256_robustx8.o):(.bss+0x0): multiple definition of `state_seeded'; libcrypto_sign_sphincsf256sha256robust.a(thash_sha256_robust.o):(.bss+0x0): first defined here
try.c: clang: error: linker command failed with exit code 1 (use -v to see invocation)

Number of similar (compiler,implementation) pairs: 4, namely:
CompilerImplementations
clang -march=native -O2 -fomit-frame-pointer -fwrapv -Qunused-arguments -fPIC -fPIE T:avx2
clang -march=native -O3 -fomit-frame-pointer -fwrapv -Qunused-arguments -fPIC -fPIE T:avx2
clang -march=native -O -fomit-frame-pointer -fwrapv -Qunused-arguments -fPIC -fPIE T:avx2
clang -march=native -Os -fomit-frame-pointer -fwrapv -Qunused-arguments -fPIC -fPIE T:avx2

Compiler output

Implementation: T:avx2
Security model: timingleaks
Compiler: clang -mcpu=native -O3 -fomit-frame-pointer -fwrapv -Qunused-arguments -fPIC -fPIE
sha256avx.c: sha256avx.c:11:15: error: always_inline function '_mm256_unpacklo_epi32' requires target feature 'avx2', but would be inlined into function 'transpose' that is compiled without support for 'avx2'
sha256avx.c: tmp0[0] = _mm256_unpacklo_epi32(s[0], s[1]);
sha256avx.c: ^
sha256avx.c: sha256avx.c:11:15: error: AVX vector argument of type '__m256i' (vector of 4 'long long' values) without 'avx' enabled changes the ABI
sha256avx.c: sha256avx.c:12:15: error: always_inline function '_mm256_unpackhi_epi32' requires target feature 'avx2', but would be inlined into function 'transpose' that is compiled without support for 'avx2'
sha256avx.c: tmp0[1] = _mm256_unpackhi_epi32(s[0], s[1]);
sha256avx.c: ^
sha256avx.c: sha256avx.c:12:15: error: AVX vector argument of type '__m256i' (vector of 4 'long long' values) without 'avx' enabled changes the ABI
sha256avx.c: sha256avx.c:13:15: error: always_inline function '_mm256_unpacklo_epi32' requires target feature 'avx2', but would be inlined into function 'transpose' that is compiled without support for 'avx2'
sha256avx.c: tmp0[2] = _mm256_unpacklo_epi32(s[2], s[3]);
sha256avx.c: ^
sha256avx.c: sha256avx.c:13:15: error: AVX vector argument of type '__m256i' (vector of 4 'long long' values) without 'avx' enabled changes the ABI
sha256avx.c: sha256avx.c:14:15: error: always_inline function '_mm256_unpackhi_epi32' requires target feature 'avx2', but would be inlined into function 'transpose' that is compiled without support for 'avx2'
sha256avx.c: tmp0[3] = _mm256_unpackhi_epi32(s[2], s[3]);
sha256avx.c: ^
sha256avx.c: sha256avx.c:14:15: error: AVX vector argument of type '__m256i' (vector of 4 'long long' values) without 'avx' enabled changes the ABI
sha256avx.c: sha256avx.c:15:15: error: always_inline function '_mm256_unpacklo_epi32' requires target feature 'avx2', but would be inlined into function 'transpose' that is compiled without support for 'avx2'
sha256avx.c: tmp0[4] = _mm256_unpacklo_epi32(s[4], s[5]);
sha256avx.c: ^
sha256avx.c: sha256avx.c:15:15: error: AVX vector argument of type '__m256i' (vector of 4 'long long' values) without 'avx' enabled changes the ABI
sha256avx.c: sha256avx.c:16:15: error: always_inline function '_mm256_unpackhi_epi32' requires target feature 'avx2', but would be inlined into function 'transpose' that is compiled without support for 'avx2'
sha256avx.c: tmp0[5] = _mm256_unpackhi_epi32(s[4], s[5]);
sha256avx.c: ^
sha256avx.c: sha256avx.c:16:15: error: AVX vector argument of type '__m256i' (vector of 4 'long long' values) without 'avx' enabled changes the ABI
sha256avx.c: sha256avx.c:17:15: error: always_inline function '_mm256_unpacklo_epi32' requires target feature 'avx2', but would be inlined into function 'transpose' that is compiled without support for 'avx2'
sha256avx.c: ...

Number of similar (compiler,implementation) pairs: 1, namely:
CompilerImplementations
clang -mcpu=native -O3 -fomit-frame-pointer -fwrapv -Qunused-arguments -fPIC -fPIE T:avx2

Compiler output

Implementation: T:avx2
Security model: timingleaks
Compiler: gcc -march=native -mtune=native -O2 -fomit-frame-pointer -fwrapv -fPIC -fPIE
try.c: /usr/bin/ld: libcrypto_sign_sphincsf256sha256robust.a(hash_sha256.o):(.bss+0x0): multiple definition of `state_seeded'; libcrypto_sign_sphincsf256sha256robust.a(thash_sha256_robust.o):(.bss+0x0): first defined here
try.c: /usr/bin/ld: libcrypto_sign_sphincsf256sha256robust.a(hash_sha256x8.o):(.bss+0x0): multiple definition of `state_seeded'; libcrypto_sign_sphincsf256sha256robust.a(thash_sha256_robust.o):(.bss+0x0): first defined here
try.c: /usr/bin/ld: libcrypto_sign_sphincsf256sha256robust.a(sha256.o):(.bss+0x0): multiple definition of `state_seeded'; libcrypto_sign_sphincsf256sha256robust.a(thash_sha256_robust.o):(.bss+0x0): first defined here
try.c: /usr/bin/ld: libcrypto_sign_sphincsf256sha256robust.a(thash_sha256_robustx8.o):(.bss+0x0): multiple definition of `state_seeded'; libcrypto_sign_sphincsf256sha256robust.a(thash_sha256_robust.o):(.bss+0x0): first defined here
try.c: collect2: error: ld returned 1 exit status

Number of similar (compiler,implementation) pairs: 4, namely:
CompilerImplementations
gcc -march=native -mtune=native -O2 -fomit-frame-pointer -fwrapv -fPIC -fPIE T:avx2
gcc -march=native -mtune=native -O3 -fomit-frame-pointer -fwrapv -fPIC -fPIE T:avx2
gcc -march=native -mtune=native -O -fomit-frame-pointer -fwrapv -fPIC -fPIE T:avx2
gcc -march=native -mtune=native -Os -fomit-frame-pointer -fwrapv -fPIC -fPIE T:avx2

Compiler output

Implementation: T:ref
Security model: timingleaks
Compiler: clang -march=native -O2 -fomit-frame-pointer -fwrapv -Qunused-arguments -fPIC -fPIE
try.c: /usr/bin/ld: libcrypto_sign_sphincsf256sha256robust.a(hash_sha256.o):(.bss+0x0): multiple definition of `state_seeded'; libcrypto_sign_sphincsf256sha256robust.a(thash_sha256_robust.o):(.bss+0x0): first defined here
try.c: /usr/bin/ld: libcrypto_sign_sphincsf256sha256robust.a(sha256.o):(.bss+0x0): multiple definition of `state_seeded'; libcrypto_sign_sphincsf256sha256robust.a(thash_sha256_robust.o):(.bss+0x0): first defined here
try.c: clang: error: linker command failed with exit code 1 (use -v to see invocation)

Number of similar (compiler,implementation) pairs: 5, namely:
CompilerImplementations
clang -march=native -O2 -fomit-frame-pointer -fwrapv -Qunused-arguments -fPIC -fPIE T:ref
clang -march=native -O3 -fomit-frame-pointer -fwrapv -Qunused-arguments -fPIC -fPIE T:ref
clang -march=native -O -fomit-frame-pointer -fwrapv -Qunused-arguments -fPIC -fPIE T:ref
clang -march=native -Os -fomit-frame-pointer -fwrapv -Qunused-arguments -fPIC -fPIE T:ref
clang -mcpu=native -O3 -fomit-frame-pointer -fwrapv -Qunused-arguments -fPIC -fPIE T:ref

Compiler output

Implementation: T:ref
Security model: timingleaks
Compiler: gcc -march=native -mtune=native -O2 -fomit-frame-pointer -fwrapv -fPIC -fPIE
try.c: /usr/bin/ld: libcrypto_sign_sphincsf256sha256robust.a(hash_sha256.o):(.bss+0x0): multiple definition of `state_seeded'; libcrypto_sign_sphincsf256sha256robust.a(thash_sha256_robust.o):(.bss+0x0): first defined here
try.c: /usr/bin/ld: libcrypto_sign_sphincsf256sha256robust.a(sha256.o):(.bss+0x0): multiple definition of `state_seeded'; libcrypto_sign_sphincsf256sha256robust.a(thash_sha256_robust.o):(.bss+0x0): first defined here
try.c: collect2: error: ld returned 1 exit status

Number of similar (compiler,implementation) pairs: 4, namely:
CompilerImplementations
gcc -march=native -mtune=native -O2 -fomit-frame-pointer -fwrapv -fPIC -fPIE T:ref
gcc -march=native -mtune=native -O3 -fomit-frame-pointer -fwrapv -fPIC -fPIE T:ref
gcc -march=native -mtune=native -O -fomit-frame-pointer -fwrapv -fPIC -fPIE T:ref
gcc -march=native -mtune=native -Os -fomit-frame-pointer -fwrapv -fPIC -fPIE T:ref