Implementation notes: amd64, alder, crypto_sign/hector

Computer: alder
Microarchitecture: amd64; Golden Cove (90675-00)
Architecture: amd64
CPU ID: GenuineIntel-00090675-00-bfebfbff
SUPERCOP version: 20240625
Operation: crypto_sign
Primitive: hector

Compiler output


common.c: In file included from common.c:7:
common.c: In file included from ./common.h:12:
common.c: In file included from ./divclass.h:10:
common.c: In file included from ./field.h:7:
common.c: In file included from ./mpfq_2_113.h:5:
common.c: ./x86_64/mpfq_2_113.h:740:14: error: use of unknown builtin '__builtin_ia32_pslldqi128' [-Wimplicit-function-declaration]
common.c:                 r.s = t0 ^ SHLD(t1, 64);
common.c:                            ^
common.c: ./x86_64/mpfq_2_113.h:597:25: note: expanded from macro 'SHLD'
common.c: #define SHLD(x,r) (v2di)__builtin_ia32_pslldqi128 ((gcc43bugfix) (x),(r))
common.c:                         ^
common.c: ./x86_64/mpfq_2_113.h:740:14: error: invalid conversion between vector type 'v2di' (vector of 2 'uint64_t' values) and integer type 'int' of different size
common.c:                 r.s = t0 ^ SHLD(t1, 64);
common.c:                            ^~~~~~~~~~~~
common.c: ./x86_64/mpfq_2_113.h:597:19: note: expanded from macro 'SHLD'
common.c: #define SHLD(x,r) (v2di)__builtin_ia32_pslldqi128 ((gcc43bugfix) (x),(r))
common.c:                   ^~~~~~~~~~~~~~~~~~~~~~~~~~~~~~~~~~~~~~~~~~~~~~~~~~~~~~~
common.c: ./x86_64/mpfq_2_113.h:747:14: error: use of unknown builtin '__builtin_ia32_psrldqi128' [-Wimplicit-function-declaration]
common.c:                 r.s = t2 ^ SHRD(t1, 64);
common.c:                            ^
common.c: ./x86_64/mpfq_2_113.h:598:25: note: expanded from macro 'SHRD'
common.c: #define SHRD(x,r) (v2di)__builtin_ia32_psrldqi128 ((gcc43bugfix) (x),(r))
common.c:                         ^
common.c: ./x86_64/mpfq_2_113.h:747:14: error: invalid conversion between vector type 'v2di' (vector of 2 'uint64_t' values) and integer type 'int' of different size
common.c:                 r.s = t2 ^ SHRD(t1, 64);
common.c: ...

Number of similar (implementation,compiler) pairs: 5, namely:
ImplementationCompiler
T:refclang -march=native -O2 -fwrapv -Qunused-arguments -fPIC -fPIE -gdwarf-4 -Wall (Debian_Clang_11.0.1)
T:refclang -march=native -O3 -fwrapv -Qunused-arguments -fPIC -fPIE -gdwarf-4 -Wall (Debian_Clang_11.0.1)
T:refclang -march=native -O -fwrapv -Qunused-arguments -fPIC -fPIE -gdwarf-4 -Wall (Debian_Clang_11.0.1)
T:refclang -march=native -Os -fwrapv -Qunused-arguments -fPIC -fPIE -gdwarf-4 -Wall (Debian_Clang_11.0.1)
T:refclang -mcpu=native -O3 -fwrapv -Qunused-arguments -fPIC -fPIE -gdwarf-4 -Wall (Debian_Clang_11.0.1)

Compiler output


common.c: In file included from common.h:12,
common.c:                  from common.c:7:
common.c: divclass.h:53:56: warning: duplicate 'const' declaration specifier [-Wduplicate-decl-specifier]
common.c:    53 | void divclass_make_affine(divclass rop, const divclass const op);
common.c:       |                                                        ^~~~~
common.c: common.c:13:10: fatal error: cpucycles.h: No such file or directory
common.c:    13 | #include "cpucycles.h"
common.c:       |          ^~~~~~~~~~~~~
common.c: compilation terminated.

Number of similar (implementation,compiler) pairs: 4, namely:
ImplementationCompiler
T:refgcc -march=native -mtune=native -O2 -fwrapv -fPIC -fPIE -gdwarf-4 -Wall (10.2.1_20210110)
T:refgcc -march=native -mtune=native -O3 -fwrapv -fPIC -fPIE -gdwarf-4 -Wall (10.2.1_20210110)
T:refgcc -march=native -mtune=native -O -fwrapv -fPIC -fPIE -gdwarf-4 -Wall (10.2.1_20210110)
T:refgcc -march=native -mtune=native -Os -fwrapv -fPIC -fPIE -gdwarf-4 -Wall (10.2.1_20210110)