Implementation notes: amd64, alder, crypto_sign/ed25519

Computer: alder
Microarchitecture: amd64; Golden Cove (90675-00)
Architecture: amd64
CPU ID: GenuineIntel-00090675-00-bfebfbff
SUPERCOP version: 20240625
Operation: crypto_sign
Primitive: ed25519
TimeObject sizeTest sizeImplementationCompilerBenchmark dateSUPERCOP version
18918383102 0 095698 820 1784amd64-51-30kgcc_-march=native_-mtune=native_-O3_-fwrapv_-fPIC_-fPIE_-gdwarf-4_-Wall2024062620240625
19072279648 0 091114 820 1784amd64-51-30kgcc_-march=native_-mtune=native_-O2_-fwrapv_-fPIC_-fPIE_-gdwarf-4_-Wall2024062620240625
19212878244 0 089655 828 1752amd64-51-30kclang_-march=native_-O_-fwrapv_-Qunused-arguments_-fPIC_-fPIE_-gdwarf-4_-Wall2024062620240625
19222781426 0 094537 836 1752amd64-51-30kclang_-mcpu=native_-O3_-fwrapv_-Qunused-arguments_-fPIC_-fPIE_-gdwarf-4_-Wall2024062620240625
19247381328 0 094273 836 1784amd64-51-30kclang_-march=native_-O3_-fwrapv_-Qunused-arguments_-fPIC_-fPIE_-gdwarf-4_-Wall2024062620240625
19288379868 0 092793 836 1784amd64-51-30kclang_-march=native_-O2_-fwrapv_-Qunused-arguments_-fPIC_-fPIE_-gdwarf-4_-Wall2024062620240625
19347577370 0 088839 828 1752amd64-51-30kclang_-march=native_-Os_-fwrapv_-Qunused-arguments_-fPIC_-fPIE_-gdwarf-4_-Wall2024062620240625
19450289313 0 0101071 828 1752amd64-64-24kclang_-march=native_-O_-fwrapv_-Qunused-arguments_-fPIC_-fPIE_-gdwarf-4_-Wall2024062620240625
19455395550 0 0108889 836 1784amd64-64-24kclang_-march=native_-O3_-fwrapv_-Qunused-arguments_-fPIC_-fPIE_-gdwarf-4_-Wall2024062620240625
19520791420 0 0104721 836 1784amd64-64-24kclang_-march=native_-O2_-fwrapv_-Qunused-arguments_-fPIC_-fPIE_-gdwarf-4_-Wall2024062620240625
19542296280 0 0109433 836 1752amd64-64-24kclang_-mcpu=native_-O3_-fwrapv_-Qunused-arguments_-fPIC_-fPIE_-gdwarf-4_-Wall2024062620240625
19545690309 0 0102282 820 1784amd64-64-24kgcc_-march=native_-mtune=native_-O2_-fwrapv_-fPIC_-fPIE_-gdwarf-4_-Wall2024062620240625
19548479336 0 090634 820 1784amd64-51-30kgcc_-march=native_-mtune=native_-O_-fwrapv_-fPIC_-fPIE_-gdwarf-4_-Wall2024062620240625
19572189967 0 0101794 820 1784amd64-64-24kgcc_-march=native_-mtune=native_-O_-fwrapv_-fPIC_-fPIE_-gdwarf-4_-Wall2024062620240625
19652393768 0 0106866 820 1784amd64-64-24kgcc_-march=native_-mtune=native_-O3_-fwrapv_-fPIC_-fPIE_-gdwarf-4_-Wall2024062620240625
19669677201 0 088546 812 1784amd64-51-30kgcc_-march=native_-mtune=native_-Os_-fwrapv_-fPIC_-fPIE_-gdwarf-4_-Wall2024062620240625
19715788758 0 0100415 828 1752amd64-64-24kclang_-march=native_-Os_-fwrapv_-Qunused-arguments_-fPIC_-fPIE_-gdwarf-4_-Wall2024062620240625
19758688361 0 099946 812 1784amd64-64-24kgcc_-march=native_-mtune=native_-Os_-fwrapv_-fPIC_-fPIE_-gdwarf-4_-Wall2024062620240625
43371756751 0 080514 820 1784ref10gcc_-march=native_-mtune=native_-O3_-fwrapv_-fPIC_-fPIE_-gdwarf-4_-Wall2024062620240625
44583156186 0 076575 828 1752ref10clang_-march=native_-Os_-fwrapv_-Qunused-arguments_-fPIC_-fPIE_-gdwarf-4_-Wall2024062620240625
44685956369 0 076322 812 1784ref10gcc_-march=native_-mtune=native_-Os_-fwrapv_-fPIC_-fPIE_-gdwarf-4_-Wall2024062620240625
44775656972 0 078738 820 1784ref10gcc_-march=native_-mtune=native_-O2_-fwrapv_-fPIC_-fPIE_-gdwarf-4_-Wall2024062620240625
45495157507 0 078666 820 1784ref10gcc_-march=native_-mtune=native_-O_-fwrapv_-fPIC_-fPIE_-gdwarf-4_-Wall2024062620240625
46322962363 0 085561 836 1784ref10clang_-march=native_-O3_-fwrapv_-Qunused-arguments_-fPIC_-fPIE_-gdwarf-4_-Wall2024062620240625
46660358811 0 081833 836 1784ref10clang_-march=native_-O2_-fwrapv_-Qunused-arguments_-fPIC_-fPIE_-gdwarf-4_-Wall2024062620240625
48031062803 0 086201 836 1752ref10clang_-mcpu=native_-O3_-fwrapv_-Qunused-arguments_-fPIC_-fPIE_-gdwarf-4_-Wall2024062620240625
48354557568 0 078495 828 1752ref10clang_-march=native_-O_-fwrapv_-Qunused-arguments_-fPIC_-fPIE_-gdwarf-4_-Wall2024062620240625

Compiler output


ge25519_scalarmult_base.c: ge25519_scalarmult_base.c:15:22: warning: unused variable 'ecd' [-Wunused-const-variable]
ge25519_scalarmult_base.c: static const fe25519 ecd = {{0x75EB4DCA135978A3, 0x00700A4D4141D8AB, 0x8CC740797779E898, 0x52036CEE2B6FFE73}};
ge25519_scalarmult_base.c:                      ^
ge25519_scalarmult_base.c: 1 warning generated.

Number of similar (implementation,compiler) pairs: 5, namely:
ImplementationCompiler
amd64-64-24kclang -march=native -O2 -fwrapv -Qunused-arguments -fPIC -fPIE -gdwarf-4 -Wall (Debian_Clang_11.0.1)
amd64-64-24kclang -march=native -O3 -fwrapv -Qunused-arguments -fPIC -fPIE -gdwarf-4 -Wall (Debian_Clang_11.0.1)
amd64-64-24kclang -march=native -O -fwrapv -Qunused-arguments -fPIC -fPIE -gdwarf-4 -Wall (Debian_Clang_11.0.1)
amd64-64-24kclang -march=native -Os -fwrapv -Qunused-arguments -fPIC -fPIE -gdwarf-4 -Wall (Debian_Clang_11.0.1)
amd64-64-24kclang -mcpu=native -O3 -fwrapv -Qunused-arguments -fPIC -fPIE -gdwarf-4 -Wall (Debian_Clang_11.0.1)

Compiler output


ge25519_scalarmult_base.c: ge25519_scalarmult_base.c:15:22: warning: 'ecd' defined but not used [-Wunused-const-variable=]
ge25519_scalarmult_base.c:    15 | static const fe25519 ecd = {{0x75EB4DCA135978A3, 0x00700A4D4141D8AB, 0x8CC740797779E898, 0x52036CEE2B6FFE73}};
ge25519_scalarmult_base.c:       |                      ^~~

Number of similar (implementation,compiler) pairs: 4, namely:
ImplementationCompiler
amd64-64-24kgcc -march=native -mtune=native -O2 -fwrapv -fPIC -fPIE -gdwarf-4 -Wall (10.2.1_20210110)
amd64-64-24kgcc -march=native -mtune=native -O3 -fwrapv -fPIC -fPIE -gdwarf-4 -Wall (10.2.1_20210110)
amd64-64-24kgcc -march=native -mtune=native -O -fwrapv -fPIC -fPIE -gdwarf-4 -Wall (10.2.1_20210110)
amd64-64-24kgcc -march=native -mtune=native -Os -fwrapv -fPIC -fPIE -gdwarf-4 -Wall (10.2.1_20210110)

Compiler output


try.c: /usr/bin/ld: libcrypto_sign_ed25519.a(open.o):.../supercop-data/alder/amd64/try/c/clang_-march=native_-O2_-fwrapv_-Qunused-arguments_-fPIC_-fPIE_-gdwarf-4_-Wall/constbranchindex/crypto_sign/ed25519/ref/work/./ge25519.h:23: multiple definition of `crypto_sign_ed25519_ref_constbranchindex_ge25519_base'; libcrypto_sign_ed25519.a(keypair.o):.../supercop-data/alder/amd64/try/c/clang_-march=native_-O2_-fwrapv_-Qunused-arguments_-fPIC_-fPIE_-gdwarf-4_-Wall/constbranchindex/crypto_sign/ed25519/ref/work/./ge25519.h:23: first defined here
try.c: /usr/bin/ld: libcrypto_sign_ed25519.a(sign.o):.../supercop-data/alder/amd64/try/c/clang_-march=native_-O2_-fwrapv_-Qunused-arguments_-fPIC_-fPIE_-gdwarf-4_-Wall/constbranchindex/crypto_sign/ed25519/ref/work/./ge25519.h:23: multiple definition of `crypto_sign_ed25519_ref_constbranchindex_ge25519_base'; libcrypto_sign_ed25519.a(keypair.o):.../supercop-data/alder/amd64/try/c/clang_-march=native_-O2_-fwrapv_-Qunused-arguments_-fPIC_-fPIE_-gdwarf-4_-Wall/constbranchindex/crypto_sign/ed25519/ref/work/./ge25519.h:23: first defined here
try.c: /usr/bin/ld: libcrypto_sign_ed25519.a(ge25519.o):.../supercop-data/alder/amd64/try/c/clang_-march=native_-O2_-fwrapv_-Qunused-arguments_-fPIC_-fPIE_-gdwarf-4_-Wall/constbranchindex/crypto_sign/ed25519/ref/work/ge25519.c:46: multiple definition of `crypto_sign_ed25519_ref_constbranchindex_ge25519_base'; libcrypto_sign_ed25519.a(keypair.o):.../supercop-data/alder/amd64/try/c/clang_-march=native_-O2_-fwrapv_-Qunused-arguments_-fPIC_-fPIE_-gdwarf-4_-Wall/constbranchindex/crypto_sign/ed25519/ref/work/./ge25519.h:23: first defined here
try.c: clang: error: linker command failed with exit code 1 (use -v to see invocation)

Number of similar (implementation,compiler) pairs: 1, namely:
ImplementationCompiler
refclang -march=native -O2 -fwrapv -Qunused-arguments -fPIC -fPIE -gdwarf-4 -Wall (Debian_Clang_11.0.1)

Compiler output


try.c: /usr/bin/ld: libcrypto_sign_ed25519.a(open.o):.../supercop-data/alder/amd64/try/c/clang_-march=native_-O3_-fwrapv_-Qunused-arguments_-fPIC_-fPIE_-gdwarf-4_-Wall/constbranchindex/crypto_sign/ed25519/ref/work/./ge25519.h:23: multiple definition of `crypto_sign_ed25519_ref_constbranchindex_ge25519_base'; libcrypto_sign_ed25519.a(keypair.o):.../supercop-data/alder/amd64/try/c/clang_-march=native_-O3_-fwrapv_-Qunused-arguments_-fPIC_-fPIE_-gdwarf-4_-Wall/constbranchindex/crypto_sign/ed25519/ref/work/./ge25519.h:23: first defined here
try.c: /usr/bin/ld: libcrypto_sign_ed25519.a(sign.o):.../supercop-data/alder/amd64/try/c/clang_-march=native_-O3_-fwrapv_-Qunused-arguments_-fPIC_-fPIE_-gdwarf-4_-Wall/constbranchindex/crypto_sign/ed25519/ref/work/./ge25519.h:23: multiple definition of `crypto_sign_ed25519_ref_constbranchindex_ge25519_base'; libcrypto_sign_ed25519.a(keypair.o):.../supercop-data/alder/amd64/try/c/clang_-march=native_-O3_-fwrapv_-Qunused-arguments_-fPIC_-fPIE_-gdwarf-4_-Wall/constbranchindex/crypto_sign/ed25519/ref/work/./ge25519.h:23: first defined here
try.c: /usr/bin/ld: libcrypto_sign_ed25519.a(ge25519.o):.../supercop-data/alder/amd64/try/c/clang_-march=native_-O3_-fwrapv_-Qunused-arguments_-fPIC_-fPIE_-gdwarf-4_-Wall/constbranchindex/crypto_sign/ed25519/ref/work/ge25519.c:46: multiple definition of `crypto_sign_ed25519_ref_constbranchindex_ge25519_base'; libcrypto_sign_ed25519.a(keypair.o):.../supercop-data/alder/amd64/try/c/clang_-march=native_-O3_-fwrapv_-Qunused-arguments_-fPIC_-fPIE_-gdwarf-4_-Wall/constbranchindex/crypto_sign/ed25519/ref/work/./ge25519.h:23: first defined here
try.c: clang: error: linker command failed with exit code 1 (use -v to see invocation)

Number of similar (implementation,compiler) pairs: 1, namely:
ImplementationCompiler
refclang -march=native -O3 -fwrapv -Qunused-arguments -fPIC -fPIE -gdwarf-4 -Wall (Debian_Clang_11.0.1)

Compiler output


try.c: /usr/bin/ld: libcrypto_sign_ed25519.a(open.o):.../supercop-data/alder/amd64/try/c/clang_-march=native_-O_-fwrapv_-Qunused-arguments_-fPIC_-fPIE_-gdwarf-4_-Wall/constbranchindex/crypto_sign/ed25519/ref/work/./ge25519.h:23: multiple definition of `crypto_sign_ed25519_ref_constbranchindex_ge25519_base'; libcrypto_sign_ed25519.a(keypair.o):.../supercop-data/alder/amd64/try/c/clang_-march=native_-O_-fwrapv_-Qunused-arguments_-fPIC_-fPIE_-gdwarf-4_-Wall/constbranchindex/crypto_sign/ed25519/ref/work/./ge25519.h:23: first defined here
try.c: /usr/bin/ld: libcrypto_sign_ed25519.a(sign.o):.../supercop-data/alder/amd64/try/c/clang_-march=native_-O_-fwrapv_-Qunused-arguments_-fPIC_-fPIE_-gdwarf-4_-Wall/constbranchindex/crypto_sign/ed25519/ref/work/./ge25519.h:23: multiple definition of `crypto_sign_ed25519_ref_constbranchindex_ge25519_base'; libcrypto_sign_ed25519.a(keypair.o):.../supercop-data/alder/amd64/try/c/clang_-march=native_-O_-fwrapv_-Qunused-arguments_-fPIC_-fPIE_-gdwarf-4_-Wall/constbranchindex/crypto_sign/ed25519/ref/work/./ge25519.h:23: first defined here
try.c: /usr/bin/ld: libcrypto_sign_ed25519.a(ge25519.o):.../supercop-data/alder/amd64/try/c/clang_-march=native_-O_-fwrapv_-Qunused-arguments_-fPIC_-fPIE_-gdwarf-4_-Wall/constbranchindex/crypto_sign/ed25519/ref/work/ge25519.c:46: multiple definition of `crypto_sign_ed25519_ref_constbranchindex_ge25519_base'; libcrypto_sign_ed25519.a(keypair.o):.../supercop-data/alder/amd64/try/c/clang_-march=native_-O_-fwrapv_-Qunused-arguments_-fPIC_-fPIE_-gdwarf-4_-Wall/constbranchindex/crypto_sign/ed25519/ref/work/./ge25519.h:23: first defined here
try.c: clang: error: linker command failed with exit code 1 (use -v to see invocation)

Number of similar (implementation,compiler) pairs: 1, namely:
ImplementationCompiler
refclang -march=native -O -fwrapv -Qunused-arguments -fPIC -fPIE -gdwarf-4 -Wall (Debian_Clang_11.0.1)

Compiler output


try.c: /usr/bin/ld: libcrypto_sign_ed25519.a(open.o):.../supercop-data/alder/amd64/try/c/clang_-march=native_-Os_-fwrapv_-Qunused-arguments_-fPIC_-fPIE_-gdwarf-4_-Wall/constbranchindex/crypto_sign/ed25519/ref/work/./ge25519.h:23: multiple definition of `crypto_sign_ed25519_ref_constbranchindex_ge25519_base'; libcrypto_sign_ed25519.a(keypair.o):.../supercop-data/alder/amd64/try/c/clang_-march=native_-Os_-fwrapv_-Qunused-arguments_-fPIC_-fPIE_-gdwarf-4_-Wall/constbranchindex/crypto_sign/ed25519/ref/work/./ge25519.h:23: first defined here
try.c: /usr/bin/ld: libcrypto_sign_ed25519.a(sign.o):.../supercop-data/alder/amd64/try/c/clang_-march=native_-Os_-fwrapv_-Qunused-arguments_-fPIC_-fPIE_-gdwarf-4_-Wall/constbranchindex/crypto_sign/ed25519/ref/work/./ge25519.h:23: multiple definition of `crypto_sign_ed25519_ref_constbranchindex_ge25519_base'; libcrypto_sign_ed25519.a(keypair.o):.../supercop-data/alder/amd64/try/c/clang_-march=native_-Os_-fwrapv_-Qunused-arguments_-fPIC_-fPIE_-gdwarf-4_-Wall/constbranchindex/crypto_sign/ed25519/ref/work/./ge25519.h:23: first defined here
try.c: /usr/bin/ld: libcrypto_sign_ed25519.a(ge25519.o):.../supercop-data/alder/amd64/try/c/clang_-march=native_-Os_-fwrapv_-Qunused-arguments_-fPIC_-fPIE_-gdwarf-4_-Wall/constbranchindex/crypto_sign/ed25519/ref/work/ge25519.c:46: multiple definition of `crypto_sign_ed25519_ref_constbranchindex_ge25519_base'; libcrypto_sign_ed25519.a(keypair.o):.../supercop-data/alder/amd64/try/c/clang_-march=native_-Os_-fwrapv_-Qunused-arguments_-fPIC_-fPIE_-gdwarf-4_-Wall/constbranchindex/crypto_sign/ed25519/ref/work/./ge25519.h:23: first defined here
try.c: clang: error: linker command failed with exit code 1 (use -v to see invocation)

Number of similar (implementation,compiler) pairs: 1, namely:
ImplementationCompiler
refclang -march=native -Os -fwrapv -Qunused-arguments -fPIC -fPIE -gdwarf-4 -Wall (Debian_Clang_11.0.1)

Compiler output


try.c: /usr/bin/ld: libcrypto_sign_ed25519.a(open.o):.../supercop-data/alder/amd64/try/c/clang_-mcpu=native_-O3_-fwrapv_-Qunused-arguments_-fPIC_-fPIE_-gdwarf-4_-Wall/constbranchindex/crypto_sign/ed25519/ref/work/./ge25519.h:23: multiple definition of `crypto_sign_ed25519_ref_constbranchindex_ge25519_base'; libcrypto_sign_ed25519.a(keypair.o):.../supercop-data/alder/amd64/try/c/clang_-mcpu=native_-O3_-fwrapv_-Qunused-arguments_-fPIC_-fPIE_-gdwarf-4_-Wall/constbranchindex/crypto_sign/ed25519/ref/work/./ge25519.h:23: first defined here
try.c: /usr/bin/ld: libcrypto_sign_ed25519.a(sign.o):.../supercop-data/alder/amd64/try/c/clang_-mcpu=native_-O3_-fwrapv_-Qunused-arguments_-fPIC_-fPIE_-gdwarf-4_-Wall/constbranchindex/crypto_sign/ed25519/ref/work/./ge25519.h:23: multiple definition of `crypto_sign_ed25519_ref_constbranchindex_ge25519_base'; libcrypto_sign_ed25519.a(keypair.o):.../supercop-data/alder/amd64/try/c/clang_-mcpu=native_-O3_-fwrapv_-Qunused-arguments_-fPIC_-fPIE_-gdwarf-4_-Wall/constbranchindex/crypto_sign/ed25519/ref/work/./ge25519.h:23: first defined here
try.c: /usr/bin/ld: libcrypto_sign_ed25519.a(ge25519.o):.../supercop-data/alder/amd64/try/c/clang_-mcpu=native_-O3_-fwrapv_-Qunused-arguments_-fPIC_-fPIE_-gdwarf-4_-Wall/constbranchindex/crypto_sign/ed25519/ref/work/ge25519.c:46: multiple definition of `crypto_sign_ed25519_ref_constbranchindex_ge25519_base'; libcrypto_sign_ed25519.a(keypair.o):.../supercop-data/alder/amd64/try/c/clang_-mcpu=native_-O3_-fwrapv_-Qunused-arguments_-fPIC_-fPIE_-gdwarf-4_-Wall/constbranchindex/crypto_sign/ed25519/ref/work/./ge25519.h:23: first defined here
try.c: clang: error: linker command failed with exit code 1 (use -v to see invocation)

Number of similar (implementation,compiler) pairs: 1, namely:
ImplementationCompiler
refclang -mcpu=native -O3 -fwrapv -Qunused-arguments -fPIC -fPIE -gdwarf-4 -Wall (Debian_Clang_11.0.1)

Compiler output


try.c: /usr/bin/ld: libcrypto_sign_ed25519.a(open.o):.../supercop-data/alder/amd64/try/c/gcc_-march=native_-mtune=native_-O2_-fwrapv_-fPIC_-fPIE_-gdwarf-4_-Wall/constbranchindex/crypto_sign/ed25519/ref/work/ge25519.h:23: multiple definition of `crypto_sign_ed25519_ref_constbranchindex_ge25519_base'; libcrypto_sign_ed25519.a(keypair.o):.../supercop-data/alder/amd64/try/c/gcc_-march=native_-mtune=native_-O2_-fwrapv_-fPIC_-fPIE_-gdwarf-4_-Wall/constbranchindex/crypto_sign/ed25519/ref/work/ge25519.h:23: first defined here
try.c: /usr/bin/ld: libcrypto_sign_ed25519.a(sign.o):.../supercop-data/alder/amd64/try/c/gcc_-march=native_-mtune=native_-O2_-fwrapv_-fPIC_-fPIE_-gdwarf-4_-Wall/constbranchindex/crypto_sign/ed25519/ref/work/ge25519.h:23: multiple definition of `crypto_sign_ed25519_ref_constbranchindex_ge25519_base'; libcrypto_sign_ed25519.a(keypair.o):.../supercop-data/alder/amd64/try/c/gcc_-march=native_-mtune=native_-O2_-fwrapv_-fPIC_-fPIE_-gdwarf-4_-Wall/constbranchindex/crypto_sign/ed25519/ref/work/ge25519.h:23: first defined here
try.c: /usr/bin/ld: libcrypto_sign_ed25519.a(ge25519.o):.../supercop-data/alder/amd64/try/c/gcc_-march=native_-mtune=native_-O2_-fwrapv_-fPIC_-fPIE_-gdwarf-4_-Wall/constbranchindex/crypto_sign/ed25519/ref/work/ge25519.h:23: multiple definition of `crypto_sign_ed25519_ref_constbranchindex_ge25519_base'; libcrypto_sign_ed25519.a(keypair.o):.../supercop-data/alder/amd64/try/c/gcc_-march=native_-mtune=native_-O2_-fwrapv_-fPIC_-fPIE_-gdwarf-4_-Wall/constbranchindex/crypto_sign/ed25519/ref/work/ge25519.h:23: first defined here
try.c: collect2: error: ld returned 1 exit status

Number of similar (implementation,compiler) pairs: 1, namely:
ImplementationCompiler
refgcc -march=native -mtune=native -O2 -fwrapv -fPIC -fPIE -gdwarf-4 -Wall (10.2.1_20210110)

Compiler output


try.c: /usr/bin/ld: libcrypto_sign_ed25519.a(open.o):.../supercop-data/alder/amd64/try/c/gcc_-march=native_-mtune=native_-O3_-fwrapv_-fPIC_-fPIE_-gdwarf-4_-Wall/constbranchindex/crypto_sign/ed25519/ref/work/ge25519.h:23: multiple definition of `crypto_sign_ed25519_ref_constbranchindex_ge25519_base'; libcrypto_sign_ed25519.a(keypair.o):.../supercop-data/alder/amd64/try/c/gcc_-march=native_-mtune=native_-O3_-fwrapv_-fPIC_-fPIE_-gdwarf-4_-Wall/constbranchindex/crypto_sign/ed25519/ref/work/ge25519.h:23: first defined here
try.c: /usr/bin/ld: libcrypto_sign_ed25519.a(sign.o):.../supercop-data/alder/amd64/try/c/gcc_-march=native_-mtune=native_-O3_-fwrapv_-fPIC_-fPIE_-gdwarf-4_-Wall/constbranchindex/crypto_sign/ed25519/ref/work/ge25519.h:23: multiple definition of `crypto_sign_ed25519_ref_constbranchindex_ge25519_base'; libcrypto_sign_ed25519.a(keypair.o):.../supercop-data/alder/amd64/try/c/gcc_-march=native_-mtune=native_-O3_-fwrapv_-fPIC_-fPIE_-gdwarf-4_-Wall/constbranchindex/crypto_sign/ed25519/ref/work/ge25519.h:23: first defined here
try.c: /usr/bin/ld: libcrypto_sign_ed25519.a(ge25519.o):.../supercop-data/alder/amd64/try/c/gcc_-march=native_-mtune=native_-O3_-fwrapv_-fPIC_-fPIE_-gdwarf-4_-Wall/constbranchindex/crypto_sign/ed25519/ref/work/ge25519.h:23: multiple definition of `crypto_sign_ed25519_ref_constbranchindex_ge25519_base'; libcrypto_sign_ed25519.a(keypair.o):.../supercop-data/alder/amd64/try/c/gcc_-march=native_-mtune=native_-O3_-fwrapv_-fPIC_-fPIE_-gdwarf-4_-Wall/constbranchindex/crypto_sign/ed25519/ref/work/ge25519.h:23: first defined here
try.c: collect2: error: ld returned 1 exit status

Number of similar (implementation,compiler) pairs: 1, namely:
ImplementationCompiler
refgcc -march=native -mtune=native -O3 -fwrapv -fPIC -fPIE -gdwarf-4 -Wall (10.2.1_20210110)

Compiler output


try.c: /usr/bin/ld: libcrypto_sign_ed25519.a(open.o):.../supercop-data/alder/amd64/try/c/gcc_-march=native_-mtune=native_-O_-fwrapv_-fPIC_-fPIE_-gdwarf-4_-Wall/constbranchindex/crypto_sign/ed25519/ref/work/ge25519.h:23: multiple definition of `crypto_sign_ed25519_ref_constbranchindex_ge25519_base'; libcrypto_sign_ed25519.a(keypair.o):.../supercop-data/alder/amd64/try/c/gcc_-march=native_-mtune=native_-O_-fwrapv_-fPIC_-fPIE_-gdwarf-4_-Wall/constbranchindex/crypto_sign/ed25519/ref/work/ge25519.h:23: first defined here
try.c: /usr/bin/ld: libcrypto_sign_ed25519.a(sign.o):.../supercop-data/alder/amd64/try/c/gcc_-march=native_-mtune=native_-O_-fwrapv_-fPIC_-fPIE_-gdwarf-4_-Wall/constbranchindex/crypto_sign/ed25519/ref/work/ge25519.h:23: multiple definition of `crypto_sign_ed25519_ref_constbranchindex_ge25519_base'; libcrypto_sign_ed25519.a(keypair.o):.../supercop-data/alder/amd64/try/c/gcc_-march=native_-mtune=native_-O_-fwrapv_-fPIC_-fPIE_-gdwarf-4_-Wall/constbranchindex/crypto_sign/ed25519/ref/work/ge25519.h:23: first defined here
try.c: /usr/bin/ld: libcrypto_sign_ed25519.a(ge25519.o):.../supercop-data/alder/amd64/try/c/gcc_-march=native_-mtune=native_-O_-fwrapv_-fPIC_-fPIE_-gdwarf-4_-Wall/constbranchindex/crypto_sign/ed25519/ref/work/ge25519.h:23: multiple definition of `crypto_sign_ed25519_ref_constbranchindex_ge25519_base'; libcrypto_sign_ed25519.a(keypair.o):.../supercop-data/alder/amd64/try/c/gcc_-march=native_-mtune=native_-O_-fwrapv_-fPIC_-fPIE_-gdwarf-4_-Wall/constbranchindex/crypto_sign/ed25519/ref/work/ge25519.h:23: first defined here
try.c: collect2: error: ld returned 1 exit status

Number of similar (implementation,compiler) pairs: 1, namely:
ImplementationCompiler
refgcc -march=native -mtune=native -O -fwrapv -fPIC -fPIE -gdwarf-4 -Wall (10.2.1_20210110)

Compiler output


try.c: /usr/bin/ld: libcrypto_sign_ed25519.a(open.o):.../supercop-data/alder/amd64/try/c/gcc_-march=native_-mtune=native_-Os_-fwrapv_-fPIC_-fPIE_-gdwarf-4_-Wall/constbranchindex/crypto_sign/ed25519/ref/work/ge25519.h:23: multiple definition of `crypto_sign_ed25519_ref_constbranchindex_ge25519_base'; libcrypto_sign_ed25519.a(keypair.o):.../supercop-data/alder/amd64/try/c/gcc_-march=native_-mtune=native_-Os_-fwrapv_-fPIC_-fPIE_-gdwarf-4_-Wall/constbranchindex/crypto_sign/ed25519/ref/work/ge25519.h:23: first defined here
try.c: /usr/bin/ld: libcrypto_sign_ed25519.a(sign.o):.../supercop-data/alder/amd64/try/c/gcc_-march=native_-mtune=native_-Os_-fwrapv_-fPIC_-fPIE_-gdwarf-4_-Wall/constbranchindex/crypto_sign/ed25519/ref/work/ge25519.h:23: multiple definition of `crypto_sign_ed25519_ref_constbranchindex_ge25519_base'; libcrypto_sign_ed25519.a(keypair.o):.../supercop-data/alder/amd64/try/c/gcc_-march=native_-mtune=native_-Os_-fwrapv_-fPIC_-fPIE_-gdwarf-4_-Wall/constbranchindex/crypto_sign/ed25519/ref/work/ge25519.h:23: first defined here
try.c: /usr/bin/ld: libcrypto_sign_ed25519.a(ge25519.o):.../supercop-data/alder/amd64/try/c/gcc_-march=native_-mtune=native_-Os_-fwrapv_-fPIC_-fPIE_-gdwarf-4_-Wall/constbranchindex/crypto_sign/ed25519/ref/work/ge25519.h:23: multiple definition of `crypto_sign_ed25519_ref_constbranchindex_ge25519_base'; libcrypto_sign_ed25519.a(keypair.o):.../supercop-data/alder/amd64/try/c/gcc_-march=native_-mtune=native_-Os_-fwrapv_-fPIC_-fPIE_-gdwarf-4_-Wall/constbranchindex/crypto_sign/ed25519/ref/work/ge25519.h:23: first defined here
try.c: collect2: error: ld returned 1 exit status

Number of similar (implementation,compiler) pairs: 1, namely:
ImplementationCompiler
refgcc -march=native -mtune=native -Os -fwrapv -fPIC -fPIE -gdwarf-4 -Wall (10.2.1_20210110)

Passed TIMECOP


TIMECOP iterations: 10

Number of similar (implementation,compiler) pairs: 27, namely:
ImplementationCompiler
amd64-51-30kclang -march=native -O2 -fwrapv -Qunused-arguments -fPIC -fPIE -gdwarf-4 -Wall (Debian_Clang_11.0.1)
amd64-51-30kclang -march=native -O3 -fwrapv -Qunused-arguments -fPIC -fPIE -gdwarf-4 -Wall (Debian_Clang_11.0.1)
amd64-51-30kclang -march=native -O -fwrapv -Qunused-arguments -fPIC -fPIE -gdwarf-4 -Wall (Debian_Clang_11.0.1)
amd64-51-30kclang -march=native -Os -fwrapv -Qunused-arguments -fPIC -fPIE -gdwarf-4 -Wall (Debian_Clang_11.0.1)
amd64-51-30kclang -mcpu=native -O3 -fwrapv -Qunused-arguments -fPIC -fPIE -gdwarf-4 -Wall (Debian_Clang_11.0.1)
amd64-51-30kgcc -march=native -mtune=native -O2 -fwrapv -fPIC -fPIE -gdwarf-4 -Wall (10.2.1_20210110)
amd64-51-30kgcc -march=native -mtune=native -O3 -fwrapv -fPIC -fPIE -gdwarf-4 -Wall (10.2.1_20210110)
amd64-51-30kgcc -march=native -mtune=native -O -fwrapv -fPIC -fPIE -gdwarf-4 -Wall (10.2.1_20210110)
amd64-51-30kgcc -march=native -mtune=native -Os -fwrapv -fPIC -fPIE -gdwarf-4 -Wall (10.2.1_20210110)
amd64-64-24kclang -march=native -O2 -fwrapv -Qunused-arguments -fPIC -fPIE -gdwarf-4 -Wall (Debian_Clang_11.0.1)
amd64-64-24kclang -march=native -O3 -fwrapv -Qunused-arguments -fPIC -fPIE -gdwarf-4 -Wall (Debian_Clang_11.0.1)
amd64-64-24kclang -march=native -O -fwrapv -Qunused-arguments -fPIC -fPIE -gdwarf-4 -Wall (Debian_Clang_11.0.1)
amd64-64-24kclang -march=native -Os -fwrapv -Qunused-arguments -fPIC -fPIE -gdwarf-4 -Wall (Debian_Clang_11.0.1)
amd64-64-24kclang -mcpu=native -O3 -fwrapv -Qunused-arguments -fPIC -fPIE -gdwarf-4 -Wall (Debian_Clang_11.0.1)
amd64-64-24kgcc -march=native -mtune=native -O2 -fwrapv -fPIC -fPIE -gdwarf-4 -Wall (10.2.1_20210110)
amd64-64-24kgcc -march=native -mtune=native -O3 -fwrapv -fPIC -fPIE -gdwarf-4 -Wall (10.2.1_20210110)
amd64-64-24kgcc -march=native -mtune=native -O -fwrapv -fPIC -fPIE -gdwarf-4 -Wall (10.2.1_20210110)
amd64-64-24kgcc -march=native -mtune=native -Os -fwrapv -fPIC -fPIE -gdwarf-4 -Wall (10.2.1_20210110)
ref10clang -march=native -O2 -fwrapv -Qunused-arguments -fPIC -fPIE -gdwarf-4 -Wall (Debian_Clang_11.0.1)
ref10clang -march=native -O3 -fwrapv -Qunused-arguments -fPIC -fPIE -gdwarf-4 -Wall (Debian_Clang_11.0.1)
ref10clang -march=native -O -fwrapv -Qunused-arguments -fPIC -fPIE -gdwarf-4 -Wall (Debian_Clang_11.0.1)
ref10clang -march=native -Os -fwrapv -Qunused-arguments -fPIC -fPIE -gdwarf-4 -Wall (Debian_Clang_11.0.1)
ref10clang -mcpu=native -O3 -fwrapv -Qunused-arguments -fPIC -fPIE -gdwarf-4 -Wall (Debian_Clang_11.0.1)
ref10gcc -march=native -mtune=native -O2 -fwrapv -fPIC -fPIE -gdwarf-4 -Wall (10.2.1_20210110)
ref10gcc -march=native -mtune=native -O3 -fwrapv -fPIC -fPIE -gdwarf-4 -Wall (10.2.1_20210110)
ref10gcc -march=native -mtune=native -O -fwrapv -fPIC -fPIE -gdwarf-4 -Wall (10.2.1_20210110)
ref10gcc -march=native -mtune=native -Os -fwrapv -fPIC -fPIE -gdwarf-4 -Wall (10.2.1_20210110)