Implementation notes: aarch64, pi4b, crypto_sign/sphincss192sha256simple

Computer: pi4b
Architecture: aarch64
CPU ID: 410fd083
SUPERCOP version: 20221019
Operation: crypto_sign
Primitive: sphincss192sha256simple

Compiler output

Implementation: T:avx2
Security model: timingleaks
Compiler: clang -mcpu=native -O3 -fomit-frame-pointer -fwrapv -Qunused-arguments -fPIC -fPIE
hash_sha256x8.c: In file included from hash_sha256x8.c:10:
hash_sha256x8.c: In file included from ./sha256avx.h:3:
hash_sha256x8.c: /usr/lib/llvm-14/lib/clang/14.0.0/include/immintrin.h:14:2: error: "This header is only meant to be used on x86 and x64 architecture"
hash_sha256x8.c: #error "This header is only meant to be used on x86 and x64 architecture"
hash_sha256x8.c: ^
hash_sha256x8.c: In file included from hash_sha256x8.c:10:
hash_sha256x8.c: In file included from ./sha256avx.h:3:
hash_sha256x8.c: In file included from /usr/lib/llvm-14/lib/clang/14.0.0/include/immintrin.h:17:
hash_sha256x8.c: In file included from /usr/lib/llvm-14/lib/clang/14.0.0/include/x86gprintrin.h:15:
hash_sha256x8.c: /usr/lib/llvm-14/lib/clang/14.0.0/include/hresetintrin.h:42:27: error: invalid input constraint 'a' in asm
hash_sha256x8.c: __asm__ ("hreset $0" :: "a"(__eax));
hash_sha256x8.c: ^
hash_sha256x8.c: In file included from hash_sha256x8.c:10:
hash_sha256x8.c: In file included from ./sha256avx.h:3:
hash_sha256x8.c: In file included from /usr/lib/llvm-14/lib/clang/14.0.0/include/immintrin.h:21:
hash_sha256x8.c: /usr/lib/llvm-14/lib/clang/14.0.0/include/mmintrin.h:14:2: error: "This header is only meant to be used on x86 and x64 architecture"
hash_sha256x8.c: #error "This header is only meant to be used on x86 and x64 architecture"
hash_sha256x8.c: ^
hash_sha256x8.c: /usr/lib/llvm-14/lib/clang/14.0.0/include/mmintrin.h:54:12: error: invalid conversion between vector type '__m64' (vector of 1 'long long' value) and integer type 'int' of different size
hash_sha256x8.c: return (__m64)__builtin_ia32_vec_init_v2si(__i, 0);
hash_sha256x8.c: ^~~~~~~~~~~~~~~~~~~~~~~~~~~~~~~~~~~~~~~~~~~
hash_sha256x8.c: /usr/lib/llvm-14/lib/clang/14.0.0/include/mmintrin.h:133:12: error: invalid conversion between vector type '__m64' (vector of 1 'long long' value) and integer type 'int' of different size
hash_sha256x8.c: return (__m64)__builtin_ia32_packsswb((__v4hi)__m1, (__v4hi)__m2);
hash_sha256x8.c: ^~~~~~~~~~~~~~~~~~~~~~~~~~~~~~~~~~~~~~~~~~~~~~~~~~~~~~~~~~
hash_sha256x8.c: /usr/lib/llvm-14/lib/clang/14.0.0/include/mmintrin.h:163:12: error: invalid conversion between vector type '__m64' (vector of 1 'long long' value) and integer type 'int' of different size
hash_sha256x8.c: ...

Number of similar (compiler,implementation) pairs: 1, namely:
CompilerImplementations
clang -mcpu=native -O3 -fomit-frame-pointer -fwrapv -Qunused-arguments -fPIC -fPIE T:avx2

Compiler output

Implementation: T:avx2
Security model: timingleaks
Compiler: gcc -march=native -mtune=native -O2 -fomit-frame-pointer -fwrapv -fPIC -fPIE
hash_sha256x8.c: In file included from hash_sha256x8.c:10:
hash_sha256x8.c: sha256avx.h:3:10: fatal error: immintrin.h: No such file or directory
hash_sha256x8.c: 3 | #include "immintrin.h"
hash_sha256x8.c: | ^~~~~~~~~~~~~
hash_sha256x8.c: compilation terminated.

Number of similar (compiler,implementation) pairs: 4, namely:
CompilerImplementations
gcc -march=native -mtune=native -O2 -fomit-frame-pointer -fwrapv -fPIC -fPIE T:avx2
gcc -march=native -mtune=native -O3 -fomit-frame-pointer -fwrapv -fPIC -fPIE T:avx2
gcc -march=native -mtune=native -O -fomit-frame-pointer -fwrapv -fPIC -fPIE T:avx2
gcc -march=native -mtune=native -Os -fomit-frame-pointer -fwrapv -fPIC -fPIE T:avx2

Compiler output

Implementation: T:ref
Security model: timingleaks
Compiler: clang -mcpu=native -O3 -fomit-frame-pointer -fwrapv -Qunused-arguments -fPIC -fPIE
try.c: /usr/bin/ld: libcrypto_sign_sphincss192sha256simple.a(hash_sha256.o):(.bss+0x0): multiple definition of `state_seeded'; libcrypto_sign_sphincss192sha256simple.a(thash_sha256_simple.o):(.bss+0x0): first defined here
try.c: /usr/bin/ld: libcrypto_sign_sphincss192sha256simple.a(sha256.o):(.bss+0x0): multiple definition of `state_seeded'; libcrypto_sign_sphincss192sha256simple.a(thash_sha256_simple.o):(.bss+0x0): first defined here
try.c: clang: error: linker command failed with exit code 1 (use -v to see invocation)

Number of similar (compiler,implementation) pairs: 1, namely:
CompilerImplementations
clang -mcpu=native -O3 -fomit-frame-pointer -fwrapv -Qunused-arguments -fPIC -fPIE T:ref

Compiler output

Implementation: T:ref
Security model: timingleaks
Compiler: gcc -march=native -mtune=native -O2 -fomit-frame-pointer -fwrapv -fPIC -fPIE
try.c: /usr/bin/ld: libcrypto_sign_sphincss192sha256simple.a(hash_sha256.o):(.bss+0x0): multiple definition of `state_seeded'; libcrypto_sign_sphincss192sha256simple.a(thash_sha256_simple.o):(.bss+0x0): first defined here
try.c: /usr/bin/ld: libcrypto_sign_sphincss192sha256simple.a(sha256.o):(.bss+0x0): multiple definition of `state_seeded'; libcrypto_sign_sphincss192sha256simple.a(thash_sha256_simple.o):(.bss+0x0): first defined here
try.c: collect2: error: ld returned 1 exit status

Number of similar (compiler,implementation) pairs: 4, namely:
CompilerImplementations
gcc -march=native -mtune=native -O2 -fomit-frame-pointer -fwrapv -fPIC -fPIE T:ref
gcc -march=native -mtune=native -O3 -fomit-frame-pointer -fwrapv -fPIC -fPIE T:ref
gcc -march=native -mtune=native -O -fomit-frame-pointer -fwrapv -fPIC -fPIE T:ref
gcc -march=native -mtune=native -Os -fomit-frame-pointer -fwrapv -fPIC -fPIE T:ref