Implementation notes: aarch64, pi3bplus, crypto_core/invsntrup761

Computer: pi3bplus
Architecture: aarch64
CPU ID: 410fd034
SUPERCOP version: 20200702
Operation: crypto_core
Primitive: invsntrup761
TimeObject sizeTest sizeImplementationCompilerBenchmark dateSUPERCOP version
177792951540 0 011954 840 768refgcc_-march=native_-mtune=native_-O3_-fomit-frame-pointer_-fwrapv_-fPIC_-fPIE2020042120200417
503961001852 0 013293 768 760refclang_-mcpu=native_-O3_-fomit-frame-pointer_-fwrapv_-Qunused-arguments_-fPIC_-fPIE2020042120200417
81994080908 0 09967 824 752refgcc_-march=native_-mtune=native_-O2_-fomit-frame-pointer_-fwrapv_-fPIC_-fPIE2020042120200417
86717742744 0 09055 808 744refgcc_-march=native_-mtune=native_-Os_-fomit-frame-pointer_-fwrapv_-fPIC_-fPIE2020042120200417
103965443928 0 010119 824 752refgcc_-march=native_-mtune=native_-O_-fomit-frame-pointer_-fwrapv_-fPIC_-fPIE2020042120200417

Compiler output

Implementation: crypto_core/invsntrup761/jumpdivsteps
Compiler: clang -mcpu=native -O3 -fomit-frame-pointer -fwrapv -Qunused-arguments -fPIC -fPIE
avx-768.c: In file included from avx-768.c:4:
avx-768.c: In file included from /usr/lib/llvm-7/lib/clang/7.0.1/include/immintrin.h:28:
avx-768.c: /usr/lib/llvm-7/lib/clang/7.0.1/include/mmintrin.h:64:12: error: invalid conversion between vector type '__m64' (vector of 1 'long long' value) and integer type 'int' of different size
avx-768.c: return (__m64)__builtin_ia32_vec_init_v2si(__i, 0);
avx-768.c: ^~~~~~~~~~~~~~~~~~~~~~~~~~~~~~~~~~~~~~~~~~~
avx-768.c: /usr/lib/llvm-7/lib/clang/7.0.1/include/mmintrin.h:143:12: error: invalid conversion between vector type '__m64' (vector of 1 'long long' value) and integer type 'int' of different size
avx-768.c: return (__m64)__builtin_ia32_packsswb((__v4hi)__m1, (__v4hi)__m2);
avx-768.c: ^~~~~~~~~~~~~~~~~~~~~~~~~~~~~~~~~~~~~~~~~~~~~~~~~~~~~~~~~~
avx-768.c: /usr/lib/llvm-7/lib/clang/7.0.1/include/mmintrin.h:173:12: error: invalid conversion between vector type '__m64' (vector of 1 'long long' value) and integer type 'int' of different size
avx-768.c: return (__m64)__builtin_ia32_packssdw((__v2si)__m1, (__v2si)__m2);
avx-768.c: ^~~~~~~~~~~~~~~~~~~~~~~~~~~~~~~~~~~~~~~~~~~~~~~~~~~~~~~~~~
avx-768.c: /usr/lib/llvm-7/lib/clang/7.0.1/include/mmintrin.h:203:12: error: invalid conversion between vector type '__m64' (vector of 1 'long long' value) and integer type 'int' of different size
avx-768.c: return (__m64)__builtin_ia32_packuswb((__v4hi)__m1, (__v4hi)__m2);
avx-768.c: ^~~~~~~~~~~~~~~~~~~~~~~~~~~~~~~~~~~~~~~~~~~~~~~~~~~~~~~~~~
avx-768.c: /usr/lib/llvm-7/lib/clang/7.0.1/include/mmintrin.h:230:12: error: invalid conversion between vector type '__m64' (vector of 1 'long long' value) and integer type 'int' of different size
avx-768.c: return (__m64)__builtin_ia32_punpckhbw((__v8qi)__m1, (__v8qi)__m2);
avx-768.c: ^~~~~~~~~~~~~~~~~~~~~~~~~~~~~~~~~~~~~~~~~~~~~~~~~~~~~~~~~~~
avx-768.c: /usr/lib/llvm-7/lib/clang/7.0.1/include/mmintrin.h:253:12: error: invalid conversion between vector type '__m64' (vector of 1 'long long' value) and integer type 'int' of different size
avx-768.c: return (__m64)__builtin_ia32_punpckhwd((__v4hi)__m1, (__v4hi)__m2);
avx-768.c: ^~~~~~~~~~~~~~~~~~~~~~~~~~~~~~~~~~~~~~~~~~~~~~~~~~~~~~~~~~~
avx-768.c: /usr/lib/llvm-7/lib/clang/7.0.1/include/mmintrin.h:274:12: error: invalid conversion between vector type '__m64' (vector of 1 'long long' value) and integer type 'int' of different size
avx-768.c: return (__m64)__builtin_ia32_punpckhdq((__v2si)__m1, (__v2si)__m2);
avx-768.c: ^~~~~~~~~~~~~~~~~~~~~~~~~~~~~~~~~~~~~~~~~~~~~~~~~~~~~~~~~~~
avx-768.c: /usr/lib/llvm-7/lib/clang/7.0.1/include/mmintrin.h:301:12: error: invalid conversion between vector type '__m64' (vector of 1 'long long' value) and integer type 'int' of different size
avx-768.c: return (__m64)__builtin_ia32_punpcklbw((__v8qi)__m1, (__v8qi)__m2);
avx-768.c: ...

Number of similar (compiler,implementation) pairs: 1, namely:
CompilerImplementations
clang -mcpu=native -O3 -fomit-frame-pointer -fwrapv -Qunused-arguments -fPIC -fPIE jumpdivsteps

Compiler output

Implementation: crypto_core/invsntrup761/jumpdivsteps
Compiler: gcc -march=native -mtune=native -O2 -fomit-frame-pointer -fwrapv -fPIC -fPIE
avx-768.c: avx-768.c:4:10: fatal error: immintrin.h: No such file or directory
avx-768.c: #include <immintrin.h>
avx-768.c: ^~~~~~~~~~~~~
avx-768.c: compilation terminated.

Number of similar (compiler,implementation) pairs: 4, namely:
CompilerImplementations
gcc -march=native -mtune=native -O2 -fomit-frame-pointer -fwrapv -fPIC -fPIE jumpdivsteps
gcc -march=native -mtune=native -O3 -fomit-frame-pointer -fwrapv -fPIC -fPIE jumpdivsteps
gcc -march=native -mtune=native -O -fomit-frame-pointer -fwrapv -fPIC -fPIE jumpdivsteps
gcc -march=native -mtune=native -Os -fomit-frame-pointer -fwrapv -fPIC -fPIE jumpdivsteps