Implementation notes: mipso32, erpro8fsf2, crypto_hash/shake256

Computer: erpro8fsf2
Architecture: mipso32
CPU ID: unknown CPU ID
SUPERCOP version: 20210529
Operation: crypto_hash
Primitive: shake256
TimeObject sizeTest sizeImplementationCompilerBenchmark dateSUPERCOP version
1789241776 0 033718 376 760oncore32bitsgcc_-march=native_-mtune=native_-O3_-fomit-frame-pointer_-fwrapv_-fPIC_-fPIE2020102020201018
1808642224 0 032086 376 760oncore32bitsgcc_-march=native_-mtune=native_-O2_-fomit-frame-pointer_-fwrapv_-fPIC_-fPIE2020102020201018
1825501520 0 077227 376 760oncore64bitsgcc_-march=native_-mtune=native_-O3_-fomit-frame-pointer_-fwrapv_-fPIC_-fPIE2020102020201018
1825941296 0 074923 376 760oncore64bitsgcc_-march=native_-mtune=native_-O2_-fomit-frame-pointer_-fwrapv_-fPIC_-fPIE2020102020201018
1831661072 0 074207 368 760oncore64bitsgcc_-march=native_-mtune=native_-Os_-fomit-frame-pointer_-fwrapv_-fPIC_-fPIE2020102020201018
1832521248 0 075563 376 760oncore64bitsgcc_-march=native_-mtune=native_-O_-fomit-frame-pointer_-fwrapv_-fPIC_-fPIE2020102020201018
1892942144 0 031514 368 760oncore32bitsgcc_-march=native_-mtune=native_-Os_-fomit-frame-pointer_-fwrapv_-fPIC_-fPIE2020102020201018
1902162272 0 032822 376 760oncore32bitsgcc_-march=native_-mtune=native_-O_-fomit-frame-pointer_-fwrapv_-fPIC_-fPIE2020102020201018
2778424032 0 019022 320 760gil/singlefilegcc_-march=native_-mtune=native_-Os_-fomit-frame-pointer_-fwrapv_-fPIC_-fPIE2020102020201018
4047307376 0 023546 328 760gil/singlefilegcc_-march=native_-mtune=native_-O_-fomit-frame-pointer_-fwrapv_-fPIC_-fPIE2020102020201018
474074144 0 041208 396 760usekcpgcc_-march=native_-mtune=native_-Os_-fomit-frame-pointer_-fwrapv_-fPIC_-fPIE2020102020201018
474112144 0 042388 404 760usekcpgcc_-march=native_-mtune=native_-O_-fomit-frame-pointer_-fwrapv_-fPIC_-fPIE2020102020201018
474128144 0 041700 404 760usekcpgcc_-march=native_-mtune=native_-O2_-fomit-frame-pointer_-fwrapv_-fPIC_-fPIE2020102020201018
474390144 0 043780 404 760usekcpgcc_-march=native_-mtune=native_-O3_-fomit-frame-pointer_-fwrapv_-fPIC_-fPIE2020102020201018
62190611600 0 029162 328 760gil/singlefilegcc_-march=native_-mtune=native_-O3_-fomit-frame-pointer_-fwrapv_-fPIC_-fPIE2020102020201018
63744011440 0 026922 328 760gil/singlefilegcc_-march=native_-mtune=native_-O2_-fomit-frame-pointer_-fwrapv_-fPIC_-fPIE2020102020201018
64965660720 0 075719 324 760gil/singlefile_unrolledgcc_-march=native_-mtune=native_-Os_-fomit-frame-pointer_-fwrapv_-fPIC_-fPIE2020102020201018
739914120736 0 0136915 336 760gil/singlefile_unrolledgcc_-march=native_-mtune=native_-O_-fomit-frame-pointer_-fwrapv_-fPIC_-fPIE2020102020201018
101655298112 0 0115683 332 760gil/singlefile_unrolledgcc_-march=native_-mtune=native_-O3_-fomit-frame-pointer_-fwrapv_-fPIC_-fPIE2020102020201018
102873097808 0 0113299 332 760gil/singlefile_unrolledgcc_-march=native_-mtune=native_-O2_-fomit-frame-pointer_-fwrapv_-fPIC_-fPIE2020102020201018

Compiler output

Implementation: kcp/optimized1600ARMv7A
Security model: constbranchindex
Compiler: gcc -march=native -mtune=native -O2 -fomit-frame-pointer -fwrapv -fPIC -fPIE
keccak.s: keccak.s: Assembler messages:
keccak.s: keccak.s:1: Error: junk at end of line, first unrecognized character is `@'
keccak.s: keccak.s:2: Error: junk at end of line, first unrecognized character is `@'
keccak.s: keccak.s:3: Error: junk at end of line, first unrecognized character is `@'
keccak.s: keccak.s:4: Error: junk at end of line, first unrecognized character is `@'
keccak.s: keccak.s:5: Error: junk at end of line, first unrecognized character is `@'
keccak.s: keccak.s:6: Error: junk at end of line, first unrecognized character is `@'
keccak.s: keccak.s:7: Error: junk at end of line, first unrecognized character is `@'
keccak.s: keccak.s:8: Error: junk at end of line, first unrecognized character is `@'
keccak.s: keccak.s:9: Error: junk at end of line, first unrecognized character is `@'
keccak.s: keccak.s:10: Error: junk at end of line, first unrecognized character is `@'
keccak.s: keccak.s:11: Error: junk at end of line, first unrecognized character is `@'
keccak.s: keccak.s:12: Error: junk at end of line, first unrecognized character is `@'
keccak.s: keccak.s:13: Error: junk at end of line, first unrecognized character is `@'
keccak.s: keccak.s:14: Error: junk at end of line, first unrecognized character is `@'
keccak.s: keccak.s:16: Error: junk at end of line, first unrecognized character is `@'
keccak.s: keccak.s:17: Error: junk at end of line, first unrecognized character is `@'
keccak.s: keccak.s:18: Error: junk at end of line, first unrecognized character is `@'
keccak.s: keccak.s:21: Error: unknown pseudo-op: `.syntax'
keccak.s: keccak.s:22: Error: unknown pseudo-op: `.fpu'
keccak.s: keccak.s:23: Error: unknown pseudo-op: `.arm'
keccak.s: keccak.s:26: Error: junk at end of line, first unrecognized character is `@'
keccak.s: keccak.s:27: Error: junk at end of line, first unrecognized character is `@'
keccak.s: keccak.s:29: Error: junk at end of line, first unrecognized character is `@'
keccak.s: keccak.s:56: Error: junk at end of line, first unrecognized character is `@'
keccak.s: ...

Number of similar (compiler,implementation) pairs: 4, namely:
CompilerImplementations
gcc -march=native -mtune=native -O2 -fomit-frame-pointer -fwrapv -fPIC -fPIE kcp/optimized1600ARMv7A
gcc -march=native -mtune=native -O3 -fomit-frame-pointer -fwrapv -fPIC -fPIE kcp/optimized1600ARMv7A
gcc -march=native -mtune=native -O -fomit-frame-pointer -fwrapv -fPIC -fPIE kcp/optimized1600ARMv7A
gcc -march=native -mtune=native -Os -fomit-frame-pointer -fwrapv -fPIC -fPIE kcp/optimized1600ARMv7A

Compiler output

Implementation: kcp/optimized1600ARMv8A
Security model: constbranchindex
Compiler: gcc -march=native -mtune=native -O2 -fomit-frame-pointer -fwrapv -fPIC -fPIE
keccak.s: keccak.s: Assembler messages:
keccak.s: keccak.s:1: Error: junk at end of line, first unrecognized character is `/'
keccak.s: keccak.s:2: Error: junk at end of line, first unrecognized character is `/'
keccak.s: keccak.s:3: Error: junk at end of line, first unrecognized character is `/'
keccak.s: keccak.s:4: Error: junk at end of line, first unrecognized character is `/'
keccak.s: keccak.s:6: Error: junk at end of line, first unrecognized character is `/'
keccak.s: keccak.s:7: Error: junk at end of line, first unrecognized character is `/'
keccak.s: keccak.s:8: Error: junk at end of line, first unrecognized character is `/'
keccak.s: keccak.s:9: Error: junk at end of line, first unrecognized character is `/'
keccak.s: keccak.s:11: Error: junk at end of line, first unrecognized character is `/'
keccak.s: keccak.s:12: Error: junk at end of line, first unrecognized character is `/'
keccak.s: keccak.s:13: Error: junk at end of line, first unrecognized character is `/'
keccak.s: keccak.s:14: Error: junk at end of line, first unrecognized character is `/'
keccak.s: keccak.s:15: Error: junk at end of line, first unrecognized character is `/'
keccak.s: keccak.s:17: Error: junk at end of line, first unrecognized character is `/'
keccak.s: keccak.s:18: Error: junk at end of line, first unrecognized character is `/'
keccak.s: keccak.s:19: Error: junk at end of line, first unrecognized character is `/'
keccak.s: keccak.s:20: Error: junk at end of line, first unrecognized character is `/'
keccak.s: keccak.s:22: Error: junk at end of line, first unrecognized character is `/'
keccak.s: keccak.s:23: Error: junk at end of line, first unrecognized character is `/'
keccak.s: keccak.s:24: Error: junk at end of line, first unrecognized character is `/'
keccak.s: keccak.s:25: Error: junk at end of line, first unrecognized character is `/'
keccak.s: keccak.s:27: Error: junk at end of line, first unrecognized character is `/'
keccak.s: keccak.s:29: Error: junk at end of line, first unrecognized character is `/'
keccak.s: keccak.s:30: Error: junk at end of line, first unrecognized character is `/'
keccak.s: ...

Number of similar (compiler,implementation) pairs: 4, namely:
CompilerImplementations
gcc -march=native -mtune=native -O2 -fomit-frame-pointer -fwrapv -fPIC -fPIE kcp/optimized1600ARMv8A
gcc -march=native -mtune=native -O3 -fomit-frame-pointer -fwrapv -fPIC -fPIE kcp/optimized1600ARMv8A
gcc -march=native -mtune=native -O -fomit-frame-pointer -fwrapv -fPIC -fPIE kcp/optimized1600ARMv8A
gcc -march=native -mtune=native -Os -fomit-frame-pointer -fwrapv -fPIC -fPIE kcp/optimized1600ARMv8A

Compiler output

Implementation: kcp/optimized1600AVX2
Security model: constbranchindex
Compiler: gcc -march=native -mtune=native -O2 -fomit-frame-pointer -fwrapv -fPIC -fPIE
KeccakP-1600-AVX2.c: KeccakP-1600-AVX2.c:20:27: fatal error: x86intrin.h: No such file or directory
KeccakP-1600-AVX2.c: #include <x86intrin.h>
KeccakP-1600-AVX2.c: ^
KeccakP-1600-AVX2.c: compilation terminated.

Number of similar (compiler,implementation) pairs: 4, namely:
CompilerImplementations
gcc -march=native -mtune=native -O2 -fomit-frame-pointer -fwrapv -fPIC -fPIE kcp/optimized1600AVX2
gcc -march=native -mtune=native -O3 -fomit-frame-pointer -fwrapv -fPIC -fPIE kcp/optimized1600AVX2
gcc -march=native -mtune=native -O -fomit-frame-pointer -fwrapv -fPIC -fPIE kcp/optimized1600AVX2
gcc -march=native -mtune=native -Os -fomit-frame-pointer -fwrapv -fPIC -fPIE kcp/optimized1600AVX2

Compiler output

Implementation: kcp/optimized1600AVX512
Security model: constbranchindex
Compiler: gcc -march=native -mtune=native -O2 -fomit-frame-pointer -fwrapv -fPIC -fPIE
KeccakP-1600-AVX512.c: KeccakP-1600-AVX512.c:24:23: fatal error: smmintrin.h: No such file or directory
KeccakP-1600-AVX512.c: #include <smmintrin.h>
KeccakP-1600-AVX512.c: ^
KeccakP-1600-AVX512.c: compilation terminated.

Number of similar (compiler,implementation) pairs: 4, namely:
CompilerImplementations
gcc -march=native -mtune=native -O2 -fomit-frame-pointer -fwrapv -fPIC -fPIE kcp/optimized1600AVX512
gcc -march=native -mtune=native -O3 -fomit-frame-pointer -fwrapv -fPIC -fPIE kcp/optimized1600AVX512
gcc -march=native -mtune=native -O -fomit-frame-pointer -fwrapv -fPIC -fPIE kcp/optimized1600AVX512
gcc -march=native -mtune=native -Os -fomit-frame-pointer -fwrapv -fPIC -fPIE kcp/optimized1600AVX512

Compiler output

Implementation: openssl
Security model: constbranchindex
Compiler: gcc -march=native -mtune=native -O2 -fomit-frame-pointer -fwrapv -fPIC -fPIE
hash.c: hash.c: In function 'crypto_hash_shake256_openssl_constbranchindex':
hash.c: hash.c:13:36: warning: passing argument 2 of 'EVP_DigestInit_ex' makes pointer from integer without a cast
hash.c: if (ok) ok = EVP_DigestInit_ex(x,EVP_shake256(),NULL);
hash.c: ^
hash.c: In file included from hash.c:2:0:
hash.c: /usr/include/openssl/evp.h:572:5: note: expected 'const struct EVP_MD *' but argument is of type 'int'
hash.c: int EVP_DigestInit_ex(EVP_MD_CTX *ctx, const EVP_MD *type, ENGINE *impl);
hash.c: ^
try.c: crypto_hash_shake256.a(hash.o): In function `crypto_hash_shake256_openssl_constbranchindex':
try.c: hash.c:(.text+0x...): undefined reference to `EVP_shake256'
try.c: hash.c:(.text+0x...): undefined reference to `EVP_DigestFinalXOF'
try.c: collect2: error: ld returned 1 exit status

Number of similar (compiler,implementation) pairs: 4, namely:
CompilerImplementations
gcc -march=native -mtune=native -O2 -fomit-frame-pointer -fwrapv -fPIC -fPIE openssl
gcc -march=native -mtune=native -O3 -fomit-frame-pointer -fwrapv -fPIC -fPIE openssl
gcc -march=native -mtune=native -O -fomit-frame-pointer -fwrapv -fPIC -fPIE openssl
gcc -march=native -mtune=native -Os -fomit-frame-pointer -fwrapv -fPIC -fPIE openssl