Implementation notes: mipso32, erpro8fsf2, crypto_aead/kiasuneq128v1

Computer: erpro8fsf2
Architecture: mipso32
CPU ID: unknown CPU ID
SUPERCOP version: 20210529
Operation: crypto_aead
Primitive: kiasuneq128v1
TimeObject sizeTest sizeImplementationCompilerBenchmark dateSUPERCOP version
71884823952 0 047478 360 832T:refgcc_-march=native_-mtune=native_-O3_-fomit-frame-pointer_-fwrapv_-fPIC_-fPIE2020102120201018
77452021840 0 043286 360 832T:refgcc_-march=native_-mtune=native_-O2_-fomit-frame-pointer_-fwrapv_-fPIC_-fPIE2020102120201018
101070420752 0 041250 352 832T:refgcc_-march=native_-mtune=native_-Os_-fomit-frame-pointer_-fwrapv_-fPIC_-fPIE2020102120201018
162926821328 0 043462 360 832T:refgcc_-march=native_-mtune=native_-O_-fomit-frame-pointer_-fwrapv_-fPIC_-fPIE2020102120201018

Compiler output

Implementation: T:bitslice
Security model: timingleaks
Compiler: gcc -march=native -mtune=native -O2 -fomit-frame-pointer -fwrapv -fPIC -fPIE
kiasu.c: kiasu.c: In function 'kiasu_aead_encrypt':
kiasu.c: kiasu.c:256:13: error: unknown type name 'block'
kiasu.c: ALIGN(16) block Auth; /* Auth value during the mode */
kiasu.c: ^
kiasu.c: kiasu.c:257:13: error: unknown type name 'block'
kiasu.c: ALIGN(16) block Checksum; /* Checksum on the plaintext blocks */
kiasu.c: ^
kiasu.c: kiasu.c:258:13: error: unknown type name 'block'
kiasu.c: ALIGN(16) block PaddedBlock; /* Padded blocks if needed, otherwise the zero bock */
kiasu.c: ^
kiasu.c: kiasu.c:259:13: error: unknown type name 'block'
kiasu.c: ALIGN(16) block ta[BPI]; /* 8 blocks for parallel processing */
kiasu.c: ^
kiasu.c: kiasu.c:260:19: error: unknown type name 'block'
kiasu.c: ALIGN(16) const block* adp; /* Pointer to the blocks to process */
kiasu.c: ^
kiasu.c: kiasu.c:262:13: error: unknown type name '__m128i'
kiasu.c: ALIGN(16) __m128i tmpblock;
kiasu.c: ^
kiasu.c: kiasu.c:271:10: error: 'block' undeclared (first use in this function)
kiasu.c: adp = (block *)ad;
kiasu.c: ^
kiasu.c: kiasu.c:271:10: note: each undeclared identifier is reported only once for each function it appears in
kiasu.c: kiasu.c:271:17: error: expected expression before ')' token
kiasu.c: adp = (block *)ad;
kiasu.c: ...

Number of similar (compiler,implementation) pairs: 4, namely:
CompilerImplementations
gcc -march=native -mtune=native -O2 -fomit-frame-pointer -fwrapv -fPIC -fPIE T:bitslice
gcc -march=native -mtune=native -O3 -fomit-frame-pointer -fwrapv -fPIC -fPIE T:bitslice
gcc -march=native -mtune=native -O -fomit-frame-pointer -fwrapv -fPIC -fPIE T:bitslice
gcc -march=native -mtune=native -Os -fomit-frame-pointer -fwrapv -fPIC -fPIE T:bitslice

Compiler output

Implementation: T:opt
Security model: timingleaks
Compiler: gcc -march=native -mtune=native -O2 -fomit-frame-pointer -fwrapv -fPIC -fPIE
kiasu.c: kiasu.c:26:74: fatal error: xmmintrin.h: No such file or directory
kiasu.c: #include <xmmintrin.h> /* SSE instructions and _mm_malloc */
kiasu.c: ^
kiasu.c: compilation terminated.

Number of similar (compiler,implementation) pairs: 4, namely:
CompilerImplementations
gcc -march=native -mtune=native -O2 -fomit-frame-pointer -fwrapv -fPIC -fPIE T:opt
gcc -march=native -mtune=native -O3 -fomit-frame-pointer -fwrapv -fPIC -fPIE T:opt
gcc -march=native -mtune=native -O -fomit-frame-pointer -fwrapv -fPIC -fPIE T:opt
gcc -march=native -mtune=native -Os -fomit-frame-pointer -fwrapv -fPIC -fPIE T:opt

Namespace violations

Implementation: T:ref
Security model: timingleaks
Compiler: gcc -march=native -mtune=native -O2 -fomit-frame-pointer -fwrapv -fPIC -fPIE
kiasu.o kiasu_aead_decrypt T
kiasu.o kiasu_aead_encrypt T
tweakable_aes.o aesTweakDecrypt T
tweakable_aes.o aesTweakEncrypt T

Number of similar (compiler,implementation) pairs: 4, namely:
CompilerImplementations
gcc -march=native -mtune=native -O2 -fomit-frame-pointer -fwrapv -fPIC -fPIE T:ref
gcc -march=native -mtune=native -O3 -fomit-frame-pointer -fwrapv -fPIC -fPIE T:ref
gcc -march=native -mtune=native -O -fomit-frame-pointer -fwrapv -fPIC -fPIE T:ref
gcc -march=native -mtune=native -Os -fomit-frame-pointer -fwrapv -fPIC -fPIE T:ref