Implementation notes: armeabi, rpi3b, crypto_encrypt/lotus192

Computer: rpi3b
Architecture: armeabi
CPU ID: unknown CPU ID
SUPERCOP version: 20191221
Operation: crypto_encrypt
Primitive: lotus192
TimeObject sizeTest sizeImplementationCompilerBenchmark dateSUPERCOP version
2266219333129 0 451678 496 1520optgcc_-march=native_-mtune=native_-O3_-fomit-frame-pointer_-fwrapv_-fPIC_-fPIE2020011520191221

Test failure

Implementation: opt
Security model: unknown
Compiler: clang -mcpu=native -O3 -fomit-frame-pointer -fwrapv -Qunused-arguments -fPIC -fPIE
error 111

Number of similar (compiler,implementation) pairs: 4, namely:
CompilerImplementations
clang -mcpu=native -O3 -fomit-frame-pointer -fwrapv -Qunused-arguments -fPIC -fPIE opt
gcc -march=native -mtune=native -O -fomit-frame-pointer -fwrapv -fPIC -fPIE opt
clang -mcpu=native -O3 -fomit-frame-pointer -fwrapv -Qunused-arguments -fPIC -fPIE ref
gcc -march=native -mtune=native -O -fomit-frame-pointer -fwrapv -fPIC -fPIE ref

Test failure

Implementation: opt
Security model: unknown
Compiler: gcc -march=native -mtune=native -O2 -fomit-frame-pointer -fwrapv -fPIC -fPIE
error 111
crypto_encrypt_open does not handle c=t overlap

Number of similar (compiler,implementation) pairs: 5, namely:
CompilerImplementations
gcc -march=native -mtune=native -O2 -fomit-frame-pointer -fwrapv -fPIC -fPIE opt
gcc -march=native -mtune=native -Os -fomit-frame-pointer -fwrapv -fPIC -fPIE opt
gcc -march=native -mtune=native -O2 -fomit-frame-pointer -fwrapv -fPIC -fPIE ref
gcc -march=native -mtune=native -O3 -fomit-frame-pointer -fwrapv -fPIC -fPIE ref
gcc -march=native -mtune=native -Os -fomit-frame-pointer -fwrapv -fPIC -fPIE ref

Compiler output

Implementation: avx2
Security model: unknown
Compiler: clang -mcpu=native -O3 -fomit-frame-pointer -fwrapv -Qunused-arguments -fPIC -fPIE
lwe-arithmetics_avx2.c: In file included from lwe-arithmetics_avx2.c:10:
lwe-arithmetics_avx2.c: In file included from /usr/lib/llvm-3.8/bin/../lib/clang/3.8.1/include/immintrin.h:27:
lwe-arithmetics_avx2.c: /usr/lib/llvm-3.8/bin/../lib/clang/3.8.1/include/mmintrin.h:45:12: error: invalid conversion between vector type '__m64' (vector of 1 'long long' value) and integer type 'int' of different size
lwe-arithmetics_avx2.c: return (__m64)__builtin_ia32_vec_init_v2si(__i, 0);
lwe-arithmetics_avx2.c: ^~~~~~~~~~~~~~~~~~~~~~~~~~~~~~~~~~~~~~~~~~~
lwe-arithmetics_avx2.c: /usr/lib/llvm-3.8/bin/../lib/clang/3.8.1/include/mmintrin.h:69:12: error: invalid conversion between vector type '__m64' (vector of 1 'long long' value) and integer type 'int' of different size
lwe-arithmetics_avx2.c: return (__m64)__builtin_ia32_packsswb((__v4hi)__m1, (__v4hi)__m2);
lwe-arithmetics_avx2.c: ^~~~~~~~~~~~~~~~~~~~~~~~~~~~~~~~~~~~~~~~~~~~~~~~~~~~~~~~~~
lwe-arithmetics_avx2.c: /usr/lib/llvm-3.8/bin/../lib/clang/3.8.1/include/mmintrin.h:75:12: error: invalid conversion between vector type '__m64' (vector of 1 'long long' value) and integer type 'int' of different size
lwe-arithmetics_avx2.c: return (__m64)__builtin_ia32_packssdw((__v2si)__m1, (__v2si)__m2);
lwe-arithmetics_avx2.c: ^~~~~~~~~~~~~~~~~~~~~~~~~~~~~~~~~~~~~~~~~~~~~~~~~~~~~~~~~~
lwe-arithmetics_avx2.c: /usr/lib/llvm-3.8/bin/../lib/clang/3.8.1/include/mmintrin.h:81:12: error: invalid conversion between vector type '__m64' (vector of 1 'long long' value) and integer type 'int' of different size
lwe-arithmetics_avx2.c: return (__m64)__builtin_ia32_packuswb((__v4hi)__m1, (__v4hi)__m2);
lwe-arithmetics_avx2.c: ^~~~~~~~~~~~~~~~~~~~~~~~~~~~~~~~~~~~~~~~~~~~~~~~~~~~~~~~~~
lwe-arithmetics_avx2.c: /usr/lib/llvm-3.8/bin/../lib/clang/3.8.1/include/mmintrin.h:87:12: error: invalid conversion between vector type '__m64' (vector of 1 'long long' value) and integer type 'int' of different size
lwe-arithmetics_avx2.c: return (__m64)__builtin_ia32_punpckhbw((__v8qi)__m1, (__v8qi)__m2);
lwe-arithmetics_avx2.c: ^~~~~~~~~~~~~~~~~~~~~~~~~~~~~~~~~~~~~~~~~~~~~~~~~~~~~~~~~~~
lwe-arithmetics_avx2.c: /usr/lib/llvm-3.8/bin/../lib/clang/3.8.1/include/mmintrin.h:93:12: error: invalid conversion between vector type '__m64' (vector of 1 'long long' value) and integer type 'int' of different size
lwe-arithmetics_avx2.c: return (__m64)__builtin_ia32_punpckhwd((__v4hi)__m1, (__v4hi)__m2);
lwe-arithmetics_avx2.c: ^~~~~~~~~~~~~~~~~~~~~~~~~~~~~~~~~~~~~~~~~~~~~~~~~~~~~~~~~~~
lwe-arithmetics_avx2.c: /usr/lib/llvm-3.8/bin/../lib/clang/3.8.1/include/mmintrin.h:99:12: error: invalid conversion between vector type '__m64' (vector of 1 'long long' value) and integer type 'int' of different size
lwe-arithmetics_avx2.c: return (__m64)__builtin_ia32_punpckhdq((__v2si)__m1, (__v2si)__m2);
lwe-arithmetics_avx2.c: ^~~~~~~~~~~~~~~~~~~~~~~~~~~~~~~~~~~~~~~~~~~~~~~~~~~~~~~~~~~
lwe-arithmetics_avx2.c: /usr/lib/llvm-3.8/bin/../lib/clang/3.8.1/include/mmintrin.h:105:12: error: invalid conversion between vector type '__m64' (vector of 1 'long long' value) and integer type 'int' of different size
lwe-arithmetics_avx2.c: return (__m64)__builtin_ia32_punpcklbw((__v8qi)__m1, (__v8qi)__m2);
lwe-arithmetics_avx2.c: ...

Number of similar (compiler,implementation) pairs: 1, namely:
CompilerImplementations
clang -mcpu=native -O3 -fomit-frame-pointer -fwrapv -Qunused-arguments -fPIC -fPIE avx2

Compiler output

Implementation: avx2
Security model: unknown
Compiler: gcc -march=native -mtune=native -O2 -fomit-frame-pointer -fwrapv -fPIC -fPIE
lwe-arithmetics_avx2.c: lwe-arithmetics_avx2.c:10:23: fatal error: immintrin.h: No such file or directory
lwe-arithmetics_avx2.c: #include <immintrin.h>
lwe-arithmetics_avx2.c: ^
lwe-arithmetics_avx2.c: compilation terminated.

Number of similar (compiler,implementation) pairs: 4, namely:
CompilerImplementations
gcc -march=native -mtune=native -O2 -fomit-frame-pointer -fwrapv -fPIC -fPIE avx2
gcc -march=native -mtune=native -O3 -fomit-frame-pointer -fwrapv -fPIC -fPIE avx2
gcc -march=native -mtune=native -O -fomit-frame-pointer -fwrapv -fPIC -fPIE avx2
gcc -march=native -mtune=native -Os -fomit-frame-pointer -fwrapv -fPIC -fPIE avx2

Namespace violations

Implementation: opt
Security model: unknown
Compiler: gcc -march=native -mtune=native -O3 -fomit-frame-pointer -fwrapv -fPIC -fPIE
cpa-pke_opt.o lotus_cpa_pke_dec_packed T
cpa-pke_opt.o lotus_cpa_pke_enc_packed T
cpa-pke_opt.o lotus_cpa_pke_keypair T
crypto.o crypto_symenc_decrypt T
crypto.o crypto_symenc_encrypt T
crypto.o crypto_symenc_keysetup T
crypto.o crypto_symenc_keystream T
crypto.o crypto_symenc_keystream_13block T
crypto.o crypto_symenc_keystream_32block T
encrypt.o util_cmp_const T
lwe-arithmetics_opt.o add_sigma T
lwe-arithmetics_opt.o distribute_2x2_nl T
lwe-arithmetics_opt.o distribute_2x2_nn T
lwe-arithmetics_opt.o merge_2x2_nl T
lwe-arithmetics_opt.o reconstruct T
lwe-arithmetics_opt.o redc T
lwe-arithmetics_opt.o submat_add_nl T
lwe-arithmetics_opt.o submat_add_nn T
lwe-arithmetics_opt.o submat_negmul T
lwe-arithmetics_opt.o submat_negsubmul T
lwe-arithmetics_opt.o submat_sub_nl T
lwe-arithmetics_opt.o submat_sub_nn T
lwe-arithmetics_opt.o submat_submul T
lwe-arithmetics_opt.o submul T
pack.o pack_128dg T
pack.o pack_128elems T
pack.o pack_64elems T
pack.o pack_ct T
pack.o pack_pk T
pack.o pack_sk T
pack.o unpack_128dg T
pack.o unpack_128elems T
pack.o unpack_64elems T
pack.o unpack_ct T
pack.o unpack_pk T
pack.o unpack_sk T
sampler.o _LOTUS_KYDG_SAMPLER_L1_pMat R
sampler.o _LOTUS_KYDG_SAMPLER_L1_weight R
sampler.o _LOTUS_KYDG_SAMPLER_LUT R
sampler.o csprng_sample_bit T
sampler.o csprng_sample_byte T
sampler.o extend_sign_with_random_bit T
sampler.o sample_discrete_gaussian T
sampler.o sample_uniform T
sampler.o sample_unit_discrete_gaussian T
sampler.o sampler_init T
sampler.o sampler_set_seed T
sampler.o scan_bit_and_output T

Number of similar (compiler,implementation) pairs: 1, namely:
CompilerImplementations
gcc -march=native -mtune=native -O3 -fomit-frame-pointer -fwrapv -fPIC -fPIE opt