Implementation notes: armeabi, berry2, crypto_hash/esch256v2

Computer: berry2
Microarchitecture: armeabi; Cortex-A7 (410fc075)
Architecture: armeabi
CPU ID: unknown CPU ID
SUPERCOP version: 20221122
Operation: crypto_hash
Primitive: esch256v2
TimeObject sizeTest sizeImplementationCompilerBenchmark dateSUPERCOP version
1555822489 0 012251 388 744T:optgcc_-march=native_-mtune=native_-O3_-fomit-frame-pointer_-fwrapv_-fPIC_-fPIE2022100920221005
1969922021 0 09448 380 744T:optgcc_-march=native_-mtune=native_-Os_-fomit-frame-pointer_-fwrapv_-fPIC_-fPIE2022100920221005
2009762509 0 010499 392 744T:refgcc_-march=native_-mtune=native_-O2_-fomit-frame-pointer_-fwrapv_-fPIC_-fPIE2022100920221005
2091948473 0 018291 392 744T:refgcc_-march=native_-mtune=native_-O3_-fomit-frame-pointer_-fwrapv_-fPIC_-fPIE2022100920221005
2095423793 0 023088 392 760T:optclang_-mcpu=native_-O3_-fomit-frame-pointer_-fwrapv_-Qunused-arguments_-fPIC_-fPIE2022100920221005
2282485611 0 024951 396 760T:refclang_-mcpu=native_-O3_-fomit-frame-pointer_-fwrapv_-Qunused-arguments_-fPIC_-fPIE2022100920221005
2357602553 0 010551 392 744T:refgcc_-march=native_-mtune=native_-O_-fomit-frame-pointer_-fwrapv_-fPIC_-fPIE2022100920221005
2431122325 0 09808 384 744T:refgcc_-march=native_-mtune=native_-Os_-fomit-frame-pointer_-fwrapv_-fPIC_-fPIE2022100920221005
2900422501 0 010435 388 744T:optgcc_-march=native_-mtune=native_-O2_-fomit-frame-pointer_-fwrapv_-fPIC_-fPIE2022100920221005
3204422505 0 010447 388 744T:optgcc_-march=native_-mtune=native_-O_-fomit-frame-pointer_-fwrapv_-fPIC_-fPIE2022100920221005

Compiler output

Implementation: T:add_armv6m
Security model: timingleaks
Compiler: clang -mcpu=native -O3 -fomit-frame-pointer -fwrapv -Qunused-arguments -fPIC -fPIE
sparkle384_v6m.S: sparkle384_v6m.S:347:1: error: unknown directive
sparkle384_v6m.S: .func sparkle384_arm
sparkle384_v6m.S: ^
sparkle384_v6m.S: sparkle384_v6m.S:363:1: error: unknown directive
sparkle384_v6m.S: .endfunc
sparkle384_v6m.S: ^

Number of similar (compiler,implementation) pairs: 1, namely:
CompilerImplementations
clang -mcpu=native -O3 -fomit-frame-pointer -fwrapv -Qunused-arguments -fPIC -fPIE T:add_armv6m

Compiler output

Implementation: T:add_armv6m
Security model: timingleaks
Compiler: gcc -march=native -mtune=native -O2 -fomit-frame-pointer -fwrapv -fPIC -fPIE
try.c: /usr/bin/ld: error: libcrypto_hash_esch256v2.a(sparkle384_v6m.o): conflicting architecture profiles M/A
try.c: /usr/bin/ld: failed to merge target specific data of file libcrypto_hash_esch256v2.a(sparkle384_v6m.o)
try.c: collect2: error: ld returned 1 exit status

Number of similar (compiler,implementation) pairs: 4, namely:
CompilerImplementations
gcc -march=native -mtune=native -O2 -fomit-frame-pointer -fwrapv -fPIC -fPIE T:add_armv6m
gcc -march=native -mtune=native -O3 -fomit-frame-pointer -fwrapv -fPIC -fPIE T:add_armv6m
gcc -march=native -mtune=native -O -fomit-frame-pointer -fwrapv -fPIC -fPIE T:add_armv6m
gcc -march=native -mtune=native -Os -fomit-frame-pointer -fwrapv -fPIC -fPIE T:add_armv6m

Compiler output

Implementation: T:add_armv7m_fast
Security model: timingleaks
Compiler: clang -mcpu=native -O3 -fomit-frame-pointer -fwrapv -Qunused-arguments -fPIC -fPIE
sparkle384f_v7m.S: sparkle384f_v7m.S:537:1: error: unknown directive
sparkle384f_v7m.S: .func sparkle384_arm
sparkle384f_v7m.S: ^
sparkle384f_v7m.S: sparkle384f_v7m.S:553:1: error: unknown directive
sparkle384f_v7m.S: .endfunc
sparkle384f_v7m.S: ^

Number of similar (compiler,implementation) pairs: 1, namely:
CompilerImplementations
clang -mcpu=native -O3 -fomit-frame-pointer -fwrapv -Qunused-arguments -fPIC -fPIE T:add_armv7m_fast

Compiler output

Implementation: T:add_armv7m_fast
Security model: timingleaks
Compiler: gcc -march=native -mtune=native -O2 -fomit-frame-pointer -fwrapv -fPIC -fPIE
try.c: /usr/bin/ld: error: libcrypto_hash_esch256v2.a(sparkle384f_v7m.o): conflicting architecture profiles M/A
try.c: /usr/bin/ld: failed to merge target specific data of file libcrypto_hash_esch256v2.a(sparkle384f_v7m.o)
try.c: collect2: error: ld returned 1 exit status

Number of similar (compiler,implementation) pairs: 4, namely:
CompilerImplementations
gcc -march=native -mtune=native -O2 -fomit-frame-pointer -fwrapv -fPIC -fPIE T:add_armv7m_fast
gcc -march=native -mtune=native -O3 -fomit-frame-pointer -fwrapv -fPIC -fPIE T:add_armv7m_fast
gcc -march=native -mtune=native -O -fomit-frame-pointer -fwrapv -fPIC -fPIE T:add_armv7m_fast
gcc -march=native -mtune=native -Os -fomit-frame-pointer -fwrapv -fPIC -fPIE T:add_armv7m_fast

Compiler output

Implementation: T:add_armv7m_small
Security model: timingleaks
Compiler: clang -mcpu=native -O3 -fomit-frame-pointer -fwrapv -Qunused-arguments -fPIC -fPIE
sparkle384s_v7m.S: sparkle384s_v7m.S:191:1: error: unknown directive
sparkle384s_v7m.S: .func sparkle384_arm
sparkle384s_v7m.S: ^
sparkle384s_v7m.S: sparkle384s_v7m.S:205:1: error: unknown directive
sparkle384s_v7m.S: .endfunc
sparkle384s_v7m.S: ^

Number of similar (compiler,implementation) pairs: 1, namely:
CompilerImplementations
clang -mcpu=native -O3 -fomit-frame-pointer -fwrapv -Qunused-arguments -fPIC -fPIE T:add_armv7m_small

Compiler output

Implementation: T:add_armv7m_small
Security model: timingleaks
Compiler: gcc -march=native -mtune=native -O2 -fomit-frame-pointer -fwrapv -fPIC -fPIE
try.c: /usr/bin/ld: error: libcrypto_hash_esch256v2.a(sparkle384s_v7m.o): conflicting architecture profiles M/A
try.c: /usr/bin/ld: failed to merge target specific data of file libcrypto_hash_esch256v2.a(sparkle384s_v7m.o)
try.c: collect2: error: ld returned 1 exit status

Number of similar (compiler,implementation) pairs: 4, namely:
CompilerImplementations
gcc -march=native -mtune=native -O2 -fomit-frame-pointer -fwrapv -fPIC -fPIE T:add_armv7m_small
gcc -march=native -mtune=native -O3 -fomit-frame-pointer -fwrapv -fPIC -fPIE T:add_armv7m_small
gcc -march=native -mtune=native -O -fomit-frame-pointer -fwrapv -fPIC -fPIE T:add_armv7m_small
gcc -march=native -mtune=native -Os -fomit-frame-pointer -fwrapv -fPIC -fPIE T:add_armv7m_small

Namespace violations

Implementation: T:opt
Security model: timingleaks
Compiler: clang -mcpu=native -O3 -fomit-frame-pointer -fwrapv -Qunused-arguments -fPIC -fPIE
hash.o Finalize T
hash.o Initialize T
hash.o ProcessMessage T
sparkle_opt.o clear_state_opt T
sparkle_opt.o print_state_opt T
sparkle_opt.o sparkle_inv_opt T
sparkle_opt.o sparkle_opt T
sparkle_opt.o test_sparkle_opt T

Number of similar (compiler,implementation) pairs: 5, namely:
CompilerImplementations
clang -mcpu=native -O3 -fomit-frame-pointer -fwrapv -Qunused-arguments -fPIC -fPIE T:opt
gcc -march=native -mtune=native -O2 -fomit-frame-pointer -fwrapv -fPIC -fPIE T:opt
gcc -march=native -mtune=native -O3 -fomit-frame-pointer -fwrapv -fPIC -fPIE T:opt
gcc -march=native -mtune=native -O -fomit-frame-pointer -fwrapv -fPIC -fPIE T:opt
gcc -march=native -mtune=native -Os -fomit-frame-pointer -fwrapv -fPIC -fPIE T:opt

Namespace violations

Implementation: T:ref
Security model: timingleaks
Compiler: clang -mcpu=native -O3 -fomit-frame-pointer -fwrapv -Qunused-arguments -fPIC -fPIE
hash.o Finalize T
hash.o Initialize T
hash.o ProcessMessage T
sparkle_ref.o clear_state_ref T
sparkle_ref.o linear_layer T
sparkle_ref.o linear_layer_inv T
sparkle_ref.o print_state_ref T
sparkle_ref.o sparkle_inv_ref T
sparkle_ref.o sparkle_ref T
sparkle_ref.o test_sparkle_ref T

Number of similar (compiler,implementation) pairs: 5, namely:
CompilerImplementations
clang -mcpu=native -O3 -fomit-frame-pointer -fwrapv -Qunused-arguments -fPIC -fPIE T:ref
gcc -march=native -mtune=native -O2 -fomit-frame-pointer -fwrapv -fPIC -fPIE T:ref
gcc -march=native -mtune=native -O3 -fomit-frame-pointer -fwrapv -fPIC -fPIE T:ref
gcc -march=native -mtune=native -O -fomit-frame-pointer -fwrapv -fPIC -fPIE T:ref
gcc -march=native -mtune=native -Os -fomit-frame-pointer -fwrapv -fPIC -fPIE T:ref