Implementation notes: armeabi, berry2, crypto_hash/blake2b

Computer: berry2
Microarchitecture: armeabi; Cortex-A7 (410fc075)
Architecture: armeabi
CPU ID: unknown CPU ID
SUPERCOP version: 20221122
Operation: crypto_hash
Primitive: blake2b
TimeObject sizeTest sizeImplementationCompilerBenchmark dateSUPERCOP version
239245228 0 024518 384 760T:moon/neon/32clang_-mcpu=native_-O3_-fomit-frame-pointer_-fwrapv_-Qunused-arguments_-fPIC_-fPIE2021011720210114
239705212 0 014952 384 744T:moon/neon/32gcc_-march=native_-mtune=native_-O3_-fomit-frame-pointer_-fwrapv_-fPIC_-fPIE2021011720210114
239705220 0 013095 380 744T:moon/neon/32gcc_-march=native_-mtune=native_-O_-fomit-frame-pointer_-fwrapv_-fPIC_-fPIE2021011720210114
239745212 0 013063 380 744T:moon/neon/32gcc_-march=native_-mtune=native_-O2_-fomit-frame-pointer_-fwrapv_-fPIC_-fPIE2021011720210114
240025204 0 012487 372 744T:moon/neon/32gcc_-march=native_-mtune=native_-Os_-fomit-frame-pointer_-fwrapv_-fPIC_-fPIE2021011720210114
6576521296 0 029180 384 744T:refgcc_-march=native_-mtune=native_-O2_-fomit-frame-pointer_-fwrapv_-fPIC_-fPIE2021011720210114
6879623772 0 033480 384 744T:refgcc_-march=native_-mtune=native_-O3_-fomit-frame-pointer_-fwrapv_-fPIC_-fPIE2021011720210114
713623096 0 010947 380 744T:moon/armv6/32gcc_-march=native_-mtune=native_-O_-fomit-frame-pointer_-fwrapv_-fPIC_-fPIE2021011720210114
713833088 0 012812 384 744T:moon/armv6/32gcc_-march=native_-mtune=native_-O3_-fomit-frame-pointer_-fwrapv_-fPIC_-fPIE2021011720210114
714043080 0 010363 372 744T:moon/armv6/32gcc_-march=native_-mtune=native_-Os_-fomit-frame-pointer_-fwrapv_-fPIC_-fPIE2021011720210114
723013088 0 010931 380 744T:moon/armv6/32gcc_-march=native_-mtune=native_-O2_-fomit-frame-pointer_-fwrapv_-fPIC_-fPIE2021011720210114
7343440692 0 048576 384 744T:regsgcc_-march=native_-mtune=native_-O2_-fomit-frame-pointer_-fwrapv_-fPIC_-fPIE2021011720210114
8006920868 0 028760 384 744T:refgcc_-march=native_-mtune=native_-O_-fomit-frame-pointer_-fwrapv_-fPIC_-fPIE2021011720210114
8102826128 0 045338 384 760T:refclang_-mcpu=native_-O3_-fomit-frame-pointer_-fwrapv_-Qunused-arguments_-fPIC_-fPIE2021011720210114
8360739388 0 047280 384 744T:regsgcc_-march=native_-mtune=native_-O_-fomit-frame-pointer_-fwrapv_-fPIC_-fPIE2021011720210114
838303112 0 022378 384 760T:moon/armv6/32clang_-mcpu=native_-O3_-fomit-frame-pointer_-fwrapv_-Qunused-arguments_-fPIC_-fPIE2021011720210114
8470942328 0 049704 376 744T:regsgcc_-march=native_-mtune=native_-Os_-fomit-frame-pointer_-fwrapv_-fPIC_-fPIE2021011720210114
8522722740 0 030120 376 744T:refgcc_-march=native_-mtune=native_-Os_-fomit-frame-pointer_-fwrapv_-fPIC_-fPIE2021011720210114
9137040692 0 050404 384 744T:regsgcc_-march=native_-mtune=native_-O3_-fomit-frame-pointer_-fwrapv_-fPIC_-fPIE2021011720210114
9266941500 0 060753 384 760T:regsclang_-mcpu=native_-O3_-fomit-frame-pointer_-fwrapv_-Qunused-arguments_-fPIC_-fPIE2021011720210114

Compiler output

Implementation: T:avx2-1
Security model: timingleaks
Compiler: clang -mcpu=native -O3 -fomit-frame-pointer -fwrapv -Qunused-arguments -fPIC -fPIE
blake2b.c: In file included from blake2b.c:11:
blake2b.c: In file included from /usr/lib/llvm-7/lib/clang/7.0.1/include/immintrin.h:28:
blake2b.c: /usr/lib/llvm-7/lib/clang/7.0.1/include/mmintrin.h:64:12: error: invalid conversion between vector type '__m64' (vector of 1 'long long' value) and integer type 'int' of different size
blake2b.c: return (__m64)__builtin_ia32_vec_init_v2si(__i, 0);
blake2b.c: ^~~~~~~~~~~~~~~~~~~~~~~~~~~~~~~~~~~~~~~~~~~
blake2b.c: /usr/lib/llvm-7/lib/clang/7.0.1/include/mmintrin.h:143:12: error: invalid conversion between vector type '__m64' (vector of 1 'long long' value) and integer type 'int' of different size
blake2b.c: return (__m64)__builtin_ia32_packsswb((__v4hi)__m1, (__v4hi)__m2);
blake2b.c: ^~~~~~~~~~~~~~~~~~~~~~~~~~~~~~~~~~~~~~~~~~~~~~~~~~~~~~~~~~
blake2b.c: /usr/lib/llvm-7/lib/clang/7.0.1/include/mmintrin.h:173:12: error: invalid conversion between vector type '__m64' (vector of 1 'long long' value) and integer type 'int' of different size
blake2b.c: return (__m64)__builtin_ia32_packssdw((__v2si)__m1, (__v2si)__m2);
blake2b.c: ^~~~~~~~~~~~~~~~~~~~~~~~~~~~~~~~~~~~~~~~~~~~~~~~~~~~~~~~~~
blake2b.c: /usr/lib/llvm-7/lib/clang/7.0.1/include/mmintrin.h:203:12: error: invalid conversion between vector type '__m64' (vector of 1 'long long' value) and integer type 'int' of different size
blake2b.c: return (__m64)__builtin_ia32_packuswb((__v4hi)__m1, (__v4hi)__m2);
blake2b.c: ^~~~~~~~~~~~~~~~~~~~~~~~~~~~~~~~~~~~~~~~~~~~~~~~~~~~~~~~~~
blake2b.c: /usr/lib/llvm-7/lib/clang/7.0.1/include/mmintrin.h:230:12: error: invalid conversion between vector type '__m64' (vector of 1 'long long' value) and integer type 'int' of different size
blake2b.c: return (__m64)__builtin_ia32_punpckhbw((__v8qi)__m1, (__v8qi)__m2);
blake2b.c: ^~~~~~~~~~~~~~~~~~~~~~~~~~~~~~~~~~~~~~~~~~~~~~~~~~~~~~~~~~~
blake2b.c: /usr/lib/llvm-7/lib/clang/7.0.1/include/mmintrin.h:253:12: error: invalid conversion between vector type '__m64' (vector of 1 'long long' value) and integer type 'int' of different size
blake2b.c: return (__m64)__builtin_ia32_punpckhwd((__v4hi)__m1, (__v4hi)__m2);
blake2b.c: ^~~~~~~~~~~~~~~~~~~~~~~~~~~~~~~~~~~~~~~~~~~~~~~~~~~~~~~~~~~
blake2b.c: /usr/lib/llvm-7/lib/clang/7.0.1/include/mmintrin.h:274:12: error: invalid conversion between vector type '__m64' (vector of 1 'long long' value) and integer type 'int' of different size
blake2b.c: return (__m64)__builtin_ia32_punpckhdq((__v2si)__m1, (__v2si)__m2);
blake2b.c: ^~~~~~~~~~~~~~~~~~~~~~~~~~~~~~~~~~~~~~~~~~~~~~~~~~~~~~~~~~~
blake2b.c: /usr/lib/llvm-7/lib/clang/7.0.1/include/mmintrin.h:301:12: error: invalid conversion between vector type '__m64' (vector of 1 'long long' value) and integer type 'int' of different size
blake2b.c: return (__m64)__builtin_ia32_punpcklbw((__v8qi)__m1, (__v8qi)__m2);
blake2b.c: ...

Number of similar (compiler,implementation) pairs: 1, namely:
CompilerImplementations
clang -mcpu=native -O3 -fomit-frame-pointer -fwrapv -Qunused-arguments -fPIC -fPIE T:avx2-1

Compiler output

Implementation: T:avx2-1
Security model: timingleaks
Compiler: gcc -march=native -mtune=native -O2 -fomit-frame-pointer -fwrapv -fPIC -fPIE
blake2b.c: blake2b.c:11:10: fatal error: immintrin.h: No such file or directory
blake2b.c: #include <immintrin.h>
blake2b.c: ^~~~~~~~~~~~~
blake2b.c: compilation terminated.

Number of similar (compiler,implementation) pairs: 4, namely:
CompilerImplementations
gcc -march=native -mtune=native -O2 -fomit-frame-pointer -fwrapv -fPIC -fPIE T:avx2-1
gcc -march=native -mtune=native -O3 -fomit-frame-pointer -fwrapv -fPIC -fPIE T:avx2-1
gcc -march=native -mtune=native -O -fomit-frame-pointer -fwrapv -fPIC -fPIE T:avx2-1
gcc -march=native -mtune=native -Os -fomit-frame-pointer -fwrapv -fPIC -fPIE T:avx2-1

Compiler output

Implementation: T:avx2-2
Security model: timingleaks
Compiler: clang -mcpu=native -O3 -fomit-frame-pointer -fwrapv -Qunused-arguments -fPIC -fPIE
blake2b.c: In file included from blake2b.c:12:
blake2b.c: In file included from /usr/lib/llvm-7/lib/clang/7.0.1/include/immintrin.h:28:
blake2b.c: /usr/lib/llvm-7/lib/clang/7.0.1/include/mmintrin.h:64:12: error: invalid conversion between vector type '__m64' (vector of 1 'long long' value) and integer type 'int' of different size
blake2b.c: return (__m64)__builtin_ia32_vec_init_v2si(__i, 0);
blake2b.c: ^~~~~~~~~~~~~~~~~~~~~~~~~~~~~~~~~~~~~~~~~~~
blake2b.c: /usr/lib/llvm-7/lib/clang/7.0.1/include/mmintrin.h:143:12: error: invalid conversion between vector type '__m64' (vector of 1 'long long' value) and integer type 'int' of different size
blake2b.c: return (__m64)__builtin_ia32_packsswb((__v4hi)__m1, (__v4hi)__m2);
blake2b.c: ^~~~~~~~~~~~~~~~~~~~~~~~~~~~~~~~~~~~~~~~~~~~~~~~~~~~~~~~~~
blake2b.c: /usr/lib/llvm-7/lib/clang/7.0.1/include/mmintrin.h:173:12: error: invalid conversion between vector type '__m64' (vector of 1 'long long' value) and integer type 'int' of different size
blake2b.c: return (__m64)__builtin_ia32_packssdw((__v2si)__m1, (__v2si)__m2);
blake2b.c: ^~~~~~~~~~~~~~~~~~~~~~~~~~~~~~~~~~~~~~~~~~~~~~~~~~~~~~~~~~
blake2b.c: /usr/lib/llvm-7/lib/clang/7.0.1/include/mmintrin.h:203:12: error: invalid conversion between vector type '__m64' (vector of 1 'long long' value) and integer type 'int' of different size
blake2b.c: return (__m64)__builtin_ia32_packuswb((__v4hi)__m1, (__v4hi)__m2);
blake2b.c: ^~~~~~~~~~~~~~~~~~~~~~~~~~~~~~~~~~~~~~~~~~~~~~~~~~~~~~~~~~
blake2b.c: /usr/lib/llvm-7/lib/clang/7.0.1/include/mmintrin.h:230:12: error: invalid conversion between vector type '__m64' (vector of 1 'long long' value) and integer type 'int' of different size
blake2b.c: return (__m64)__builtin_ia32_punpckhbw((__v8qi)__m1, (__v8qi)__m2);
blake2b.c: ^~~~~~~~~~~~~~~~~~~~~~~~~~~~~~~~~~~~~~~~~~~~~~~~~~~~~~~~~~~
blake2b.c: /usr/lib/llvm-7/lib/clang/7.0.1/include/mmintrin.h:253:12: error: invalid conversion between vector type '__m64' (vector of 1 'long long' value) and integer type 'int' of different size
blake2b.c: return (__m64)__builtin_ia32_punpckhwd((__v4hi)__m1, (__v4hi)__m2);
blake2b.c: ^~~~~~~~~~~~~~~~~~~~~~~~~~~~~~~~~~~~~~~~~~~~~~~~~~~~~~~~~~~
blake2b.c: /usr/lib/llvm-7/lib/clang/7.0.1/include/mmintrin.h:274:12: error: invalid conversion between vector type '__m64' (vector of 1 'long long' value) and integer type 'int' of different size
blake2b.c: return (__m64)__builtin_ia32_punpckhdq((__v2si)__m1, (__v2si)__m2);
blake2b.c: ^~~~~~~~~~~~~~~~~~~~~~~~~~~~~~~~~~~~~~~~~~~~~~~~~~~~~~~~~~~
blake2b.c: /usr/lib/llvm-7/lib/clang/7.0.1/include/mmintrin.h:301:12: error: invalid conversion between vector type '__m64' (vector of 1 'long long' value) and integer type 'int' of different size
blake2b.c: return (__m64)__builtin_ia32_punpcklbw((__v8qi)__m1, (__v8qi)__m2);
blake2b.c: ...

Number of similar (compiler,implementation) pairs: 2, namely:
CompilerImplementations
clang -mcpu=native -O3 -fomit-frame-pointer -fwrapv -Qunused-arguments -fPIC -fPIE T:avx2-2 T:avx2-3

Compiler output

Implementation: T:avx2-2
Security model: timingleaks
Compiler: gcc -march=native -mtune=native -O2 -fomit-frame-pointer -fwrapv -fPIC -fPIE
blake2b.c: blake2b.c:12:10: fatal error: immintrin.h: No such file or directory
blake2b.c: #include <immintrin.h>
blake2b.c: ^~~~~~~~~~~~~
blake2b.c: compilation terminated.

Number of similar (compiler,implementation) pairs: 8, namely:
CompilerImplementations
gcc -march=native -mtune=native -O2 -fomit-frame-pointer -fwrapv -fPIC -fPIE T:avx2-2
gcc -march=native -mtune=native -O3 -fomit-frame-pointer -fwrapv -fPIC -fPIE T:avx2-2
gcc -march=native -mtune=native -O -fomit-frame-pointer -fwrapv -fPIC -fPIE T:avx2-2
gcc -march=native -mtune=native -Os -fomit-frame-pointer -fwrapv -fPIC -fPIE T:avx2-2
gcc -march=native -mtune=native -O2 -fomit-frame-pointer -fwrapv -fPIC -fPIE T:avx2-3
gcc -march=native -mtune=native -O3 -fomit-frame-pointer -fwrapv -fPIC -fPIE T:avx2-3
gcc -march=native -mtune=native -O -fomit-frame-pointer -fwrapv -fPIC -fPIE T:avx2-3
gcc -march=native -mtune=native -Os -fomit-frame-pointer -fwrapv -fPIC -fPIE T:avx2-3

Compiler output

Implementation: T:avxicc
Security model: timingleaks
Compiler: clang -mcpu=native -O3 -fomit-frame-pointer -fwrapv -Qunused-arguments -fPIC -fPIE
blake2b.S: blake2b.S:3:2: error: unknown directive
blake2b.S: .intel_syntax noprefix
blake2b.S: ^
blake2b.S: blake2b.S:14:13: error: operand must be a register in range [r0, r15]
blake2b.S: sub rsp, 552
blake2b.S: ^
blake2b.S: blake2b.S:16:9: error: invalid instruction, did you mean: eor, orr, ror?
blake2b.S: xor r11d, r11d
blake2b.S: ^
blake2b.S: blake2b.S:17:9: error: invalid instruction, did you mean: eor, orr, ror?
blake2b.S: xor ecx, ecx
blake2b.S: ^
blake2b.S: blake2b.S:18:9: error: invalid instruction, any one of the following would fix this:
blake2b.S: mov r9, rsi
blake2b.S: ^
blake2b.S: blake2b.S:18:9: note: instruction requires: armv6t2
blake2b.S: mov r9, rsi
blake2b.S: ^
blake2b.S: blake2b.S:18:9: note: instruction requires: thumb2
blake2b.S: mov r9, rsi
blake2b.S: ^
blake2b.S: blake2b.S:19:31: error: unexpected token in argument list
blake2b.S: vmovdqu xmm2, XMMWORD PTR .L_2il0floatpacket.13[rip]
blake2b.S: ^
blake2b.S: blake2b.S:20:9: error: invalid instruction, did you mean: eor, orr, ror?
blake2b.S: ...

Number of similar (compiler,implementation) pairs: 1, namely:
CompilerImplementations
clang -mcpu=native -O3 -fomit-frame-pointer -fwrapv -Qunused-arguments -fPIC -fPIE T:avxicc

Compiler output

Implementation: T:avxicc
Security model: timingleaks
Compiler: gcc -march=native -mtune=native -O2 -fomit-frame-pointer -fwrapv -fPIC -fPIE
blake2b.S: blake2b.S: Assembler messages:
blake2b.S: blake2b.S:3: Error: unknown pseudo-op: `.intel_syntax'
blake2b.S: blake2b.c:14: Error: ARM register expected -- `sub rsp,552'
blake2b.S: blake2b.c:16: Error: bad instruction `xor r11d,r11d'
blake2b.S: blake2b.c:17: Error: bad instruction `xor ecx,ecx'
blake2b.S: blake2b.c:18: Error: immediate expression requires a # prefix -- `mov r9,rsi'
blake2b.S: blake2b.c:19: Error: bad instruction `vmovdqu xmm2,XMMWORD PTR .L_2il0floatpacket.13[rip]'
blake2b.S: blake2b.c:20: Error: bad instruction `xor eax,eax'
blake2b.S: blake2b.c:21: Error: bad instruction `vmovdqu xmm3,XMMWORD PTR .L_2il0floatpacket.14[rip]'
blake2b.S: blake2b.c:22: Error: immediate expression requires a # prefix -- `mov r8,rdx'
blake2b.S: blake2b.c:23: Error: bad instruction `vmovdqu xmm4,XMMWORD PTR .L_2il0floatpacket.15[rip]'
blake2b.S: blake2b.c:24: Error: bad instruction `xor r10d,r10d'
blake2b.S: blake2b.c:25: Error: bad instruction `vmovdqu xmm11,XMMWORD PTR .L_2il0floatpacket.16[rip]'
blake2b.S: blake2b.c:26: Error: bad instruction `vmovdqu xmm1,XMMWORD PTR .L_2il0floatpacket.11[rip]'
blake2b.S: blake2b.c:27: Error: bad instruction `vmovdqu xmm0,XMMWORD PTR .L_2il0floatpacket.12[rip]'
blake2b.S: blake2b.c:28: Error: bad instruction `vmovdqu XMMWORD PTR [448+rsp],xmm2'
blake2b.S: blake2b.c:29: Error: bad instruction `vmovdqu XMMWORD PTR [464+rsp],xmm3'
blake2b.S: blake2b.c:30: Error: bad instruction `vmovdqu XMMWORD PTR [496+rsp],xmm4'
blake2b.S: blake2b.c:31: Error: bad instruction `vmovdqu XMMWORD PTR [480+rsp],xmm11'
blake2b.S: blake2b.c:32: Error: bad instruction `vmovdqu xmm5,XMMWORD PTR .L_2il0floatpacket.17[rip]'
blake2b.S: blake2b.c:33: Error: ARM register expected -- `cmp rdx,128'
blake2b.S: blake2b.c:34: Error: bad instruction `jbe ..B1.5'
blake2b.S: blake2b.c:37: Error: ARM register expected -- `mov QWORD PTR [rsp],rbp'
blake2b.S: blake2b.c:38: Error: bad instruction `lea rsi,QWORD PTR [-1+rdx]'
blake2b.S: blake2b.c:39: Error: bad instruction `sar rsi,6'
blake2b.S: ...

Number of similar (compiler,implementation) pairs: 4, namely:
CompilerImplementations
gcc -march=native -mtune=native -O2 -fomit-frame-pointer -fwrapv -fPIC -fPIE T:avxicc
gcc -march=native -mtune=native -O3 -fomit-frame-pointer -fwrapv -fPIC -fPIE T:avxicc
gcc -march=native -mtune=native -O -fomit-frame-pointer -fwrapv -fPIC -fPIE T:avxicc
gcc -march=native -mtune=native -Os -fomit-frame-pointer -fwrapv -fPIC -fPIE T:avxicc

Compiler output

Implementation: T:xmm
Security model: timingleaks
Compiler: clang -mcpu=native -O3 -fomit-frame-pointer -fwrapv -Qunused-arguments -fPIC -fPIE
blake2b.c: In file included from blake2b.c:6:
blake2b.c: ./blake2-config.h:68:2: error: "This code requires at least SSE2."
blake2b.c: #error "This code requires at least SSE2."
blake2b.c: ^
blake2b.c: In file included from blake2b.c:11:
blake2b.c: In file included from /usr/lib/llvm-7/lib/clang/7.0.1/include/immintrin.h:28:
blake2b.c: /usr/lib/llvm-7/lib/clang/7.0.1/include/mmintrin.h:64:12: error: invalid conversion between vector type '__m64' (vector of 1 'long long' value) and integer type 'int' of different size
blake2b.c: return (__m64)__builtin_ia32_vec_init_v2si(__i, 0);
blake2b.c: ^~~~~~~~~~~~~~~~~~~~~~~~~~~~~~~~~~~~~~~~~~~
blake2b.c: /usr/lib/llvm-7/lib/clang/7.0.1/include/mmintrin.h:143:12: error: invalid conversion between vector type '__m64' (vector of 1 'long long' value) and integer type 'int' of different size
blake2b.c: return (__m64)__builtin_ia32_packsswb((__v4hi)__m1, (__v4hi)__m2);
blake2b.c: ^~~~~~~~~~~~~~~~~~~~~~~~~~~~~~~~~~~~~~~~~~~~~~~~~~~~~~~~~~
blake2b.c: /usr/lib/llvm-7/lib/clang/7.0.1/include/mmintrin.h:173:12: error: invalid conversion between vector type '__m64' (vector of 1 'long long' value) and integer type 'int' of different size
blake2b.c: return (__m64)__builtin_ia32_packssdw((__v2si)__m1, (__v2si)__m2);
blake2b.c: ^~~~~~~~~~~~~~~~~~~~~~~~~~~~~~~~~~~~~~~~~~~~~~~~~~~~~~~~~~
blake2b.c: /usr/lib/llvm-7/lib/clang/7.0.1/include/mmintrin.h:203:12: error: invalid conversion between vector type '__m64' (vector of 1 'long long' value) and integer type 'int' of different size
blake2b.c: return (__m64)__builtin_ia32_packuswb((__v4hi)__m1, (__v4hi)__m2);
blake2b.c: ^~~~~~~~~~~~~~~~~~~~~~~~~~~~~~~~~~~~~~~~~~~~~~~~~~~~~~~~~~
blake2b.c: /usr/lib/llvm-7/lib/clang/7.0.1/include/mmintrin.h:230:12: error: invalid conversion between vector type '__m64' (vector of 1 'long long' value) and integer type 'int' of different size
blake2b.c: return (__m64)__builtin_ia32_punpckhbw((__v8qi)__m1, (__v8qi)__m2);
blake2b.c: ^~~~~~~~~~~~~~~~~~~~~~~~~~~~~~~~~~~~~~~~~~~~~~~~~~~~~~~~~~~
blake2b.c: /usr/lib/llvm-7/lib/clang/7.0.1/include/mmintrin.h:253:12: error: invalid conversion between vector type '__m64' (vector of 1 'long long' value) and integer type 'int' of different size
blake2b.c: return (__m64)__builtin_ia32_punpckhwd((__v4hi)__m1, (__v4hi)__m2);
blake2b.c: ^~~~~~~~~~~~~~~~~~~~~~~~~~~~~~~~~~~~~~~~~~~~~~~~~~~~~~~~~~~
blake2b.c: /usr/lib/llvm-7/lib/clang/7.0.1/include/mmintrin.h:274:12: error: invalid conversion between vector type '__m64' (vector of 1 'long long' value) and integer type 'int' of different size
blake2b.c: ...

Number of similar (compiler,implementation) pairs: 2, namely:
CompilerImplementations
clang -mcpu=native -O3 -fomit-frame-pointer -fwrapv -Qunused-arguments -fPIC -fPIE T:xmm T:ymm

Compiler output

Implementation: T:xmm
Security model: timingleaks
Compiler: gcc -march=native -mtune=native -O2 -fomit-frame-pointer -fwrapv -fPIC -fPIE
blake2b.c: In file included from blake2b.c:6:
blake2b.c: blake2-config.h:68:2: error: #error "This code requires at least SSE2."
blake2b.c: #error "This code requires at least SSE2."
blake2b.c: ^~~~~
blake2b.c: blake2b.c:11:10: fatal error: immintrin.h: No such file or directory
blake2b.c: #include <immintrin.h>
blake2b.c: ^~~~~~~~~~~~~
blake2b.c: compilation terminated.

Number of similar (compiler,implementation) pairs: 8, namely:
CompilerImplementations
gcc -march=native -mtune=native -O2 -fomit-frame-pointer -fwrapv -fPIC -fPIE T:xmm
gcc -march=native -mtune=native -O3 -fomit-frame-pointer -fwrapv -fPIC -fPIE T:xmm
gcc -march=native -mtune=native -O -fomit-frame-pointer -fwrapv -fPIC -fPIE T:xmm
gcc -march=native -mtune=native -Os -fomit-frame-pointer -fwrapv -fPIC -fPIE T:xmm
gcc -march=native -mtune=native -O2 -fomit-frame-pointer -fwrapv -fPIC -fPIE T:ymm
gcc -march=native -mtune=native -O3 -fomit-frame-pointer -fwrapv -fPIC -fPIE T:ymm
gcc -march=native -mtune=native -O -fomit-frame-pointer -fwrapv -fPIC -fPIE T:ymm
gcc -march=native -mtune=native -Os -fomit-frame-pointer -fwrapv -fPIC -fPIE T:ymm

Namespace violations

Implementation: T:moon/armv6/32
Security model: timingleaks
Compiler: clang -mcpu=native -O3 -fomit-frame-pointer -fwrapv -Qunused-arguments -fPIC -fPIE
blake2b.o _blake2b_blocks_armv6 T
blake2b.o blake2b_blocks_armv6 T

Number of similar (compiler,implementation) pairs: 5, namely:
CompilerImplementations
clang -mcpu=native -O3 -fomit-frame-pointer -fwrapv -Qunused-arguments -fPIC -fPIE T:moon/armv6/32
gcc -march=native -mtune=native -O2 -fomit-frame-pointer -fwrapv -fPIC -fPIE T:moon/armv6/32
gcc -march=native -mtune=native -O3 -fomit-frame-pointer -fwrapv -fPIC -fPIE T:moon/armv6/32
gcc -march=native -mtune=native -O -fomit-frame-pointer -fwrapv -fPIC -fPIE T:moon/armv6/32
gcc -march=native -mtune=native -Os -fomit-frame-pointer -fwrapv -fPIC -fPIE T:moon/armv6/32

Namespace violations

Implementation: T:moon/neon/32
Security model: timingleaks
Compiler: clang -mcpu=native -O3 -fomit-frame-pointer -fwrapv -Qunused-arguments -fPIC -fPIE
blake2b.o _blake2b_blocks_neon T
blake2b.o blake2b_blocks_neon T

Number of similar (compiler,implementation) pairs: 5, namely:
CompilerImplementations
clang -mcpu=native -O3 -fomit-frame-pointer -fwrapv -Qunused-arguments -fPIC -fPIE T:moon/neon/32
gcc -march=native -mtune=native -O2 -fomit-frame-pointer -fwrapv -fPIC -fPIE T:moon/neon/32
gcc -march=native -mtune=native -O3 -fomit-frame-pointer -fwrapv -fPIC -fPIE T:moon/neon/32
gcc -march=native -mtune=native -O -fomit-frame-pointer -fwrapv -fPIC -fPIE T:moon/neon/32
gcc -march=native -mtune=native -Os -fomit-frame-pointer -fwrapv -fPIC -fPIE T:moon/neon/32

Namespace violations

Implementation: T:ref
Security model: timingleaks
Compiler: clang -mcpu=native -O3 -fomit-frame-pointer -fwrapv -Qunused-arguments -fPIC -fPIE
blake2b-ref.o blake2b T
blake2b-ref.o blake2b_final T
blake2b-ref.o blake2b_init T
blake2b-ref.o blake2b_init_key T
blake2b-ref.o blake2b_init_param T
blake2b-ref.o blake2b_update T

Number of similar (compiler,implementation) pairs: 5, namely:
CompilerImplementations
clang -mcpu=native -O3 -fomit-frame-pointer -fwrapv -Qunused-arguments -fPIC -fPIE T:ref
gcc -march=native -mtune=native -O2 -fomit-frame-pointer -fwrapv -fPIC -fPIE T:ref
gcc -march=native -mtune=native -O3 -fomit-frame-pointer -fwrapv -fPIC -fPIE T:ref
gcc -march=native -mtune=native -O -fomit-frame-pointer -fwrapv -fPIC -fPIE T:ref
gcc -march=native -mtune=native -Os -fomit-frame-pointer -fwrapv -fPIC -fPIE T:ref