Implementation notes: armeabi, berry2, crypto_aead/stribob192r1

Computer: berry2
Architecture: armeabi
CPU ID: unknown CPU ID
SUPERCOP version: 20210529
Operation: crypto_aead
Primitive: stribob192r1
TimeObject sizeTest sizeImplementationCompilerBenchmark dateSUPERCOP version
133558518756 0 035735 400 816T:refgcc_-march=native_-mtune=native_-O2_-fomit-frame-pointer_-fwrapv_-fPIC_-fPIE2021011920210114
148911621216 0 040052 404 816T:refgcc_-march=native_-mtune=native_-O3_-fomit-frame-pointer_-fwrapv_-fPIC_-fPIE2021011920210114
159079718628 0 034771 392 816T:refgcc_-march=native_-mtune=native_-Os_-fomit-frame-pointer_-fwrapv_-fPIC_-fPIE2021011920210114
171780520656 0 050754 392 832T:refclang_-mcpu=native_-O3_-fomit-frame-pointer_-fwrapv_-Qunused-arguments_-fPIC_-fPIE2021011920210114
178681718740 0 036475 400 816T:refgcc_-march=native_-mtune=native_-O_-fomit-frame-pointer_-fwrapv_-fPIC_-fPIE2021011920210114
174600863248 0 033323 384 832T:8bitclang_-mcpu=native_-O3_-fomit-frame-pointer_-fwrapv_-Qunused-arguments_-fPIC_-fPIE2021011920210114
197701123388 0 022208 396 816T:8bitgcc_-march=native_-mtune=native_-O3_-fomit-frame-pointer_-fwrapv_-fPIC_-fPIE2021011920210114
203849322916 0 019867 392 816T:8bitgcc_-march=native_-mtune=native_-O2_-fomit-frame-pointer_-fwrapv_-fPIC_-fPIE2021011920210114
220727092736 0 018873 384 816T:8bitgcc_-march=native_-mtune=native_-Os_-fomit-frame-pointer_-fwrapv_-fPIC_-fPIE2021011920210114
235956632912 0 020619 392 816T:8bitgcc_-march=native_-mtune=native_-O_-fomit-frame-pointer_-fwrapv_-fPIC_-fPIE2021011920210114

Compiler output

Implementation: T:xmm
Security model: timingleaks
Compiler: clang -mcpu=native -O3 -fomit-frame-pointer -fwrapv -Qunused-arguments -fPIC -fPIE
sbob_pi64xmm.c: sbob_pi64xmm.c:10:2: error: "This version requires __SSE4_1__"
sbob_pi64xmm.c: #error "This version requires __SSE4_1__"
sbob_pi64xmm.c: ^
sbob_pi64xmm.c: In file included from sbob_pi64xmm.c:19:
sbob_pi64xmm.c: /usr/lib/llvm-7/lib/clang/7.0.1/include/mmintrin.h:64:12: error: invalid conversion between vector type '__m64' (vector of 1 'long long' value) and integer type 'int' of different size
sbob_pi64xmm.c: return (__m64)__builtin_ia32_vec_init_v2si(__i, 0);
sbob_pi64xmm.c: ^~~~~~~~~~~~~~~~~~~~~~~~~~~~~~~~~~~~~~~~~~~
sbob_pi64xmm.c: /usr/lib/llvm-7/lib/clang/7.0.1/include/mmintrin.h:143:12: error: invalid conversion between vector type '__m64' (vector of 1 'long long' value) and integer type 'int' of different size
sbob_pi64xmm.c: return (__m64)__builtin_ia32_packsswb((__v4hi)__m1, (__v4hi)__m2);
sbob_pi64xmm.c: ^~~~~~~~~~~~~~~~~~~~~~~~~~~~~~~~~~~~~~~~~~~~~~~~~~~~~~~~~~
sbob_pi64xmm.c: /usr/lib/llvm-7/lib/clang/7.0.1/include/mmintrin.h:173:12: error: invalid conversion between vector type '__m64' (vector of 1 'long long' value) and integer type 'int' of different size
sbob_pi64xmm.c: return (__m64)__builtin_ia32_packssdw((__v2si)__m1, (__v2si)__m2);
sbob_pi64xmm.c: ^~~~~~~~~~~~~~~~~~~~~~~~~~~~~~~~~~~~~~~~~~~~~~~~~~~~~~~~~~
sbob_pi64xmm.c: /usr/lib/llvm-7/lib/clang/7.0.1/include/mmintrin.h:203:12: error: invalid conversion between vector type '__m64' (vector of 1 'long long' value) and integer type 'int' of different size
sbob_pi64xmm.c: return (__m64)__builtin_ia32_packuswb((__v4hi)__m1, (__v4hi)__m2);
sbob_pi64xmm.c: ^~~~~~~~~~~~~~~~~~~~~~~~~~~~~~~~~~~~~~~~~~~~~~~~~~~~~~~~~~
sbob_pi64xmm.c: /usr/lib/llvm-7/lib/clang/7.0.1/include/mmintrin.h:230:12: error: invalid conversion between vector type '__m64' (vector of 1 'long long' value) and integer type 'int' of different size
sbob_pi64xmm.c: return (__m64)__builtin_ia32_punpckhbw((__v8qi)__m1, (__v8qi)__m2);
sbob_pi64xmm.c: ^~~~~~~~~~~~~~~~~~~~~~~~~~~~~~~~~~~~~~~~~~~~~~~~~~~~~~~~~~~
sbob_pi64xmm.c: /usr/lib/llvm-7/lib/clang/7.0.1/include/mmintrin.h:253:12: error: invalid conversion between vector type '__m64' (vector of 1 'long long' value) and integer type 'int' of different size
sbob_pi64xmm.c: return (__m64)__builtin_ia32_punpckhwd((__v4hi)__m1, (__v4hi)__m2);
sbob_pi64xmm.c: ^~~~~~~~~~~~~~~~~~~~~~~~~~~~~~~~~~~~~~~~~~~~~~~~~~~~~~~~~~~
sbob_pi64xmm.c: /usr/lib/llvm-7/lib/clang/7.0.1/include/mmintrin.h:274:12: error: invalid conversion between vector type '__m64' (vector of 1 'long long' value) and integer type 'int' of different size
sbob_pi64xmm.c: return (__m64)__builtin_ia32_punpckhdq((__v2si)__m1, (__v2si)__m2);
sbob_pi64xmm.c: ^~~~~~~~~~~~~~~~~~~~~~~~~~~~~~~~~~~~~~~~~~~~~~~~~~~~~~~~~~~
sbob_pi64xmm.c: ...

Number of similar (compiler,implementation) pairs: 1, namely:
CompilerImplementations
clang -mcpu=native -O3 -fomit-frame-pointer -fwrapv -Qunused-arguments -fPIC -fPIE T:xmm

Compiler output

Implementation: T:xmm
Security model: timingleaks
Compiler: gcc -march=native -mtune=native -O2 -fomit-frame-pointer -fwrapv -fPIC -fPIE
sbob_pi64xmm.c: sbob_pi64xmm.c:10:2: error: #error "This version requires __SSE4_1__"
sbob_pi64xmm.c: #error "This version requires __SSE4_1__"
sbob_pi64xmm.c: ^~~~~
sbob_pi64xmm.c: In file included from sbob_pi64xmm.c:19:
sbob_pi64xmm.c: /usr/lib/gcc/arm-linux-gnueabihf/8/include/mmintrin.h:28:2: error: #error mmintrin.h included without enabling WMMX/WMMX2 instructions (e.g. -march=iwmmxt or -march=iwmmxt2)
sbob_pi64xmm.c: #error mmintrin.h included without enabling WMMX/WMMX2 instructions (e.g. -march=iwmmxt or -march=iwmmxt2)
sbob_pi64xmm.c: ^~~~~
sbob_pi64xmm.c: sbob_pi64xmm.c:20:10: fatal error: emmintrin.h: No such file or directory
sbob_pi64xmm.c: #include <emmintrin.h>
sbob_pi64xmm.c: ^~~~~~~~~~~~~
sbob_pi64xmm.c: compilation terminated.

Number of similar (compiler,implementation) pairs: 4, namely:
CompilerImplementations
gcc -march=native -mtune=native -O2 -fomit-frame-pointer -fwrapv -fPIC -fPIE T:xmm
gcc -march=native -mtune=native -O3 -fomit-frame-pointer -fwrapv -fPIC -fPIE T:xmm
gcc -march=native -mtune=native -O -fomit-frame-pointer -fwrapv -fPIC -fPIE T:xmm
gcc -march=native -mtune=native -Os -fomit-frame-pointer -fwrapv -fPIC -fPIE T:xmm

Namespace violations

Implementation: T:8bit
Security model: timingleaks
Compiler: clang -mcpu=native -O3 -fomit-frame-pointer -fwrapv -Qunused-arguments -fPIC -fPIE
sbob_pi8.o sbob_matlog R
sbob_pi8.o sbob_pi T
sbob_pi8.o sbob_pi8log R
sbob_pi8.o sbob_rdcnst R
sbob_pi8.o sbob_rv8exp R
stribob.o sbob_clr T
stribob.o sbob_cmp T
stribob.o sbob_dec T
stribob.o sbob_enc T
stribob.o sbob_fin T
stribob.o sbob_get T
stribob.o sbob_put T

Number of similar (compiler,implementation) pairs: 5, namely:
CompilerImplementations
clang -mcpu=native -O3 -fomit-frame-pointer -fwrapv -Qunused-arguments -fPIC -fPIE T:8bit
gcc -march=native -mtune=native -O2 -fomit-frame-pointer -fwrapv -fPIC -fPIE T:8bit
gcc -march=native -mtune=native -O3 -fomit-frame-pointer -fwrapv -fPIC -fPIE T:8bit
gcc -march=native -mtune=native -O -fomit-frame-pointer -fwrapv -fPIC -fPIE T:8bit
gcc -march=native -mtune=native -Os -fomit-frame-pointer -fwrapv -fPIC -fPIE T:8bit

Namespace violations

Implementation: T:ref
Security model: timingleaks
Compiler: clang -mcpu=native -O3 -fomit-frame-pointer -fwrapv -Qunused-arguments -fPIC -fPIE
sbob_pi64.o sbob_pi T
sbob_tab64.o sbob_rc64 R
sbob_tab64.o sbob_sl64 R
stribob.o sbob_clr T
stribob.o sbob_cmp T
stribob.o sbob_dec T
stribob.o sbob_enc T
stribob.o sbob_fin T
stribob.o sbob_get T
stribob.o sbob_put T

Number of similar (compiler,implementation) pairs: 5, namely:
CompilerImplementations
clang -mcpu=native -O3 -fomit-frame-pointer -fwrapv -Qunused-arguments -fPIC -fPIE T:ref
gcc -march=native -mtune=native -O2 -fomit-frame-pointer -fwrapv -fPIC -fPIE T:ref
gcc -march=native -mtune=native -O3 -fomit-frame-pointer -fwrapv -fPIC -fPIE T:ref
gcc -march=native -mtune=native -O -fomit-frame-pointer -fwrapv -fPIC -fPIE T:ref
gcc -march=native -mtune=native -Os -fomit-frame-pointer -fwrapv -fPIC -fPIE T:ref