Implementation notes: armeabi, berry2, crypto_aead/norx3241v2

Computer: berry2
Architecture: armeabi
CPU ID: unknown CPU ID
SUPERCOP version: 20210529
Operation: crypto_aead
Primitive: norx3241v2
TimeObject sizeTest sizeImplementationCompilerBenchmark dateSUPERCOP version
1423622600 8 018839 396 816T:refgcc_-march=native_-mtune=native_-Os_-fomit-frame-pointer_-fwrapv_-fPIC_-fPIE2021011920210114
15763814892 8 032708 404 816T:refgcc_-march=native_-mtune=native_-O_-fomit-frame-pointer_-fwrapv_-fPIC_-fPIE2021011920210114
16002722072 8 040952 404 816T:refgcc_-march=native_-mtune=native_-O3_-fomit-frame-pointer_-fwrapv_-fPIC_-fPIE2021011920210114
1675176624 8 036708 392 832T:refclang_-mcpu=native_-O3_-fomit-frame-pointer_-fwrapv_-Qunused-arguments_-fPIC_-fPIE2021011920210114
16934720696 8 037756 404 816T:refgcc_-march=native_-mtune=native_-O2_-fomit-frame-pointer_-fwrapv_-fPIC_-fPIE2021011920210114

Compiler output

Implementation: T:neon
Security model: timingleaks
Compiler: clang -mcpu=native -O3 -fomit-frame-pointer -fwrapv -Qunused-arguments -fPIC -fPIE
norx.c: In file included from norx.c:18:
norx.c: /usr/lib/llvm-7/lib/clang/7.0.1/include/arm_neon.h:28:2: error: "NEON support not enabled"
norx.c: #error "NEON support not enabled"
norx.c: ^
norx.c: 1 error generated.

Number of similar (compiler,implementation) pairs: 1, namely:
CompilerImplementations
clang -mcpu=native -O3 -fomit-frame-pointer -fwrapv -Qunused-arguments -fPIC -fPIE T:neon

Compiler output

Implementation: T:neon
Security model: timingleaks
Compiler: gcc -march=native -mtune=native -O2 -fomit-frame-pointer -fwrapv -fPIC -fPIE
norx.c: In file included from norx.c:18:
norx.c: norx.c: In function 'norx_aead_encrypt':
norx.c: /usr/lib/gcc/arm-linux-gnueabihf/8/include/arm_neon.h:14058:1: error: inlining failed in call to always_inline 'veorq_u32': target specific option mismatch
norx.c: veorq_u32 (uint32x4_t __a, uint32x4_t __b)
norx.c: ^~~~~~~~~
norx.c: norx.c:56:19: note: called from here
norx.c: #define XOR(A, B) veorq_u32((A), (B))
norx.c: ^~~~~~~~~~~~~~~~~~~
norx.c: norx.c:289:9: note: in expansion of macro 'XOR'
norx.c: D = XOR(D, P_); \
norx.c: ^~~
norx.c: norx.c:385:5: note: in expansion of macro 'INITIALISE'
norx.c: INITIALISE(A, B, C, D, N, key);
norx.c: ^~~~~~~~~~
norx.c: In file included from norx.c:18:
norx.c: /usr/lib/gcc/arm-linux-gnueabihf/8/include/arm_neon.h:16829:1: error: inlining failed in call to always_inline 'vreinterpretq_u32_u8': target specific option mismatch
norx.c: vreinterpretq_u32_u8 (uint8x16_t __a)
norx.c: ^~~~~~~~~~~~~~~~~~~~
norx.c: norx.c:39:18: note: called from here
norx.c: #define LOAD(in) vreinterpretq_u32_u8( vld1q_u8((uint8_t *)(in)) )
norx.c: ^~~~~~~~~~~~~~~~~~~~~~~~~~~~~~~~~~~~~~~~~~~~~~~~~
norx.c: norx.c:40:19: note: in expansion of macro 'LOAD'
norx.c: #define LOADU(in) LOAD((in))
norx.c: ^~~~
norx.c: norx.c:286:9: note: in expansion of macro 'LOADU'
norx.c: ...

Number of similar (compiler,implementation) pairs: 4, namely:
CompilerImplementations
gcc -march=native -mtune=native -O2 -fomit-frame-pointer -fwrapv -fPIC -fPIE T:neon
gcc -march=native -mtune=native -O3 -fomit-frame-pointer -fwrapv -fPIC -fPIE T:neon
gcc -march=native -mtune=native -O -fomit-frame-pointer -fwrapv -fPIC -fPIE T:neon
gcc -march=native -mtune=native -Os -fomit-frame-pointer -fwrapv -fPIC -fPIE T:neon

Compiler output

Implementation: T:xmm
Security model: timingleaks
Compiler: clang -mcpu=native -O3 -fomit-frame-pointer -fwrapv -Qunused-arguments -fPIC -fPIE
norx.c: In file included from norx.c:26:
norx.c: In file included from /usr/lib/llvm-7/lib/clang/7.0.1/include/immintrin.h:28:
norx.c: /usr/lib/llvm-7/lib/clang/7.0.1/include/mmintrin.h:64:12: error: invalid conversion between vector type '__m64' (vector of 1 'long long' value) and integer type 'int' of different size
norx.c: return (__m64)__builtin_ia32_vec_init_v2si(__i, 0);
norx.c: ^~~~~~~~~~~~~~~~~~~~~~~~~~~~~~~~~~~~~~~~~~~
norx.c: /usr/lib/llvm-7/lib/clang/7.0.1/include/mmintrin.h:143:12: error: invalid conversion between vector type '__m64' (vector of 1 'long long' value) and integer type 'int' of different size
norx.c: return (__m64)__builtin_ia32_packsswb((__v4hi)__m1, (__v4hi)__m2);
norx.c: ^~~~~~~~~~~~~~~~~~~~~~~~~~~~~~~~~~~~~~~~~~~~~~~~~~~~~~~~~~
norx.c: /usr/lib/llvm-7/lib/clang/7.0.1/include/mmintrin.h:173:12: error: invalid conversion between vector type '__m64' (vector of 1 'long long' value) and integer type 'int' of different size
norx.c: return (__m64)__builtin_ia32_packssdw((__v2si)__m1, (__v2si)__m2);
norx.c: ^~~~~~~~~~~~~~~~~~~~~~~~~~~~~~~~~~~~~~~~~~~~~~~~~~~~~~~~~~
norx.c: /usr/lib/llvm-7/lib/clang/7.0.1/include/mmintrin.h:203:12: error: invalid conversion between vector type '__m64' (vector of 1 'long long' value) and integer type 'int' of different size
norx.c: return (__m64)__builtin_ia32_packuswb((__v4hi)__m1, (__v4hi)__m2);
norx.c: ^~~~~~~~~~~~~~~~~~~~~~~~~~~~~~~~~~~~~~~~~~~~~~~~~~~~~~~~~~
norx.c: /usr/lib/llvm-7/lib/clang/7.0.1/include/mmintrin.h:230:12: error: invalid conversion between vector type '__m64' (vector of 1 'long long' value) and integer type 'int' of different size
norx.c: return (__m64)__builtin_ia32_punpckhbw((__v8qi)__m1, (__v8qi)__m2);
norx.c: ^~~~~~~~~~~~~~~~~~~~~~~~~~~~~~~~~~~~~~~~~~~~~~~~~~~~~~~~~~~
norx.c: /usr/lib/llvm-7/lib/clang/7.0.1/include/mmintrin.h:253:12: error: invalid conversion between vector type '__m64' (vector of 1 'long long' value) and integer type 'int' of different size
norx.c: return (__m64)__builtin_ia32_punpckhwd((__v4hi)__m1, (__v4hi)__m2);
norx.c: ^~~~~~~~~~~~~~~~~~~~~~~~~~~~~~~~~~~~~~~~~~~~~~~~~~~~~~~~~~~
norx.c: /usr/lib/llvm-7/lib/clang/7.0.1/include/mmintrin.h:274:12: error: invalid conversion between vector type '__m64' (vector of 1 'long long' value) and integer type 'int' of different size
norx.c: return (__m64)__builtin_ia32_punpckhdq((__v2si)__m1, (__v2si)__m2);
norx.c: ^~~~~~~~~~~~~~~~~~~~~~~~~~~~~~~~~~~~~~~~~~~~~~~~~~~~~~~~~~~
norx.c: /usr/lib/llvm-7/lib/clang/7.0.1/include/mmintrin.h:301:12: error: invalid conversion between vector type '__m64' (vector of 1 'long long' value) and integer type 'int' of different size
norx.c: return (__m64)__builtin_ia32_punpcklbw((__v8qi)__m1, (__v8qi)__m2);
norx.c: ...

Number of similar (compiler,implementation) pairs: 1, namely:
CompilerImplementations
clang -mcpu=native -O3 -fomit-frame-pointer -fwrapv -Qunused-arguments -fPIC -fPIE T:xmm

Compiler output

Implementation: T:xmm
Security model: timingleaks
Compiler: gcc -march=native -mtune=native -O2 -fomit-frame-pointer -fwrapv -fPIC -fPIE
norx.c: norx.c:26:14: fatal error: immintrin.h: No such file or directory
norx.c: #include <immintrin.h>
norx.c: ^~~~~~~~~~~~~
norx.c: compilation terminated.

Number of similar (compiler,implementation) pairs: 4, namely:
CompilerImplementations
gcc -march=native -mtune=native -O2 -fomit-frame-pointer -fwrapv -fPIC -fPIE T:xmm
gcc -march=native -mtune=native -O3 -fomit-frame-pointer -fwrapv -fPIC -fPIE T:xmm
gcc -march=native -mtune=native -O -fomit-frame-pointer -fwrapv -fPIC -fPIE T:xmm
gcc -march=native -mtune=native -Os -fomit-frame-pointer -fwrapv -fPIC -fPIE T:xmm

Namespace violations

Implementation: T:ref
Security model: timingleaks
Compiler: clang -mcpu=native -O3 -fomit-frame-pointer -fwrapv -Qunused-arguments -fPIC -fPIE
norx.o norx_absorb_data T
norx.o norx_aead_decrypt T
norx.o norx_aead_encrypt T
norx.o norx_decrypt_data T
norx.o norx_encrypt_data T
norx.o norx_verify_tag T
norx.o norx_version D

Number of similar (compiler,implementation) pairs: 5, namely:
CompilerImplementations
clang -mcpu=native -O3 -fomit-frame-pointer -fwrapv -Qunused-arguments -fPIC -fPIE T:ref
gcc -march=native -mtune=native -O2 -fomit-frame-pointer -fwrapv -fPIC -fPIE T:ref
gcc -march=native -mtune=native -O3 -fomit-frame-pointer -fwrapv -fPIC -fPIE T:ref
gcc -march=native -mtune=native -O -fomit-frame-pointer -fwrapv -fPIC -fPIE T:ref
gcc -march=native -mtune=native -Os -fomit-frame-pointer -fwrapv -fPIC -fPIE T:ref