Implementation notes: armeabi, berry2, crypto_aead/norx3241v1

Computer: berry2
Architecture: armeabi
CPU ID: unknown CPU ID
SUPERCOP version: 20210529
Operation: crypto_aead
Primitive: norx3241v1
TimeObject sizeTest sizeImplementationCompilerBenchmark dateSUPERCOP version
1572062744 4 018911 392 816T:refgcc_-march=native_-mtune=native_-Os_-fomit-frame-pointer_-fwrapv_-fPIC_-fPIE2021011920210114
16568611728 4 029352 400 816T:refgcc_-march=native_-mtune=native_-O_-fomit-frame-pointer_-fwrapv_-fPIC_-fPIE2021011920210114
1742737228 4 037496 388 832T:refclang_-mcpu=native_-O3_-fomit-frame-pointer_-fwrapv_-Qunused-arguments_-fPIC_-fPIE2021011920210114
19170221184 4 039880 400 816T:refgcc_-march=native_-mtune=native_-O3_-fomit-frame-pointer_-fwrapv_-fPIC_-fPIE2021011920210114
19232315972 4 032848 400 816T:refgcc_-march=native_-mtune=native_-O2_-fomit-frame-pointer_-fwrapv_-fPIC_-fPIE2021011920210114

Compiler output

Implementation: T:neon
Security model: timingleaks
Compiler: clang -mcpu=native -O3 -fomit-frame-pointer -fwrapv -Qunused-arguments -fPIC -fPIE
norx.c: In file included from norx.c:24:
norx.c: /usr/lib/llvm-7/lib/clang/7.0.1/include/arm_neon.h:28:2: error: "NEON support not enabled"
norx.c: #error "NEON support not enabled"
norx.c: ^
norx.c: 1 error generated.

Number of similar (compiler,implementation) pairs: 1, namely:
CompilerImplementations
clang -mcpu=native -O3 -fomit-frame-pointer -fwrapv -Qunused-arguments -fPIC -fPIE T:neon

Compiler output

Implementation: T:neon
Security model: timingleaks
Compiler: gcc -march=native -mtune=native -O2 -fomit-frame-pointer -fwrapv -fPIC -fPIE
norx.c: In file included from norx.c:24:
norx.c: norx.c: In function 'crypto_aead_norx3241v1_neon_timingleaks_encrypt':
norx.c: /usr/lib/gcc/arm-linux-gnueabihf/8/include/arm_neon.h:14058:1: error: inlining failed in call to always_inline 'veorq_u32': target specific option mismatch
norx.c: veorq_u32 (uint32x4_t __a, uint32x4_t __b)
norx.c: ^~~~~~~~~
norx.c: norx.c:55:19: note: called from here
norx.c: #define XOR(A, B) veorq_u32((A), (B))
norx.c: ^~~~~~~~~~~~~~~~~~~
norx.c: norx.c:267:9: note: in expansion of macro 'XOR'
norx.c: D = XOR(D, P_); \
norx.c: ^~~
norx.c: norx.c:309:5: note: in expansion of macro 'INITIALIZE'
norx.c: INITIALIZE(A, B, C, D, N, K);
norx.c: ^~~~~~~~~~
norx.c: In file included from norx.c:24:
norx.c: /usr/lib/gcc/arm-linux-gnueabihf/8/include/arm_neon.h:16829:1: error: inlining failed in call to always_inline 'vreinterpretq_u32_u8': target specific option mismatch
norx.c: vreinterpretq_u32_u8 (uint8x16_t __a)
norx.c: ^~~~~~~~~~~~~~~~~~~~
norx.c: norx.c:38:18: note: called from here
norx.c: #define LOAD(in) vreinterpretq_u32_u8( vld1q_u8((uint8_t *)(in)) )
norx.c: ^~~~~~~~~~~~~~~~~~~~~~~~~~~~~~~~~~~~~~~~~~~~~~~~~
norx.c: norx.c:39:19: note: in expansion of macro 'LOAD'
norx.c: #define LOADU(in) LOAD((in))
norx.c: ^~~~
norx.c: norx.c:301:28: note: in expansion of macro 'LOADU'
norx.c: ...

Number of similar (compiler,implementation) pairs: 4, namely:
CompilerImplementations
gcc -march=native -mtune=native -O2 -fomit-frame-pointer -fwrapv -fPIC -fPIE T:neon
gcc -march=native -mtune=native -O3 -fomit-frame-pointer -fwrapv -fPIC -fPIE T:neon
gcc -march=native -mtune=native -O -fomit-frame-pointer -fwrapv -fPIC -fPIE T:neon
gcc -march=native -mtune=native -Os -fomit-frame-pointer -fwrapv -fPIC -fPIE T:neon

Compiler output

Implementation: T:xmm
Security model: timingleaks
Compiler: clang -mcpu=native -O3 -fomit-frame-pointer -fwrapv -Qunused-arguments -fPIC -fPIE
norx.c: In file included from norx.c:27:
norx.c: In file included from /usr/lib/llvm-7/lib/clang/7.0.1/include/x86intrin.h:29:
norx.c: In file included from /usr/lib/llvm-7/lib/clang/7.0.1/include/immintrin.h:28:
norx.c: /usr/lib/llvm-7/lib/clang/7.0.1/include/mmintrin.h:64:12: error: invalid conversion between vector type '__m64' (vector of 1 'long long' value) and integer type 'int' of different size
norx.c: return (__m64)__builtin_ia32_vec_init_v2si(__i, 0);
norx.c: ^~~~~~~~~~~~~~~~~~~~~~~~~~~~~~~~~~~~~~~~~~~
norx.c: /usr/lib/llvm-7/lib/clang/7.0.1/include/mmintrin.h:143:12: error: invalid conversion between vector type '__m64' (vector of 1 'long long' value) and integer type 'int' of different size
norx.c: return (__m64)__builtin_ia32_packsswb((__v4hi)__m1, (__v4hi)__m2);
norx.c: ^~~~~~~~~~~~~~~~~~~~~~~~~~~~~~~~~~~~~~~~~~~~~~~~~~~~~~~~~~
norx.c: /usr/lib/llvm-7/lib/clang/7.0.1/include/mmintrin.h:173:12: error: invalid conversion between vector type '__m64' (vector of 1 'long long' value) and integer type 'int' of different size
norx.c: return (__m64)__builtin_ia32_packssdw((__v2si)__m1, (__v2si)__m2);
norx.c: ^~~~~~~~~~~~~~~~~~~~~~~~~~~~~~~~~~~~~~~~~~~~~~~~~~~~~~~~~~
norx.c: /usr/lib/llvm-7/lib/clang/7.0.1/include/mmintrin.h:203:12: error: invalid conversion between vector type '__m64' (vector of 1 'long long' value) and integer type 'int' of different size
norx.c: return (__m64)__builtin_ia32_packuswb((__v4hi)__m1, (__v4hi)__m2);
norx.c: ^~~~~~~~~~~~~~~~~~~~~~~~~~~~~~~~~~~~~~~~~~~~~~~~~~~~~~~~~~
norx.c: /usr/lib/llvm-7/lib/clang/7.0.1/include/mmintrin.h:230:12: error: invalid conversion between vector type '__m64' (vector of 1 'long long' value) and integer type 'int' of different size
norx.c: return (__m64)__builtin_ia32_punpckhbw((__v8qi)__m1, (__v8qi)__m2);
norx.c: ^~~~~~~~~~~~~~~~~~~~~~~~~~~~~~~~~~~~~~~~~~~~~~~~~~~~~~~~~~~
norx.c: /usr/lib/llvm-7/lib/clang/7.0.1/include/mmintrin.h:253:12: error: invalid conversion between vector type '__m64' (vector of 1 'long long' value) and integer type 'int' of different size
norx.c: return (__m64)__builtin_ia32_punpckhwd((__v4hi)__m1, (__v4hi)__m2);
norx.c: ^~~~~~~~~~~~~~~~~~~~~~~~~~~~~~~~~~~~~~~~~~~~~~~~~~~~~~~~~~~
norx.c: /usr/lib/llvm-7/lib/clang/7.0.1/include/mmintrin.h:274:12: error: invalid conversion between vector type '__m64' (vector of 1 'long long' value) and integer type 'int' of different size
norx.c: return (__m64)__builtin_ia32_punpckhdq((__v2si)__m1, (__v2si)__m2);
norx.c: ^~~~~~~~~~~~~~~~~~~~~~~~~~~~~~~~~~~~~~~~~~~~~~~~~~~~~~~~~~~
norx.c: /usr/lib/llvm-7/lib/clang/7.0.1/include/mmintrin.h:301:12: error: invalid conversion between vector type '__m64' (vector of 1 'long long' value) and integer type 'int' of different size
norx.c: ...

Number of similar (compiler,implementation) pairs: 1, namely:
CompilerImplementations
clang -mcpu=native -O3 -fomit-frame-pointer -fwrapv -Qunused-arguments -fPIC -fPIE T:xmm

Compiler output

Implementation: T:xmm
Security model: timingleaks
Compiler: gcc -march=native -mtune=native -O2 -fomit-frame-pointer -fwrapv -fPIC -fPIE
norx.c: norx.c:27:14: fatal error: x86intrin.h: No such file or directory
norx.c: #include <x86intrin.h>
norx.c: ^~~~~~~~~~~~~
norx.c: compilation terminated.

Number of similar (compiler,implementation) pairs: 4, namely:
CompilerImplementations
gcc -march=native -mtune=native -O2 -fomit-frame-pointer -fwrapv -fPIC -fPIE T:xmm
gcc -march=native -mtune=native -O3 -fomit-frame-pointer -fwrapv -fPIC -fPIE T:xmm
gcc -march=native -mtune=native -O -fomit-frame-pointer -fwrapv -fPIC -fPIE T:xmm
gcc -march=native -mtune=native -Os -fomit-frame-pointer -fwrapv -fPIC -fPIE T:xmm

Namespace violations

Implementation: T:ref
Security model: timingleaks
Compiler: clang -mcpu=native -O3 -fomit-frame-pointer -fwrapv -Qunused-arguments -fPIC -fPIE
norx.o norx_aead_decrypt T
norx.o norx_aead_encrypt T
norx.o norx_decrypt_msg T
norx.o norx_encrypt_msg T
norx.o norx_init T
norx.o norx_output_tag T
norx.o norx_process_header T
norx.o norx_process_trailer T
norx.o norx_verify_tag T

Number of similar (compiler,implementation) pairs: 5, namely:
CompilerImplementations
clang -mcpu=native -O3 -fomit-frame-pointer -fwrapv -Qunused-arguments -fPIC -fPIE T:ref
gcc -march=native -mtune=native -O2 -fomit-frame-pointer -fwrapv -fPIC -fPIE T:ref
gcc -march=native -mtune=native -O3 -fomit-frame-pointer -fwrapv -fPIC -fPIE T:ref
gcc -march=native -mtune=native -O -fomit-frame-pointer -fwrapv -fPIC -fPIE T:ref
gcc -march=native -mtune=native -Os -fomit-frame-pointer -fwrapv -fPIC -fPIE T:ref