Implementation notes: armeabi, berry2, crypto_aead/aes128poetv1aes4

Computer: berry2
Architecture: armeabi
CPU ID: unknown CPU ID
SUPERCOP version: 20210529
Operation: crypto_aead
Primitive: aes128poetv1aes4
TimeObject sizeTest sizeImplementationCompilerBenchmark dateSUPERCOP version
61938330952 0 044072 404 816T:refgcc_-march=native_-mtune=native_-O3_-fomit-frame-pointer_-fwrapv_-fPIC_-fPIE2021011820210114
66189628460 0 051770 392 832T:refclang_-mcpu=native_-O3_-fomit-frame-pointer_-fwrapv_-Qunused-arguments_-fPIC_-fPIE2021011820210114
68526826972 0 038223 400 816T:refgcc_-march=native_-mtune=native_-O2_-fomit-frame-pointer_-fwrapv_-fPIC_-fPIE2021011820210114
70414822604 0 033364 396 816T:refgcc_-march=native_-mtune=native_-Os_-fomit-frame-pointer_-fwrapv_-fPIC_-fPIE2021011820210114
87923423644 0 035211 400 816T:refgcc_-march=native_-mtune=native_-O_-fomit-frame-pointer_-fwrapv_-fPIC_-fPIE2021011820210114

Compiler output

Implementation: T:ni
Security model: timingleaks
Compiler: clang -mcpu=native -O3 -fomit-frame-pointer -fwrapv -Qunused-arguments -fPIC -fPIE
encrypt.c: In file included from encrypt.c:34:
encrypt.c: In file included from ./poet.h:4:
encrypt.c: In file included from /usr/lib/llvm-7/lib/clang/7.0.1/include/emmintrin.h:27:
encrypt.c: In file included from /usr/lib/llvm-7/lib/clang/7.0.1/include/xmmintrin.h:27:
encrypt.c: /usr/lib/llvm-7/lib/clang/7.0.1/include/mmintrin.h:64:12: error: invalid conversion between vector type '__m64' (vector of 1 'long long' value) and integer type 'int' of different size
encrypt.c: return (__m64)__builtin_ia32_vec_init_v2si(__i, 0);
encrypt.c: ^~~~~~~~~~~~~~~~~~~~~~~~~~~~~~~~~~~~~~~~~~~
encrypt.c: /usr/lib/llvm-7/lib/clang/7.0.1/include/mmintrin.h:143:12: error: invalid conversion between vector type '__m64' (vector of 1 'long long' value) and integer type 'int' of different size
encrypt.c: return (__m64)__builtin_ia32_packsswb((__v4hi)__m1, (__v4hi)__m2);
encrypt.c: ^~~~~~~~~~~~~~~~~~~~~~~~~~~~~~~~~~~~~~~~~~~~~~~~~~~~~~~~~~
encrypt.c: /usr/lib/llvm-7/lib/clang/7.0.1/include/mmintrin.h:173:12: error: invalid conversion between vector type '__m64' (vector of 1 'long long' value) and integer type 'int' of different size
encrypt.c: return (__m64)__builtin_ia32_packssdw((__v2si)__m1, (__v2si)__m2);
encrypt.c: ^~~~~~~~~~~~~~~~~~~~~~~~~~~~~~~~~~~~~~~~~~~~~~~~~~~~~~~~~~
encrypt.c: /usr/lib/llvm-7/lib/clang/7.0.1/include/mmintrin.h:203:12: error: invalid conversion between vector type '__m64' (vector of 1 'long long' value) and integer type 'int' of different size
encrypt.c: return (__m64)__builtin_ia32_packuswb((__v4hi)__m1, (__v4hi)__m2);
encrypt.c: ^~~~~~~~~~~~~~~~~~~~~~~~~~~~~~~~~~~~~~~~~~~~~~~~~~~~~~~~~~
encrypt.c: /usr/lib/llvm-7/lib/clang/7.0.1/include/mmintrin.h:230:12: error: invalid conversion between vector type '__m64' (vector of 1 'long long' value) and integer type 'int' of different size
encrypt.c: return (__m64)__builtin_ia32_punpckhbw((__v8qi)__m1, (__v8qi)__m2);
encrypt.c: ^~~~~~~~~~~~~~~~~~~~~~~~~~~~~~~~~~~~~~~~~~~~~~~~~~~~~~~~~~~
encrypt.c: /usr/lib/llvm-7/lib/clang/7.0.1/include/mmintrin.h:253:12: error: invalid conversion between vector type '__m64' (vector of 1 'long long' value) and integer type 'int' of different size
encrypt.c: return (__m64)__builtin_ia32_punpckhwd((__v4hi)__m1, (__v4hi)__m2);
encrypt.c: ^~~~~~~~~~~~~~~~~~~~~~~~~~~~~~~~~~~~~~~~~~~~~~~~~~~~~~~~~~~
encrypt.c: /usr/lib/llvm-7/lib/clang/7.0.1/include/mmintrin.h:274:12: error: invalid conversion between vector type '__m64' (vector of 1 'long long' value) and integer type 'int' of different size
encrypt.c: return (__m64)__builtin_ia32_punpckhdq((__v2si)__m1, (__v2si)__m2);
encrypt.c: ^~~~~~~~~~~~~~~~~~~~~~~~~~~~~~~~~~~~~~~~~~~~~~~~~~~~~~~~~~~
encrypt.c: ...

Number of similar (compiler,implementation) pairs: 1, namely:
CompilerImplementations
clang -mcpu=native -O3 -fomit-frame-pointer -fwrapv -Qunused-arguments -fPIC -fPIE T:ni

Compiler output

Implementation: T:ni
Security model: timingleaks
Compiler: gcc -march=native -mtune=native -O2 -fomit-frame-pointer -fwrapv -fPIC -fPIE
encrypt.c: In file included from encrypt.c:34:
encrypt.c: poet.h:4:10: fatal error: emmintrin.h: No such file or directory
encrypt.c: #include <emmintrin.h>
encrypt.c: ^~~~~~~~~~~~~
encrypt.c: compilation terminated.

Number of similar (compiler,implementation) pairs: 4, namely:
CompilerImplementations
gcc -march=native -mtune=native -O2 -fomit-frame-pointer -fwrapv -fPIC -fPIE T:ni
gcc -march=native -mtune=native -O3 -fomit-frame-pointer -fwrapv -fPIC -fPIE T:ni
gcc -march=native -mtune=native -O -fomit-frame-pointer -fwrapv -fPIC -fPIE T:ni
gcc -march=native -mtune=native -Os -fomit-frame-pointer -fwrapv -fPIC -fPIE T:ni

Namespace violations

Implementation: T:ref
Security model: timingleaks
Compiler: clang -mcpu=native -O3 -fomit-frame-pointer -fwrapv -Qunused-arguments -fPIC -fPIE
aes.o aes_decrypt T
aes.o aes_encrypt T
aes.o aes_expand_dec_key T
aes.o aes_expand_enc_key T
aes.o aesfour_encrypt T
poet.o decrypt_final T
poet.o encrypt_final T
poet.o keysetup T
poet.o process_header T

Number of similar (compiler,implementation) pairs: 5, namely:
CompilerImplementations
clang -mcpu=native -O3 -fomit-frame-pointer -fwrapv -Qunused-arguments -fPIC -fPIE T:ref
gcc -march=native -mtune=native -O2 -fomit-frame-pointer -fwrapv -fPIC -fPIE T:ref
gcc -march=native -mtune=native -O3 -fomit-frame-pointer -fwrapv -fPIC -fPIE T:ref
gcc -march=native -mtune=native -O -fomit-frame-pointer -fwrapv -fPIC -fPIE T:ref
gcc -march=native -mtune=native -Os -fomit-frame-pointer -fwrapv -fPIC -fPIE T:ref