Implementation notes: armeabi, berry2, crypto_aead/aeadaes128ocbtaglen128v1

Computer: berry2
Architecture: armeabi
CPU ID: unknown CPU ID
SUPERCOP version: 20210529
Operation: crypto_aead
Primitive: aeadaes128ocbtaglen128v1
TimeObject sizeTest sizeImplementationCompilerBenchmark dateSUPERCOP version
29689914876 18 032445 454 816T:optgcc_-march=native_-mtune=native_-O2_-fomit-frame-pointer_-fwrapv_-fPIC_-fPIE2021011820210114
30031613840 18 032157 454 816T:optgcc_-march=native_-mtune=native_-O_-fomit-frame-pointer_-fwrapv_-fPIC_-fPIE2021011820210114
30211713468 18 044327 442 832T:optclang_-mcpu=native_-O3_-fomit-frame-pointer_-fwrapv_-Qunused-arguments_-fPIC_-fPIE2021011820210114
32019816308 18 035697 454 816T:optgcc_-march=native_-mtune=native_-O3_-fomit-frame-pointer_-fwrapv_-fPIC_-fPIE2021011820210114
34306713284 18 030142 446 816T:optgcc_-march=native_-mtune=native_-Os_-fomit-frame-pointer_-fwrapv_-fPIC_-fPIE2021011820210114
4345588884 0 039400 400 832T:refclang_-mcpu=native_-O3_-fomit-frame-pointer_-fwrapv_-Qunused-arguments_-fPIC_-fPIE2021011820210114
4478338604 0 027626 412 816T:refgcc_-march=native_-mtune=native_-O3_-fomit-frame-pointer_-fwrapv_-fPIC_-fPIE2021011820210114
5039912564 0 019717 408 816T:refgcc_-march=native_-mtune=native_-O2_-fomit-frame-pointer_-fwrapv_-fPIC_-fPIE2021011820210114
5151351828 0 018319 404 816T:refgcc_-march=native_-mtune=native_-Os_-fomit-frame-pointer_-fwrapv_-fPIC_-fPIE2021011820210114
5231922080 0 019981 408 816T:refgcc_-march=native_-mtune=native_-O_-fomit-frame-pointer_-fwrapv_-fPIC_-fPIE2021011820210114

Compiler output

Implementation: T:dolbeau/armv8crypto
Security model: timingleaks
Compiler: clang -mcpu=native -O3 -fomit-frame-pointer -fwrapv -Qunused-arguments -fPIC -fPIE
encrypt.c: In file included from encrypt.c:47:
encrypt.c: /usr/lib/llvm-7/lib/clang/7.0.1/include/arm_neon.h:28:2: error: "NEON support not enabled"
encrypt.c: #error "NEON support not enabled"
encrypt.c: ^
encrypt.c: encrypt.c:81:16: warning: implicit declaration of function 'vaesimcq_u8' is invalid in C99 [-Wimplicit-function-declaration]
encrypt.c: dkeys[i] = vaesimcq_u8(ekeys[10-i]);
encrypt.c: ^
encrypt.c: encrypt.c:81:14: error: assigning to 'uint8x16_t' (vector of 16 'uint8_t' values) from incompatible type 'int'
encrypt.c: dkeys[i] = vaesimcq_u8(ekeys[10-i]);
encrypt.c: ^ ~~~~~~~~~~~~~~~~~~~~~~~~
encrypt.c: encrypt.c:118:10: warning: implicit declaration of function 'vaeseq_u8' is invalid in C99 [-Wimplicit-function-declaration]
encrypt.c: temp = vaeseq_u8(temp, vld1q_u8((rkeys+144)));
encrypt.c: ^
encrypt.c: encrypt.c:118:8: error: assigning to 'uint8x16_t' (vector of 16 'uint8_t' values) from incompatible type 'int'
encrypt.c: temp = vaeseq_u8(temp, vld1q_u8((rkeys+144)));
encrypt.c: ^ ~~~~~~~~~~~~~~~~~~~~~~~~~~~~~~~~~~~~~~
encrypt.c: encrypt.c:158:10: warning: implicit declaration of function 'vaesdq_u8' is invalid in C99 [-Wimplicit-function-declaration]
encrypt.c: temp = vaesdq_u8(temp, vld1q_u8((rkeys+144)));
encrypt.c: ^
encrypt.c: encrypt.c:158:8: error: assigning to 'uint8x16_t' (vector of 16 'uint8_t' values) from incompatible type 'int'
encrypt.c: temp = vaesdq_u8(temp, vld1q_u8((rkeys+144)));
encrypt.c: ^ ~~~~~~~~~~~~~~~~~~~~~~~~~~~~~~~~~~~~~~
encrypt.c: encrypt.c:281:1: warning: implicit declaration of function 'vaeseq_u8' is invalid in C99 [-Wimplicit-function-declaration]
encrypt.c: FUNC(4, MAKE4, MAKE4COMMA)
encrypt.c: ^
encrypt.c: ...

Number of similar (compiler,implementation) pairs: 1, namely:
CompilerImplementations
clang -mcpu=native -O3 -fomit-frame-pointer -fwrapv -Qunused-arguments -fPIC -fPIE T:dolbeau/armv8crypto

Compiler output

Implementation: T:dolbeau/armv8crypto
Security model: timingleaks
Compiler: gcc -march=native -mtune=native -O2 -fomit-frame-pointer -fwrapv -fPIC -fPIE
encrypt.c: In file included from encrypt.c:47:
encrypt.c: encrypt.c: In function 'aes128ni_setkey_e2d':
encrypt.c: /usr/lib/gcc/arm-linux-gnueabihf/8/include/arm_neon.h:16932:1: error: inlining failed in call to always_inline 'vaesimcq_u8': target specific option mismatch
encrypt.c: vaesimcq_u8 (uint8x16_t __data)
encrypt.c: ^~~~~~~~~~~
encrypt.c: encrypt.c:81:16: note: called from here
encrypt.c: dkeys[i] = vaesimcq_u8(ekeys[10-i]);
encrypt.c: ^~~~~~~~~~~~~~~~~~~~~~~~

Number of similar (compiler,implementation) pairs: 4, namely:
CompilerImplementations
gcc -march=native -mtune=native -O2 -fomit-frame-pointer -fwrapv -fPIC -fPIE T:dolbeau/armv8crypto
gcc -march=native -mtune=native -O3 -fomit-frame-pointer -fwrapv -fPIC -fPIE T:dolbeau/armv8crypto
gcc -march=native -mtune=native -O -fomit-frame-pointer -fwrapv -fPIC -fPIE T:dolbeau/armv8crypto
gcc -march=native -mtune=native -Os -fomit-frame-pointer -fwrapv -fPIC -fPIE T:dolbeau/armv8crypto

Compiler output

Implementation: T:vaes
Security model: timingleaks
Compiler: clang -mcpu=native -O3 -fomit-frame-pointer -fwrapv -Qunused-arguments -fPIC -fPIE
ocb_vaes.c: In file included from ocb_vaes.c:71:
ocb_vaes.c: In file included from /usr/lib/llvm-7/lib/clang/7.0.1/include/immintrin.h:28:
ocb_vaes.c: /usr/lib/llvm-7/lib/clang/7.0.1/include/mmintrin.h:64:12: error: invalid conversion between vector type '__m64' (vector of 1 'long long' value) and integer type 'int' of different size
ocb_vaes.c: return (__m64)__builtin_ia32_vec_init_v2si(__i, 0);
ocb_vaes.c: ^~~~~~~~~~~~~~~~~~~~~~~~~~~~~~~~~~~~~~~~~~~
ocb_vaes.c: /usr/lib/llvm-7/lib/clang/7.0.1/include/mmintrin.h:143:12: error: invalid conversion between vector type '__m64' (vector of 1 'long long' value) and integer type 'int' of different size
ocb_vaes.c: return (__m64)__builtin_ia32_packsswb((__v4hi)__m1, (__v4hi)__m2);
ocb_vaes.c: ^~~~~~~~~~~~~~~~~~~~~~~~~~~~~~~~~~~~~~~~~~~~~~~~~~~~~~~~~~
ocb_vaes.c: /usr/lib/llvm-7/lib/clang/7.0.1/include/mmintrin.h:173:12: error: invalid conversion between vector type '__m64' (vector of 1 'long long' value) and integer type 'int' of different size
ocb_vaes.c: return (__m64)__builtin_ia32_packssdw((__v2si)__m1, (__v2si)__m2);
ocb_vaes.c: ^~~~~~~~~~~~~~~~~~~~~~~~~~~~~~~~~~~~~~~~~~~~~~~~~~~~~~~~~~
ocb_vaes.c: /usr/lib/llvm-7/lib/clang/7.0.1/include/mmintrin.h:203:12: error: invalid conversion between vector type '__m64' (vector of 1 'long long' value) and integer type 'int' of different size
ocb_vaes.c: return (__m64)__builtin_ia32_packuswb((__v4hi)__m1, (__v4hi)__m2);
ocb_vaes.c: ^~~~~~~~~~~~~~~~~~~~~~~~~~~~~~~~~~~~~~~~~~~~~~~~~~~~~~~~~~
ocb_vaes.c: /usr/lib/llvm-7/lib/clang/7.0.1/include/mmintrin.h:230:12: error: invalid conversion between vector type '__m64' (vector of 1 'long long' value) and integer type 'int' of different size
ocb_vaes.c: return (__m64)__builtin_ia32_punpckhbw((__v8qi)__m1, (__v8qi)__m2);
ocb_vaes.c: ^~~~~~~~~~~~~~~~~~~~~~~~~~~~~~~~~~~~~~~~~~~~~~~~~~~~~~~~~~~
ocb_vaes.c: /usr/lib/llvm-7/lib/clang/7.0.1/include/mmintrin.h:253:12: error: invalid conversion between vector type '__m64' (vector of 1 'long long' value) and integer type 'int' of different size
ocb_vaes.c: return (__m64)__builtin_ia32_punpckhwd((__v4hi)__m1, (__v4hi)__m2);
ocb_vaes.c: ^~~~~~~~~~~~~~~~~~~~~~~~~~~~~~~~~~~~~~~~~~~~~~~~~~~~~~~~~~~
ocb_vaes.c: /usr/lib/llvm-7/lib/clang/7.0.1/include/mmintrin.h:274:12: error: invalid conversion between vector type '__m64' (vector of 1 'long long' value) and integer type 'int' of different size
ocb_vaes.c: return (__m64)__builtin_ia32_punpckhdq((__v2si)__m1, (__v2si)__m2);
ocb_vaes.c: ^~~~~~~~~~~~~~~~~~~~~~~~~~~~~~~~~~~~~~~~~~~~~~~~~~~~~~~~~~~
ocb_vaes.c: /usr/lib/llvm-7/lib/clang/7.0.1/include/mmintrin.h:301:12: error: invalid conversion between vector type '__m64' (vector of 1 'long long' value) and integer type 'int' of different size
ocb_vaes.c: return (__m64)__builtin_ia32_punpcklbw((__v8qi)__m1, (__v8qi)__m2);
ocb_vaes.c: ...

Number of similar (compiler,implementation) pairs: 1, namely:
CompilerImplementations
clang -mcpu=native -O3 -fomit-frame-pointer -fwrapv -Qunused-arguments -fPIC -fPIE T:vaes

Compiler output

Implementation: T:vaes
Security model: timingleaks
Compiler: gcc -march=native -mtune=native -O2 -fomit-frame-pointer -fwrapv -fPIC -fPIE
ocb_vaes.c: ocb_vaes.c:71:10: fatal error: immintrin.h: No such file or directory
ocb_vaes.c: #include <immintrin.h>
ocb_vaes.c: ^~~~~~~~~~~~~
ocb_vaes.c: compilation terminated.

Number of similar (compiler,implementation) pairs: 4, namely:
CompilerImplementations
gcc -march=native -mtune=native -O2 -fomit-frame-pointer -fwrapv -fPIC -fPIE T:vaes
gcc -march=native -mtune=native -O3 -fomit-frame-pointer -fwrapv -fPIC -fPIE T:vaes
gcc -march=native -mtune=native -O -fomit-frame-pointer -fwrapv -fPIC -fPIE T:vaes
gcc -march=native -mtune=native -Os -fomit-frame-pointer -fwrapv -fPIC -fPIE T:vaes

Namespace violations

Implementation: T:opt
Security model: timingleaks
Compiler: clang -mcpu=native -O3 -fomit-frame-pointer -fwrapv -Qunused-arguments -fPIC -fPIE
ocb.o ae_allocate T
ocb.o ae_clear T
ocb.o ae_ctx_sizeof T
ocb.o ae_decrypt T
ocb.o ae_encrypt T
ocb.o ae_free T
ocb.o ae_init T
ocb.o gen_offset T
ocb.o infoString D

Number of similar (compiler,implementation) pairs: 5, namely:
CompilerImplementations
clang -mcpu=native -O3 -fomit-frame-pointer -fwrapv -Qunused-arguments -fPIC -fPIE T:opt
gcc -march=native -mtune=native -O2 -fomit-frame-pointer -fwrapv -fPIC -fPIE T:opt
gcc -march=native -mtune=native -O3 -fomit-frame-pointer -fwrapv -fPIC -fPIE T:opt
gcc -march=native -mtune=native -O -fomit-frame-pointer -fwrapv -fPIC -fPIE T:opt
gcc -march=native -mtune=native -Os -fomit-frame-pointer -fwrapv -fPIC -fPIE T:opt

Namespace violations

Implementation: T:ref
Security model: timingleaks
Compiler: clang -mcpu=native -O3 -fomit-frame-pointer -fwrapv -Qunused-arguments -fPIC -fPIE
encrypt.o ocb_decrypt T
encrypt.o ocb_encrypt T

Number of similar (compiler,implementation) pairs: 5, namely:
CompilerImplementations
clang -mcpu=native -O3 -fomit-frame-pointer -fwrapv -Qunused-arguments -fPIC -fPIE T:ref
gcc -march=native -mtune=native -O2 -fomit-frame-pointer -fwrapv -fPIC -fPIE T:ref
gcc -march=native -mtune=native -O3 -fomit-frame-pointer -fwrapv -fPIC -fPIE T:ref
gcc -march=native -mtune=native -O -fomit-frame-pointer -fwrapv -fPIC -fPIE T:ref
gcc -march=native -mtune=native -Os -fomit-frame-pointer -fwrapv -fPIC -fPIE T:ref