Implementation notes: amd64, wolfdale, crypto_encrypt/r5n13pke0smallct

Computer: wolfdale
Microarchitecture: amd64; Core 2 45nm (1067a)
Architecture: amd64
CPU ID: GenuineIntel-0001067a-bfebfbff
SUPERCOP version: 20240625
Operation: crypto_encrypt
Primitive: r5n13pke0smallct
TimeObject sizeTest sizeImplementationCompilerBenchmark dateSUPERCOP version
2887572921522 0 0193114 988 1720T:avx2clang_-march=native_-Os_-fwrapv_-Qunused-arguments_-fPIC_-fPIE_-gdwarf-4_-Wall2024071620240625
2904525725835 0 0197172 996 1720T:avx2clang_-march=native_-O2_-fwrapv_-Qunused-arguments_-fPIC_-fPIE_-gdwarf-4_-Wall2024071620240625
2906667631145 0 0198932 996 1720T:avx2clang_-march=native_-O3_-fwrapv_-Qunused-arguments_-fPIC_-fPIE_-gdwarf-4_-Wall2024071620240625
2907948231631 0 0198548 996 1720T:avx2clang_-mcpu=native_-O3_-fwrapv_-Qunused-arguments_-fPIC_-fPIE_-gdwarf-4_-Wall2024071620240625
2942407821522 0 0193114 988 1720T:optclang_-march=native_-Os_-fwrapv_-Qunused-arguments_-fPIC_-fPIE_-gdwarf-4_-Wall2024071620240625
2946840331631 0 0198548 996 1720T:optclang_-mcpu=native_-O3_-fwrapv_-Qunused-arguments_-fPIC_-fPIE_-gdwarf-4_-Wall2024071620240625
2951572825835 0 0197172 996 1720T:optclang_-march=native_-O2_-fwrapv_-Qunused-arguments_-fPIC_-fPIE_-gdwarf-4_-Wall2024071620240625
2953805031145 0 0198932 996 1720T:optclang_-march=native_-O3_-fwrapv_-Qunused-arguments_-fPIC_-fPIE_-gdwarf-4_-Wall2024071620240625
2972896122818 0 0194762 988 1720T:optclang_-march=native_-O_-fwrapv_-Qunused-arguments_-fPIC_-fPIE_-gdwarf-4_-Wall2024071620240625
2973917722818 0 0194762 988 1720T:avx2clang_-march=native_-O_-fwrapv_-Qunused-arguments_-fPIC_-fPIE_-gdwarf-4_-Wall2024071620240625
3109407030494 0 0198573 980 1752T:avx2gcc_-march=native_-mtune=native_-O3_-fwrapv_-fPIC_-fPIE_-gdwarf-4_-Wall2024071620240625
3111155530494 0 0198573 980 1752T:optgcc_-march=native_-mtune=native_-O3_-fwrapv_-fPIC_-fPIE_-gdwarf-4_-Wall2024071620240625
3461237223150 0 0194789 980 1752T:avx2gcc_-march=native_-mtune=native_-O_-fwrapv_-fPIC_-fPIE_-gdwarf-4_-Wall2024071620240625
3461300823150 0 0194789 980 1752T:optgcc_-march=native_-mtune=native_-O_-fwrapv_-fPIC_-fPIE_-gdwarf-4_-Wall2024071620240625
3691270023040 0 0192565 972 1752T:optgcc_-march=native_-mtune=native_-Os_-fwrapv_-fPIC_-fPIE_-gdwarf-4_-Wall2024071620240625
3693203423040 0 0192565 972 1752T:avx2gcc_-march=native_-mtune=native_-Os_-fwrapv_-fPIC_-fPIE_-gdwarf-4_-Wall2024071620240625
3693434725133 0 0196325 980 1752T:avx2gcc_-march=native_-mtune=native_-O2_-fwrapv_-fPIC_-fPIE_-gdwarf-4_-Wall2024071620240625
3726209725133 0 0196325 980 1752T:optgcc_-march=native_-mtune=native_-O2_-fwrapv_-fPIC_-fPIE_-gdwarf-4_-Wall2024071620240625

Compiler output


a_fixed.c: In file included from a_fixed.c:10:
a_fixed.c: In file included from ./a_fixed.h:13:
a_fixed.c: ./r5_parameter_sets.h:143:2: warning: AVX2 not supported by platform [-W#warnings]
a_fixed.c: #warning AVX2 not supported by platform
a_fixed.c:  ^
a_fixed.c: 1 warning generated.
a_random.c: In file included from a_random.c:10:
a_random.c: In file included from ./a_random.h:13:
a_random.c: ./r5_parameter_sets.h:143:2: warning: AVX2 not supported by platform [-W#warnings]
a_random.c: #warning AVX2 not supported by platform
a_random.c:  ^
a_random.c: 1 warning generated.
cca_encrypt.c: In file included from cca_encrypt.c:12:
cca_encrypt.c: In file included from ./cca_encrypt.h:14:
cca_encrypt.c: ./r5_parameter_sets.h:143:2: warning: AVX2 not supported by platform [-W#warnings]
cca_encrypt.c: #warning AVX2 not supported by platform
cca_encrypt.c:  ^
cca_encrypt.c: 1 warning generated.
cpa_kem.c: In file included from cpa_kem.c:11:
cpa_kem.c: In file included from ./cpa_kem.h:13:
cpa_kem.c: ./r5_parameter_sets.h:143:2: warning: AVX2 not supported by platform [-W#warnings]
cpa_kem.c: #warning AVX2 not supported by platform
cpa_kem.c:  ^
cpa_kem.c: 1 warning generated.
drbg.c: In file included from drbg.c:18:
drbg.c: In file included from ./drbg.h:13:
drbg.c: ./r5_parameter_sets.h:143:2: warning: AVX2 not supported by platform [-W#warnings]
drbg.c: #warning AVX2 not supported by platform
drbg.c:  ^
drbg.c: 1 warning generated.
matmul.c: In file included from matmul.c:8:
matmul.c: In file included from ./matmul.h:8:
matmul.c: ./r5_parameter_sets.h:143:2: warning: AVX2 not supported by platform [-W#warnings]
matmul.c: #warning AVX2 not supported by platform
matmul.c:  ^
matmul.c: 1 warning generated.
matmul_avx2.c: In file included from matmul_avx2.c:8:
matmul_avx2.c: In file included from ./matmul.h:8:
matmul_avx2.c: ./r5_parameter_sets.h:143:2: warning: AVX2 not supported by platform [-W#warnings]
matmul_avx2.c: #warning AVX2 not supported by platform
matmul_avx2.c:  ^
matmul_avx2.c: 1 warning generated.
matmul_cm.c: In file included from matmul_cm.c:7:
matmul_cm.c: In file included from ./matmul.h:8:
matmul_cm.c: ./r5_parameter_sets.h:143:2: warning: AVX2 not supported by platform [-W#warnings]
matmul_cm.c: #warning AVX2 not supported by platform
matmul_cm.c:  ^
matmul_cm.c: 1 warning generated.
probe_cm.c: In file included from probe_cm.c:6:
probe_cm.c: ./r5_parameter_sets.h:143:2: warning: AVX2 not supported by platform [-W#warnings]
probe_cm.c: #warning AVX2 not supported by platform
probe_cm.c:  ^
probe_cm.c: 1 warning generated.
r5_cca_kem.c: In file included from r5_cca_kem.c:7:
r5_cca_kem.c: ./r5_parameter_sets.h:143:2: warning: AVX2 not supported by platform [-W#warnings]
r5_cca_kem.c: #warning AVX2 not supported by platform
r5_cca_kem.c:  ^
r5_cca_kem.c: 1 warning generated.
r5_cca_pke.c: In file included from r5_cca_pke.c:12:
r5_cca_pke.c: ./r5_parameter_sets.h:143:2: warning: AVX2 not supported by platform [-W#warnings]
r5_cca_pke.c: #warning AVX2 not supported by platform
r5_cca_pke.c:  ^
r5_cca_pke.c: 1 warning generated.
r5_cpa_kem.c: In file included from r5_cpa_kem.c:9:
r5_cpa_kem.c: ./r5_parameter_sets.h:143:2: warning: AVX2 not supported by platform [-W#warnings]
r5_cpa_kem.c: #warning AVX2 not supported by platform
r5_cpa_kem.c:  ^
r5_cpa_kem.c: 1 warning generated.
r5_cpa_pke_n1.c: In file included from r5_cpa_pke_n1.c:6:
r5_cpa_pke_n1.c: ./r5_parameter_sets.h:143:2: warning: AVX2 not supported by platform [-W#warnings]
r5_cpa_pke_n1.c: #warning AVX2 not supported by platform
r5_cpa_pke_n1.c:  ^
r5_cpa_pke_n1.c: 1 warning generated.
r5_cpa_pke_nd.c: In file included from r5_cpa_pke_nd.c:7:
r5_cpa_pke_nd.c: ./r5_parameter_sets.h:143:2: warning: AVX2 not supported by platform [-W#warnings]
r5_cpa_pke_nd.c: #warning AVX2 not supported by platform
r5_cpa_pke_nd.c:  ^
r5_cpa_pke_nd.c: 1 warning generated.
r5_dem.c: In file included from r5_dem.c:11:
r5_dem.c: ./r5_parameter_sets.h:143:2: warning: AVX2 not supported by platform [-W#warnings]
r5_dem.c: #warning AVX2 not supported by platform
r5_dem.c:  ^
r5_dem.c: 1 warning generated.
ringmul.c: In file included from ringmul.c:8:
ringmul.c: In file included from ./ringmul.h:9:
ringmul.c: ./r5_parameter_sets.h:143:2: warning: AVX2 not supported by platform [-W#warnings]
ringmul.c: #warning AVX2 not supported by platform
ringmul.c:  ^
ringmul.c: 1 warning generated.
ringmul_cm.c: In file included from ringmul_cm.c:8:
ringmul_cm.c: In file included from ./ringmul.h:9:
ringmul_cm.c: ./r5_parameter_sets.h:143:2: warning: AVX2 not supported by platform [-W#warnings]
ringmul_cm.c: #warning AVX2 not supported by platform
ringmul_cm.c:  ^
ringmul_cm.c: 1 warning generated.

Number of similar (implementation,compiler) pairs: 5, namely:
ImplementationCompiler
T:avx2clang -march=native -O2 -fwrapv -Qunused-arguments -fPIC -fPIE -gdwarf-4 -Wall (Debian_Clang_11.0.1)
T:avx2clang -march=native -O3 -fwrapv -Qunused-arguments -fPIC -fPIE -gdwarf-4 -Wall (Debian_Clang_11.0.1)
T:avx2clang -march=native -O -fwrapv -Qunused-arguments -fPIC -fPIE -gdwarf-4 -Wall (Debian_Clang_11.0.1)
T:avx2clang -march=native -Os -fwrapv -Qunused-arguments -fPIC -fPIE -gdwarf-4 -Wall (Debian_Clang_11.0.1)
T:avx2clang -mcpu=native -O3 -fwrapv -Qunused-arguments -fPIC -fPIE -gdwarf-4 -Wall (Debian_Clang_11.0.1)

Compiler output


a_fixed.c: In file included from a_fixed.h:13,
a_fixed.c:                  from a_fixed.c:10:
a_fixed.c: r5_parameter_sets.h:143:2: warning: #warning AVX2 not supported by platform [-Wcpp]
a_fixed.c:   143 | #warning AVX2 not supported by platform
a_fixed.c:       |  ^~~~~~~
a_random.c: In file included from a_random.h:13,
a_random.c:                  from a_random.c:10:
a_random.c: r5_parameter_sets.h:143:2: warning: #warning AVX2 not supported by platform [-Wcpp]
a_random.c:   143 | #warning AVX2 not supported by platform
a_random.c:       |  ^~~~~~~
cca_encrypt.c: In file included from cca_encrypt.h:14,
cca_encrypt.c:                  from cca_encrypt.c:12:
cca_encrypt.c: r5_parameter_sets.h:143:2: warning: #warning AVX2 not supported by platform [-Wcpp]
cca_encrypt.c:   143 | #warning AVX2 not supported by platform
cca_encrypt.c:       |  ^~~~~~~
cpa_kem.c: In file included from cpa_kem.h:13,
cpa_kem.c:                  from cpa_kem.c:11:
cpa_kem.c: r5_parameter_sets.h:143:2: warning: #warning AVX2 not supported by platform [-Wcpp]
cpa_kem.c:   143 | #warning AVX2 not supported by platform
cpa_kem.c:       |  ^~~~~~~
drbg.c: In file included from drbg.h:13,
drbg.c:                  from drbg.c:18:
drbg.c: r5_parameter_sets.h:143:2: warning: #warning AVX2 not supported by platform [-Wcpp]
drbg.c:   143 | #warning AVX2 not supported by platform
drbg.c:       |  ^~~~~~~
matmul.c: In file included from matmul.h:8,
matmul.c:                  from matmul.c:8:
matmul.c: r5_parameter_sets.h:143:2: warning: #warning AVX2 not supported by platform [-Wcpp]
matmul.c:   143 | #warning AVX2 not supported by platform
matmul.c:       |  ^~~~~~~
matmul_avx2.c: In file included from matmul.h:8,
matmul_avx2.c:                  from matmul_avx2.c:8:
matmul_avx2.c: r5_parameter_sets.h:143:2: warning: #warning AVX2 not supported by platform [-Wcpp]
matmul_avx2.c:   143 | #warning AVX2 not supported by platform
matmul_avx2.c:       |  ^~~~~~~
matmul_cm.c: In file included from matmul.h:8,
matmul_cm.c:                  from matmul_cm.c:7:
matmul_cm.c: r5_parameter_sets.h:143:2: warning: #warning AVX2 not supported by platform [-Wcpp]
matmul_cm.c:   143 | #warning AVX2 not supported by platform
matmul_cm.c:       |  ^~~~~~~
probe_cm.c: In file included from probe_cm.c:6:
probe_cm.c: r5_parameter_sets.h:143:2: warning: #warning AVX2 not supported by platform [-Wcpp]
probe_cm.c:   143 | #warning AVX2 not supported by platform
probe_cm.c:       |  ^~~~~~~
r5_cca_kem.c: In file included from r5_cca_kem.c:7:
r5_cca_kem.c: r5_parameter_sets.h:143:2: warning: #warning AVX2 not supported by platform [-Wcpp]
r5_cca_kem.c:   143 | #warning AVX2 not supported by platform
r5_cca_kem.c:       |  ^~~~~~~
r5_cca_pke.c: In file included from r5_cca_pke.c:12:
r5_cca_pke.c: r5_parameter_sets.h:143:2: warning: #warning AVX2 not supported by platform [-Wcpp]
r5_cca_pke.c:   143 | #warning AVX2 not supported by platform
r5_cca_pke.c:       |  ^~~~~~~
r5_cpa_kem.c: In file included from r5_cpa_kem.c:9:
r5_cpa_kem.c: r5_parameter_sets.h:143:2: warning: #warning AVX2 not supported by platform [-Wcpp]
r5_cpa_kem.c:   143 | #warning AVX2 not supported by platform
r5_cpa_kem.c:       |  ^~~~~~~
r5_cpa_pke_n1.c: In file included from r5_cpa_pke_n1.c:6:
r5_cpa_pke_n1.c: r5_parameter_sets.h:143:2: warning: #warning AVX2 not supported by platform [-Wcpp]
r5_cpa_pke_n1.c:   143 | #warning AVX2 not supported by platform
r5_cpa_pke_n1.c:       |  ^~~~~~~
r5_cpa_pke_nd.c: In file included from r5_cpa_pke_nd.c:7:
r5_cpa_pke_nd.c: r5_parameter_sets.h:143:2: warning: #warning AVX2 not supported by platform [-Wcpp]
r5_cpa_pke_nd.c:   143 | #warning AVX2 not supported by platform
r5_cpa_pke_nd.c:       |  ^~~~~~~
r5_dem.c: In file included from r5_dem.c:11:
r5_dem.c: r5_parameter_sets.h:143:2: warning: #warning AVX2 not supported by platform [-Wcpp]
r5_dem.c:   143 | #warning AVX2 not supported by platform
r5_dem.c:       |  ^~~~~~~
ringmul.c: In file included from ringmul.h:9,
ringmul.c:                  from ringmul.c:8:
ringmul.c: r5_parameter_sets.h:143:2: warning: #warning AVX2 not supported by platform [-Wcpp]
ringmul.c:   143 | #warning AVX2 not supported by platform
ringmul.c:       |  ^~~~~~~
ringmul_cm.c: In file included from ringmul.h:9,
ringmul_cm.c:                  from ringmul_cm.c:8:
ringmul_cm.c: r5_parameter_sets.h:143:2: warning: #warning AVX2 not supported by platform [-Wcpp]
ringmul_cm.c:   143 | #warning AVX2 not supported by platform
ringmul_cm.c:       |  ^~~~~~~

Number of similar (implementation,compiler) pairs: 4, namely:
ImplementationCompiler
T:avx2gcc -march=native -mtune=native -O2 -fwrapv -fPIC -fPIE -gdwarf-4 -Wall (10.2.1_20210110)
T:avx2gcc -march=native -mtune=native -O3 -fwrapv -fPIC -fPIE -gdwarf-4 -Wall (10.2.1_20210110)
T:avx2gcc -march=native -mtune=native -O -fwrapv -fPIC -fPIE -gdwarf-4 -Wall (10.2.1_20210110)
T:avx2gcc -march=native -mtune=native -Os -fwrapv -fPIC -fPIE -gdwarf-4 -Wall (10.2.1_20210110)

Compiler output


try.c: /usr/bin/ld: libcrypto_encrypt_r5n13pke0smallct.a(parameters.o):.../supercop-data/wolfdale/amd64/try/c/clang_-march=native_-O2_-fwrapv_-Qunused-arguments_-fPIC_-fPIE_-gdwarf-4_-Wall/timingleaks/crypto_encrypt/r5n13pke0smallct/ref/work/./r5_parameter_sets.h:69: multiple definition of `r5_parameter_set_names'; libcrypto_encrypt_r5n13pke0smallct.a(cca_encrypt.o):.../supercop-data/wolfdale/amd64/try/c/clang_-march=native_-O2_-fwrapv_-Qunused-arguments_-fPIC_-fPIE_-gdwarf-4_-Wall/timingleaks/crypto_encrypt/r5n13pke0smallct/ref/work/./r5_parameter_sets.h:69: first defined here
try.c: /usr/bin/ld: libcrypto_encrypt_r5n13pke0smallct.a(parameters.o):.../supercop-data/wolfdale/amd64/try/c/clang_-march=native_-O2_-fwrapv_-Qunused-arguments_-fPIC_-fPIE_-gdwarf-4_-Wall/timingleaks/crypto_encrypt/r5n13pke0smallct/ref/work/./r5_parameter_sets.h:66: multiple definition of `r5_parameter_sets'; libcrypto_encrypt_r5n13pke0smallct.a(cca_encrypt.o):.../supercop-data/wolfdale/amd64/try/c/clang_-march=native_-O2_-fwrapv_-Qunused-arguments_-fPIC_-fPIE_-gdwarf-4_-Wall/timingleaks/crypto_encrypt/r5n13pke0smallct/ref/work/./r5_parameter_sets.h:66: first defined here
try.c: /usr/bin/ld: libcrypto_encrypt_r5n13pke0smallct.a(r5_cca_pke.o):.../supercop-data/wolfdale/amd64/try/c/clang_-march=native_-O2_-fwrapv_-Qunused-arguments_-fPIC_-fPIE_-gdwarf-4_-Wall/timingleaks/crypto_encrypt/r5n13pke0smallct/ref/work/./r5_parameter_sets.h:69: multiple definition of `r5_parameter_set_names'; libcrypto_encrypt_r5n13pke0smallct.a(cca_encrypt.o):.../supercop-data/wolfdale/amd64/try/c/clang_-march=native_-O2_-fwrapv_-Qunused-arguments_-fPIC_-fPIE_-gdwarf-4_-Wall/timingleaks/crypto_encrypt/r5n13pke0smallct/ref/work/./r5_parameter_sets.h:69: first defined here
try.c: /usr/bin/ld: libcrypto_encrypt_r5n13pke0smallct.a(r5_cca_pke.o):.../supercop-data/wolfdale/amd64/try/c/clang_-march=native_-O2_-fwrapv_-Qunused-arguments_-fPIC_-fPIE_-gdwarf-4_-Wall/timingleaks/crypto_encrypt/r5n13pke0smallct/ref/work/./r5_parameter_sets.h:66: multiple definition of `r5_parameter_sets'; libcrypto_encrypt_r5n13pke0smallct.a(cca_encrypt.o):.../supercop-data/wolfdale/amd64/try/c/clang_-march=native_-O2_-fwrapv_-Qunused-arguments_-fPIC_-fPIE_-gdwarf-4_-Wall/timingleaks/crypto_encrypt/r5n13pke0smallct/ref/work/./r5_parameter_sets.h:66: first defined here
try.c: /usr/bin/ld: libcrypto_encrypt_r5n13pke0smallct.a(r5_cca_kem.o):.../supercop-data/wolfdale/amd64/try/c/clang_-march=native_-O2_-fwrapv_-Qunused-arguments_-fPIC_-fPIE_-gdwarf-4_-Wall/timingleaks/crypto_encrypt/r5n13pke0smallct/ref/work/./r5_parameter_sets.h:69: multiple definition of `r5_parameter_set_names'; libcrypto_encrypt_r5n13pke0smallct.a(cca_encrypt.o):.../supercop-data/wolfdale/amd64/try/c/clang_-march=native_-O2_-fwrapv_-Qunused-arguments_-fPIC_-fPIE_-gdwarf-4_-Wall/timingleaks/crypto_encrypt/r5n13pke0smallct/ref/work/./r5_parameter_sets.h:69: first defined here
try.c: /usr/bin/ld: libcrypto_encrypt_r5n13pke0smallct.a(r5_cca_kem.o):.../supercop-data/wolfdale/amd64/try/c/clang_-march=native_-O2_-fwrapv_-Qunused-arguments_-fPIC_-fPIE_-gdwarf-4_-Wall/timingleaks/crypto_encrypt/r5n13pke0smallct/ref/work/./r5_parameter_sets.h:66: multiple definition of `r5_parameter_sets'; libcrypto_encrypt_r5n13pke0smallct.a(cca_encrypt.o):.../supercop-data/wolfdale/amd64/try/c/clang_-march=native_-O2_-fwrapv_-Qunused-arguments_-fPIC_-fPIE_-gdwarf-4_-Wall/timingleaks/crypto_encrypt/r5n13pke0smallct/ref/work/./r5_parameter_sets.h:66: first defined here
try.c: /usr/bin/ld: libcrypto_encrypt_r5n13pke0smallct.a(r5_cpa_pke.o):.../supercop-data/wolfdale/amd64/try/c/clang_-march=native_-O2_-fwrapv_-Qunused-arguments_-fPIC_-fPIE_-gdwarf-4_-Wall/timingleaks/crypto_encrypt/r5n13pke0smallct/ref/work/./r5_parameter_sets.h:69: multiple definition of `r5_parameter_set_names'; libcrypto_encrypt_r5n13pke0smallct.a(cca_encrypt.o):.../supercop-data/wolfdale/amd64/try/c/clang_-march=native_-O2_-fwrapv_-Qunused-arguments_-fPIC_-fPIE_-gdwarf-4_-Wall/timingleaks/crypto_encrypt/r5n13pke0smallct/ref/work/./r5_parameter_sets.h:69: first defined here
try.c: /usr/bin/ld: libcrypto_encrypt_r5n13pke0smallct.a(r5_cpa_pke.o):.../supercop-data/wolfdale/amd64/try/c/clang_-march=native_-O2_-fwrapv_-Qunused-arguments_-fPIC_-fPIE_-gdwarf-4_-Wall/timingleaks/crypto_encrypt/r5n13pke0smallct/ref/work/./r5_parameter_sets.h:66: multiple definition of `r5_parameter_sets'; libcrypto_encrypt_r5n13pke0smallct.a(cca_encrypt.o):.../supercop-data/wolfdale/amd64/try/c/clang_-march=native_-O2_-fwrapv_-Qunused-arguments_-fPIC_-fPIE_-gdwarf-4_-Wall/timingleaks/crypto_encrypt/r5n13pke0smallct/ref/work/./r5_parameter_sets.h:66: first defined here
try.c: /usr/bin/ld: libcrypto_encrypt_r5n13pke0smallct.a(r5_core.o):.../supercop-data/wolfdale/amd64/try/c/clang_-march=native_-O2_-fwrapv_-Qunused-arguments_-fPIC_-fPIE_-gdwarf-4_-Wall/timingleaks/crypto_encrypt/r5n13pke0smallct/ref/work/./r5_parameter_sets.h:69: multiple definition of `r5_parameter_set_names'; libcrypto_encrypt_r5n13pke0smallct.a(cca_encrypt.o):.../supercop-data/wolfdale/amd64/try/c/clang_-march=native_-O2_-fwrapv_-Qunused-arguments_-fPIC_-fPIE_-gdwarf-4_-Wall/timingleaks/crypto_encrypt/r5n13pke0smallct/ref/work/./r5_parameter_sets.h:69: first defined here
try.c: /usr/bin/ld: libcrypto_encrypt_r5n13pke0smallct.a(r5_core.o):.../supercop-data/wolfdale/amd64/try/c/clang_-march=native_-O2_-fwrapv_-Qunused-arguments_-fPIC_-fPIE_-gdwarf-4_-Wall/timingleaks/crypto_encrypt/r5n13pke0smallct/ref/work/./r5_parameter_sets.h:66: multiple definition of `r5_parameter_sets'; libcrypto_encrypt_r5n13pke0smallct.a(cca_encrypt.o):.../supercop-data/wolfdale/amd64/try/c/clang_-march=native_-O2_-fwrapv_-Qunused-arguments_-fPIC_-fPIE_-gdwarf-4_-Wall/timingleaks/crypto_encrypt/r5n13pke0smallct/ref/work/./r5_parameter_sets.h:66: first defined here
try.c: /usr/bin/ld: libcrypto_encrypt_r5n13pke0smallct.a(a_fixed.o):.../supercop-data/wolfdale/amd64/try/c/clang_-march=native_-O2_-fwrapv_-Qunused-arguments_-fPIC_-fPIE_-gdwarf-4_-Wall/timingleaks/crypto_encrypt/r5n13pke0smallct/ref/work/./r5_parameter_sets.h:69: multiple definition of `r5_parameter_set_names'; libcrypto_encrypt_r5n13pke0smallct.a(cca_encrypt.o):.../supercop-data/wolfdale/amd64/try/c/clang_-march=native_-O2_-fwrapv_-Qunused-arguments_-fPIC_-fPIE_-gdwarf-4_-Wall/timingleaks/crypto_encrypt/r5n13pke0smallct/ref/work/./r5_parameter_sets.h:69: first defined here
try.c: /usr/bin/ld: libcrypto_encrypt_r5n13pke0smallct.a(a_fixed.o):.../supercop-data/wolfdale/amd64/try/c/clang_-march=native_-O2_-fwrapv_-Qunused-arguments_-fPIC_-fPIE_-gdwarf-4_-Wall/timingleaks/crypto_encrypt/r5n13pke0smallct/ref/work/./r5_parameter_sets.h:66: multiple definition of `r5_parameter_sets'; libcrypto_encrypt_r5n13pke0smallct.a(cca_encrypt.o):.../supercop-data/wolfdale/amd64/try/c/clang_-march=native_-O2_-fwrapv_-Qunused-arguments_-fPIC_-fPIE_-gdwarf-4_-Wall/timingleaks/crypto_encrypt/r5n13pke0smallct/ref/work/./r5_parameter_sets.h:66: first defined here
try.c: /usr/bin/ld: libcrypto_encrypt_r5n13pke0smallct.a(a_random.o):.../supercop-data/wolfdale/amd64/try/c/clang_-march=native_-O2_-fwrapv_-Qunused-arguments_-fPIC_-fPIE_-gdwarf-4_-Wall/timingleaks/crypto_encrypt/r5n13pke0smallct/ref/work/./r5_parameter_sets.h:69: multiple definition of `r5_parameter_set_names'; libcrypto_encrypt_r5n13pke0smallct.a(cca_encrypt.o):.../supercop-data/wolfdale/amd64/try/c/clang_-march=native_-O2_-fwrapv_-Qunused-arguments_-fPIC_-fPIE_-gdwarf-4_-Wall/timingleaks/crypto_encrypt/r5n13pke0smallct/ref/work/./r5_parameter_sets.h:69: first defined here
try.c: /usr/bin/ld: libcrypto_encrypt_r5n13pke0smallct.a(a_random.o):.../supercop-data/wolfdale/amd64/try/c/clang_-march=native_-O2_-fwrapv_-Qunused-arguments_-fPIC_-fPIE_-gdwarf-4_-Wall/timingleaks/crypto_encrypt/r5n13pke0smallct/ref/work/./r5_parameter_sets.h:66: multiple definition of `r5_parameter_sets'; libcrypto_encrypt_r5n13pke0smallct.a(cca_encrypt.o):.../supercop-data/wolfdale/amd64/try/c/clang_-march=native_-O2_-fwrapv_-Qunused-arguments_-fPIC_-fPIE_-gdwarf-4_-Wall/timingleaks/crypto_encrypt/r5n13pke0smallct/ref/work/./r5_parameter_sets.h:66: first defined here
try.c: clang: error: linker command failed with exit code 1 (use -v to see invocation)

Number of similar (implementation,compiler) pairs: 1, namely:
ImplementationCompiler
T:refclang -march=native -O2 -fwrapv -Qunused-arguments -fPIC -fPIE -gdwarf-4 -Wall (Debian_Clang_11.0.1)

Compiler output


try.c: /usr/bin/ld: libcrypto_encrypt_r5n13pke0smallct.a(parameters.o):.../supercop-data/wolfdale/amd64/try/c/clang_-march=native_-O3_-fwrapv_-Qunused-arguments_-fPIC_-fPIE_-gdwarf-4_-Wall/timingleaks/crypto_encrypt/r5n13pke0smallct/ref/work/./r5_parameter_sets.h:69: multiple definition of `r5_parameter_set_names'; libcrypto_encrypt_r5n13pke0smallct.a(cca_encrypt.o):.../supercop-data/wolfdale/amd64/try/c/clang_-march=native_-O3_-fwrapv_-Qunused-arguments_-fPIC_-fPIE_-gdwarf-4_-Wall/timingleaks/crypto_encrypt/r5n13pke0smallct/ref/work/./r5_parameter_sets.h:69: first defined here
try.c: /usr/bin/ld: libcrypto_encrypt_r5n13pke0smallct.a(parameters.o):.../supercop-data/wolfdale/amd64/try/c/clang_-march=native_-O3_-fwrapv_-Qunused-arguments_-fPIC_-fPIE_-gdwarf-4_-Wall/timingleaks/crypto_encrypt/r5n13pke0smallct/ref/work/./r5_parameter_sets.h:66: multiple definition of `r5_parameter_sets'; libcrypto_encrypt_r5n13pke0smallct.a(cca_encrypt.o):.../supercop-data/wolfdale/amd64/try/c/clang_-march=native_-O3_-fwrapv_-Qunused-arguments_-fPIC_-fPIE_-gdwarf-4_-Wall/timingleaks/crypto_encrypt/r5n13pke0smallct/ref/work/./r5_parameter_sets.h:66: first defined here
try.c: /usr/bin/ld: libcrypto_encrypt_r5n13pke0smallct.a(r5_cca_pke.o):.../supercop-data/wolfdale/amd64/try/c/clang_-march=native_-O3_-fwrapv_-Qunused-arguments_-fPIC_-fPIE_-gdwarf-4_-Wall/timingleaks/crypto_encrypt/r5n13pke0smallct/ref/work/./r5_parameter_sets.h:69: multiple definition of `r5_parameter_set_names'; libcrypto_encrypt_r5n13pke0smallct.a(cca_encrypt.o):.../supercop-data/wolfdale/amd64/try/c/clang_-march=native_-O3_-fwrapv_-Qunused-arguments_-fPIC_-fPIE_-gdwarf-4_-Wall/timingleaks/crypto_encrypt/r5n13pke0smallct/ref/work/./r5_parameter_sets.h:69: first defined here
try.c: /usr/bin/ld: libcrypto_encrypt_r5n13pke0smallct.a(r5_cca_pke.o):.../supercop-data/wolfdale/amd64/try/c/clang_-march=native_-O3_-fwrapv_-Qunused-arguments_-fPIC_-fPIE_-gdwarf-4_-Wall/timingleaks/crypto_encrypt/r5n13pke0smallct/ref/work/./r5_parameter_sets.h:66: multiple definition of `r5_parameter_sets'; libcrypto_encrypt_r5n13pke0smallct.a(cca_encrypt.o):.../supercop-data/wolfdale/amd64/try/c/clang_-march=native_-O3_-fwrapv_-Qunused-arguments_-fPIC_-fPIE_-gdwarf-4_-Wall/timingleaks/crypto_encrypt/r5n13pke0smallct/ref/work/./r5_parameter_sets.h:66: first defined here
try.c: /usr/bin/ld: libcrypto_encrypt_r5n13pke0smallct.a(r5_cca_kem.o):.../supercop-data/wolfdale/amd64/try/c/clang_-march=native_-O3_-fwrapv_-Qunused-arguments_-fPIC_-fPIE_-gdwarf-4_-Wall/timingleaks/crypto_encrypt/r5n13pke0smallct/ref/work/./r5_parameter_sets.h:69: multiple definition of `r5_parameter_set_names'; libcrypto_encrypt_r5n13pke0smallct.a(cca_encrypt.o):.../supercop-data/wolfdale/amd64/try/c/clang_-march=native_-O3_-fwrapv_-Qunused-arguments_-fPIC_-fPIE_-gdwarf-4_-Wall/timingleaks/crypto_encrypt/r5n13pke0smallct/ref/work/./r5_parameter_sets.h:69: first defined here
try.c: /usr/bin/ld: libcrypto_encrypt_r5n13pke0smallct.a(r5_cca_kem.o):.../supercop-data/wolfdale/amd64/try/c/clang_-march=native_-O3_-fwrapv_-Qunused-arguments_-fPIC_-fPIE_-gdwarf-4_-Wall/timingleaks/crypto_encrypt/r5n13pke0smallct/ref/work/./r5_parameter_sets.h:66: multiple definition of `r5_parameter_sets'; libcrypto_encrypt_r5n13pke0smallct.a(cca_encrypt.o):.../supercop-data/wolfdale/amd64/try/c/clang_-march=native_-O3_-fwrapv_-Qunused-arguments_-fPIC_-fPIE_-gdwarf-4_-Wall/timingleaks/crypto_encrypt/r5n13pke0smallct/ref/work/./r5_parameter_sets.h:66: first defined here
try.c: /usr/bin/ld: libcrypto_encrypt_r5n13pke0smallct.a(r5_cpa_pke.o):.../supercop-data/wolfdale/amd64/try/c/clang_-march=native_-O3_-fwrapv_-Qunused-arguments_-fPIC_-fPIE_-gdwarf-4_-Wall/timingleaks/crypto_encrypt/r5n13pke0smallct/ref/work/./r5_parameter_sets.h:69: multiple definition of `r5_parameter_set_names'; libcrypto_encrypt_r5n13pke0smallct.a(cca_encrypt.o):.../supercop-data/wolfdale/amd64/try/c/clang_-march=native_-O3_-fwrapv_-Qunused-arguments_-fPIC_-fPIE_-gdwarf-4_-Wall/timingleaks/crypto_encrypt/r5n13pke0smallct/ref/work/./r5_parameter_sets.h:69: first defined here
try.c: /usr/bin/ld: libcrypto_encrypt_r5n13pke0smallct.a(r5_cpa_pke.o):.../supercop-data/wolfdale/amd64/try/c/clang_-march=native_-O3_-fwrapv_-Qunused-arguments_-fPIC_-fPIE_-gdwarf-4_-Wall/timingleaks/crypto_encrypt/r5n13pke0smallct/ref/work/./r5_parameter_sets.h:66: multiple definition of `r5_parameter_sets'; libcrypto_encrypt_r5n13pke0smallct.a(cca_encrypt.o):.../supercop-data/wolfdale/amd64/try/c/clang_-march=native_-O3_-fwrapv_-Qunused-arguments_-fPIC_-fPIE_-gdwarf-4_-Wall/timingleaks/crypto_encrypt/r5n13pke0smallct/ref/work/./r5_parameter_sets.h:66: first defined here
try.c: /usr/bin/ld: libcrypto_encrypt_r5n13pke0smallct.a(r5_core.o):.../supercop-data/wolfdale/amd64/try/c/clang_-march=native_-O3_-fwrapv_-Qunused-arguments_-fPIC_-fPIE_-gdwarf-4_-Wall/timingleaks/crypto_encrypt/r5n13pke0smallct/ref/work/./r5_parameter_sets.h:69: multiple definition of `r5_parameter_set_names'; libcrypto_encrypt_r5n13pke0smallct.a(cca_encrypt.o):.../supercop-data/wolfdale/amd64/try/c/clang_-march=native_-O3_-fwrapv_-Qunused-arguments_-fPIC_-fPIE_-gdwarf-4_-Wall/timingleaks/crypto_encrypt/r5n13pke0smallct/ref/work/./r5_parameter_sets.h:69: first defined here
try.c: /usr/bin/ld: libcrypto_encrypt_r5n13pke0smallct.a(r5_core.o):.../supercop-data/wolfdale/amd64/try/c/clang_-march=native_-O3_-fwrapv_-Qunused-arguments_-fPIC_-fPIE_-gdwarf-4_-Wall/timingleaks/crypto_encrypt/r5n13pke0smallct/ref/work/./r5_parameter_sets.h:66: multiple definition of `r5_parameter_sets'; libcrypto_encrypt_r5n13pke0smallct.a(cca_encrypt.o):.../supercop-data/wolfdale/amd64/try/c/clang_-march=native_-O3_-fwrapv_-Qunused-arguments_-fPIC_-fPIE_-gdwarf-4_-Wall/timingleaks/crypto_encrypt/r5n13pke0smallct/ref/work/./r5_parameter_sets.h:66: first defined here
try.c: /usr/bin/ld: libcrypto_encrypt_r5n13pke0smallct.a(a_fixed.o):.../supercop-data/wolfdale/amd64/try/c/clang_-march=native_-O3_-fwrapv_-Qunused-arguments_-fPIC_-fPIE_-gdwarf-4_-Wall/timingleaks/crypto_encrypt/r5n13pke0smallct/ref/work/./r5_parameter_sets.h:69: multiple definition of `r5_parameter_set_names'; libcrypto_encrypt_r5n13pke0smallct.a(cca_encrypt.o):.../supercop-data/wolfdale/amd64/try/c/clang_-march=native_-O3_-fwrapv_-Qunused-arguments_-fPIC_-fPIE_-gdwarf-4_-Wall/timingleaks/crypto_encrypt/r5n13pke0smallct/ref/work/./r5_parameter_sets.h:69: first defined here
try.c: /usr/bin/ld: libcrypto_encrypt_r5n13pke0smallct.a(a_fixed.o):.../supercop-data/wolfdale/amd64/try/c/clang_-march=native_-O3_-fwrapv_-Qunused-arguments_-fPIC_-fPIE_-gdwarf-4_-Wall/timingleaks/crypto_encrypt/r5n13pke0smallct/ref/work/./r5_parameter_sets.h:66: multiple definition of `r5_parameter_sets'; libcrypto_encrypt_r5n13pke0smallct.a(cca_encrypt.o):.../supercop-data/wolfdale/amd64/try/c/clang_-march=native_-O3_-fwrapv_-Qunused-arguments_-fPIC_-fPIE_-gdwarf-4_-Wall/timingleaks/crypto_encrypt/r5n13pke0smallct/ref/work/./r5_parameter_sets.h:66: first defined here
try.c: /usr/bin/ld: libcrypto_encrypt_r5n13pke0smallct.a(a_random.o):.../supercop-data/wolfdale/amd64/try/c/clang_-march=native_-O3_-fwrapv_-Qunused-arguments_-fPIC_-fPIE_-gdwarf-4_-Wall/timingleaks/crypto_encrypt/r5n13pke0smallct/ref/work/./r5_parameter_sets.h:69: multiple definition of `r5_parameter_set_names'; libcrypto_encrypt_r5n13pke0smallct.a(cca_encrypt.o):.../supercop-data/wolfdale/amd64/try/c/clang_-march=native_-O3_-fwrapv_-Qunused-arguments_-fPIC_-fPIE_-gdwarf-4_-Wall/timingleaks/crypto_encrypt/r5n13pke0smallct/ref/work/./r5_parameter_sets.h:69: first defined here
try.c: /usr/bin/ld: libcrypto_encrypt_r5n13pke0smallct.a(a_random.o):.../supercop-data/wolfdale/amd64/try/c/clang_-march=native_-O3_-fwrapv_-Qunused-arguments_-fPIC_-fPIE_-gdwarf-4_-Wall/timingleaks/crypto_encrypt/r5n13pke0smallct/ref/work/./r5_parameter_sets.h:66: multiple definition of `r5_parameter_sets'; libcrypto_encrypt_r5n13pke0smallct.a(cca_encrypt.o):.../supercop-data/wolfdale/amd64/try/c/clang_-march=native_-O3_-fwrapv_-Qunused-arguments_-fPIC_-fPIE_-gdwarf-4_-Wall/timingleaks/crypto_encrypt/r5n13pke0smallct/ref/work/./r5_parameter_sets.h:66: first defined here
try.c: clang: error: linker command failed with exit code 1 (use -v to see invocation)

Number of similar (implementation,compiler) pairs: 1, namely:
ImplementationCompiler
T:refclang -march=native -O3 -fwrapv -Qunused-arguments -fPIC -fPIE -gdwarf-4 -Wall (Debian_Clang_11.0.1)

Compiler output


try.c: /usr/bin/ld: libcrypto_encrypt_r5n13pke0smallct.a(parameters.o):.../supercop-data/wolfdale/amd64/try/c/clang_-march=native_-O_-fwrapv_-Qunused-arguments_-fPIC_-fPIE_-gdwarf-4_-Wall/timingleaks/crypto_encrypt/r5n13pke0smallct/ref/work/./r5_parameter_sets.h:69: multiple definition of `r5_parameter_set_names'; libcrypto_encrypt_r5n13pke0smallct.a(cca_encrypt.o):.../supercop-data/wolfdale/amd64/try/c/clang_-march=native_-O_-fwrapv_-Qunused-arguments_-fPIC_-fPIE_-gdwarf-4_-Wall/timingleaks/crypto_encrypt/r5n13pke0smallct/ref/work/./r5_parameter_sets.h:69: first defined here
try.c: /usr/bin/ld: libcrypto_encrypt_r5n13pke0smallct.a(parameters.o):.../supercop-data/wolfdale/amd64/try/c/clang_-march=native_-O_-fwrapv_-Qunused-arguments_-fPIC_-fPIE_-gdwarf-4_-Wall/timingleaks/crypto_encrypt/r5n13pke0smallct/ref/work/./r5_parameter_sets.h:66: multiple definition of `r5_parameter_sets'; libcrypto_encrypt_r5n13pke0smallct.a(cca_encrypt.o):.../supercop-data/wolfdale/amd64/try/c/clang_-march=native_-O_-fwrapv_-Qunused-arguments_-fPIC_-fPIE_-gdwarf-4_-Wall/timingleaks/crypto_encrypt/r5n13pke0smallct/ref/work/./r5_parameter_sets.h:66: first defined here
try.c: /usr/bin/ld: libcrypto_encrypt_r5n13pke0smallct.a(r5_cca_pke.o):.../supercop-data/wolfdale/amd64/try/c/clang_-march=native_-O_-fwrapv_-Qunused-arguments_-fPIC_-fPIE_-gdwarf-4_-Wall/timingleaks/crypto_encrypt/r5n13pke0smallct/ref/work/./r5_parameter_sets.h:69: multiple definition of `r5_parameter_set_names'; libcrypto_encrypt_r5n13pke0smallct.a(cca_encrypt.o):.../supercop-data/wolfdale/amd64/try/c/clang_-march=native_-O_-fwrapv_-Qunused-arguments_-fPIC_-fPIE_-gdwarf-4_-Wall/timingleaks/crypto_encrypt/r5n13pke0smallct/ref/work/./r5_parameter_sets.h:69: first defined here
try.c: /usr/bin/ld: libcrypto_encrypt_r5n13pke0smallct.a(r5_cca_pke.o):.../supercop-data/wolfdale/amd64/try/c/clang_-march=native_-O_-fwrapv_-Qunused-arguments_-fPIC_-fPIE_-gdwarf-4_-Wall/timingleaks/crypto_encrypt/r5n13pke0smallct/ref/work/./r5_parameter_sets.h:66: multiple definition of `r5_parameter_sets'; libcrypto_encrypt_r5n13pke0smallct.a(cca_encrypt.o):.../supercop-data/wolfdale/amd64/try/c/clang_-march=native_-O_-fwrapv_-Qunused-arguments_-fPIC_-fPIE_-gdwarf-4_-Wall/timingleaks/crypto_encrypt/r5n13pke0smallct/ref/work/./r5_parameter_sets.h:66: first defined here
try.c: /usr/bin/ld: libcrypto_encrypt_r5n13pke0smallct.a(r5_cca_kem.o):.../supercop-data/wolfdale/amd64/try/c/clang_-march=native_-O_-fwrapv_-Qunused-arguments_-fPIC_-fPIE_-gdwarf-4_-Wall/timingleaks/crypto_encrypt/r5n13pke0smallct/ref/work/./r5_parameter_sets.h:69: multiple definition of `r5_parameter_set_names'; libcrypto_encrypt_r5n13pke0smallct.a(cca_encrypt.o):.../supercop-data/wolfdale/amd64/try/c/clang_-march=native_-O_-fwrapv_-Qunused-arguments_-fPIC_-fPIE_-gdwarf-4_-Wall/timingleaks/crypto_encrypt/r5n13pke0smallct/ref/work/./r5_parameter_sets.h:69: first defined here
try.c: /usr/bin/ld: libcrypto_encrypt_r5n13pke0smallct.a(r5_cca_kem.o):.../supercop-data/wolfdale/amd64/try/c/clang_-march=native_-O_-fwrapv_-Qunused-arguments_-fPIC_-fPIE_-gdwarf-4_-Wall/timingleaks/crypto_encrypt/r5n13pke0smallct/ref/work/./r5_parameter_sets.h:66: multiple definition of `r5_parameter_sets'; libcrypto_encrypt_r5n13pke0smallct.a(cca_encrypt.o):.../supercop-data/wolfdale/amd64/try/c/clang_-march=native_-O_-fwrapv_-Qunused-arguments_-fPIC_-fPIE_-gdwarf-4_-Wall/timingleaks/crypto_encrypt/r5n13pke0smallct/ref/work/./r5_parameter_sets.h:66: first defined here
try.c: /usr/bin/ld: libcrypto_encrypt_r5n13pke0smallct.a(r5_cpa_pke.o):.../supercop-data/wolfdale/amd64/try/c/clang_-march=native_-O_-fwrapv_-Qunused-arguments_-fPIC_-fPIE_-gdwarf-4_-Wall/timingleaks/crypto_encrypt/r5n13pke0smallct/ref/work/./r5_parameter_sets.h:69: multiple definition of `r5_parameter_set_names'; libcrypto_encrypt_r5n13pke0smallct.a(cca_encrypt.o):.../supercop-data/wolfdale/amd64/try/c/clang_-march=native_-O_-fwrapv_-Qunused-arguments_-fPIC_-fPIE_-gdwarf-4_-Wall/timingleaks/crypto_encrypt/r5n13pke0smallct/ref/work/./r5_parameter_sets.h:69: first defined here
try.c: /usr/bin/ld: libcrypto_encrypt_r5n13pke0smallct.a(r5_cpa_pke.o):.../supercop-data/wolfdale/amd64/try/c/clang_-march=native_-O_-fwrapv_-Qunused-arguments_-fPIC_-fPIE_-gdwarf-4_-Wall/timingleaks/crypto_encrypt/r5n13pke0smallct/ref/work/./r5_parameter_sets.h:66: multiple definition of `r5_parameter_sets'; libcrypto_encrypt_r5n13pke0smallct.a(cca_encrypt.o):.../supercop-data/wolfdale/amd64/try/c/clang_-march=native_-O_-fwrapv_-Qunused-arguments_-fPIC_-fPIE_-gdwarf-4_-Wall/timingleaks/crypto_encrypt/r5n13pke0smallct/ref/work/./r5_parameter_sets.h:66: first defined here
try.c: /usr/bin/ld: libcrypto_encrypt_r5n13pke0smallct.a(r5_core.o):.../supercop-data/wolfdale/amd64/try/c/clang_-march=native_-O_-fwrapv_-Qunused-arguments_-fPIC_-fPIE_-gdwarf-4_-Wall/timingleaks/crypto_encrypt/r5n13pke0smallct/ref/work/./r5_parameter_sets.h:69: multiple definition of `r5_parameter_set_names'; libcrypto_encrypt_r5n13pke0smallct.a(cca_encrypt.o):.../supercop-data/wolfdale/amd64/try/c/clang_-march=native_-O_-fwrapv_-Qunused-arguments_-fPIC_-fPIE_-gdwarf-4_-Wall/timingleaks/crypto_encrypt/r5n13pke0smallct/ref/work/./r5_parameter_sets.h:69: first defined here
try.c: /usr/bin/ld: libcrypto_encrypt_r5n13pke0smallct.a(r5_core.o):.../supercop-data/wolfdale/amd64/try/c/clang_-march=native_-O_-fwrapv_-Qunused-arguments_-fPIC_-fPIE_-gdwarf-4_-Wall/timingleaks/crypto_encrypt/r5n13pke0smallct/ref/work/./r5_parameter_sets.h:66: multiple definition of `r5_parameter_sets'; libcrypto_encrypt_r5n13pke0smallct.a(cca_encrypt.o):.../supercop-data/wolfdale/amd64/try/c/clang_-march=native_-O_-fwrapv_-Qunused-arguments_-fPIC_-fPIE_-gdwarf-4_-Wall/timingleaks/crypto_encrypt/r5n13pke0smallct/ref/work/./r5_parameter_sets.h:66: first defined here
try.c: /usr/bin/ld: libcrypto_encrypt_r5n13pke0smallct.a(a_fixed.o):.../supercop-data/wolfdale/amd64/try/c/clang_-march=native_-O_-fwrapv_-Qunused-arguments_-fPIC_-fPIE_-gdwarf-4_-Wall/timingleaks/crypto_encrypt/r5n13pke0smallct/ref/work/./r5_parameter_sets.h:69: multiple definition of `r5_parameter_set_names'; libcrypto_encrypt_r5n13pke0smallct.a(cca_encrypt.o):.../supercop-data/wolfdale/amd64/try/c/clang_-march=native_-O_-fwrapv_-Qunused-arguments_-fPIC_-fPIE_-gdwarf-4_-Wall/timingleaks/crypto_encrypt/r5n13pke0smallct/ref/work/./r5_parameter_sets.h:69: first defined here
try.c: /usr/bin/ld: libcrypto_encrypt_r5n13pke0smallct.a(a_fixed.o):.../supercop-data/wolfdale/amd64/try/c/clang_-march=native_-O_-fwrapv_-Qunused-arguments_-fPIC_-fPIE_-gdwarf-4_-Wall/timingleaks/crypto_encrypt/r5n13pke0smallct/ref/work/./r5_parameter_sets.h:66: multiple definition of `r5_parameter_sets'; libcrypto_encrypt_r5n13pke0smallct.a(cca_encrypt.o):.../supercop-data/wolfdale/amd64/try/c/clang_-march=native_-O_-fwrapv_-Qunused-arguments_-fPIC_-fPIE_-gdwarf-4_-Wall/timingleaks/crypto_encrypt/r5n13pke0smallct/ref/work/./r5_parameter_sets.h:66: first defined here
try.c: /usr/bin/ld: libcrypto_encrypt_r5n13pke0smallct.a(a_random.o):.../supercop-data/wolfdale/amd64/try/c/clang_-march=native_-O_-fwrapv_-Qunused-arguments_-fPIC_-fPIE_-gdwarf-4_-Wall/timingleaks/crypto_encrypt/r5n13pke0smallct/ref/work/./r5_parameter_sets.h:69: multiple definition of `r5_parameter_set_names'; libcrypto_encrypt_r5n13pke0smallct.a(cca_encrypt.o):.../supercop-data/wolfdale/amd64/try/c/clang_-march=native_-O_-fwrapv_-Qunused-arguments_-fPIC_-fPIE_-gdwarf-4_-Wall/timingleaks/crypto_encrypt/r5n13pke0smallct/ref/work/./r5_parameter_sets.h:69: first defined here
try.c: /usr/bin/ld: libcrypto_encrypt_r5n13pke0smallct.a(a_random.o):.../supercop-data/wolfdale/amd64/try/c/clang_-march=native_-O_-fwrapv_-Qunused-arguments_-fPIC_-fPIE_-gdwarf-4_-Wall/timingleaks/crypto_encrypt/r5n13pke0smallct/ref/work/./r5_parameter_sets.h:66: multiple definition of `r5_parameter_sets'; libcrypto_encrypt_r5n13pke0smallct.a(cca_encrypt.o):.../supercop-data/wolfdale/amd64/try/c/clang_-march=native_-O_-fwrapv_-Qunused-arguments_-fPIC_-fPIE_-gdwarf-4_-Wall/timingleaks/crypto_encrypt/r5n13pke0smallct/ref/work/./r5_parameter_sets.h:66: first defined here
try.c: clang: error: linker command failed with exit code 1 (use -v to see invocation)

Number of similar (implementation,compiler) pairs: 1, namely:
ImplementationCompiler
T:refclang -march=native -O -fwrapv -Qunused-arguments -fPIC -fPIE -gdwarf-4 -Wall (Debian_Clang_11.0.1)

Compiler output


try.c: /usr/bin/ld: libcrypto_encrypt_r5n13pke0smallct.a(parameters.o):.../supercop-data/wolfdale/amd64/try/c/clang_-march=native_-Os_-fwrapv_-Qunused-arguments_-fPIC_-fPIE_-gdwarf-4_-Wall/timingleaks/crypto_encrypt/r5n13pke0smallct/ref/work/./r5_parameter_sets.h:69: multiple definition of `r5_parameter_set_names'; libcrypto_encrypt_r5n13pke0smallct.a(cca_encrypt.o):.../supercop-data/wolfdale/amd64/try/c/clang_-march=native_-Os_-fwrapv_-Qunused-arguments_-fPIC_-fPIE_-gdwarf-4_-Wall/timingleaks/crypto_encrypt/r5n13pke0smallct/ref/work/./r5_parameter_sets.h:69: first defined here
try.c: /usr/bin/ld: libcrypto_encrypt_r5n13pke0smallct.a(parameters.o):.../supercop-data/wolfdale/amd64/try/c/clang_-march=native_-Os_-fwrapv_-Qunused-arguments_-fPIC_-fPIE_-gdwarf-4_-Wall/timingleaks/crypto_encrypt/r5n13pke0smallct/ref/work/./r5_parameter_sets.h:66: multiple definition of `r5_parameter_sets'; libcrypto_encrypt_r5n13pke0smallct.a(cca_encrypt.o):.../supercop-data/wolfdale/amd64/try/c/clang_-march=native_-Os_-fwrapv_-Qunused-arguments_-fPIC_-fPIE_-gdwarf-4_-Wall/timingleaks/crypto_encrypt/r5n13pke0smallct/ref/work/./r5_parameter_sets.h:66: first defined here
try.c: /usr/bin/ld: libcrypto_encrypt_r5n13pke0smallct.a(r5_cca_pke.o):.../supercop-data/wolfdale/amd64/try/c/clang_-march=native_-Os_-fwrapv_-Qunused-arguments_-fPIC_-fPIE_-gdwarf-4_-Wall/timingleaks/crypto_encrypt/r5n13pke0smallct/ref/work/./r5_parameter_sets.h:69: multiple definition of `r5_parameter_set_names'; libcrypto_encrypt_r5n13pke0smallct.a(cca_encrypt.o):.../supercop-data/wolfdale/amd64/try/c/clang_-march=native_-Os_-fwrapv_-Qunused-arguments_-fPIC_-fPIE_-gdwarf-4_-Wall/timingleaks/crypto_encrypt/r5n13pke0smallct/ref/work/./r5_parameter_sets.h:69: first defined here
try.c: /usr/bin/ld: libcrypto_encrypt_r5n13pke0smallct.a(r5_cca_pke.o):.../supercop-data/wolfdale/amd64/try/c/clang_-march=native_-Os_-fwrapv_-Qunused-arguments_-fPIC_-fPIE_-gdwarf-4_-Wall/timingleaks/crypto_encrypt/r5n13pke0smallct/ref/work/./r5_parameter_sets.h:66: multiple definition of `r5_parameter_sets'; libcrypto_encrypt_r5n13pke0smallct.a(cca_encrypt.o):.../supercop-data/wolfdale/amd64/try/c/clang_-march=native_-Os_-fwrapv_-Qunused-arguments_-fPIC_-fPIE_-gdwarf-4_-Wall/timingleaks/crypto_encrypt/r5n13pke0smallct/ref/work/./r5_parameter_sets.h:66: first defined here
try.c: /usr/bin/ld: libcrypto_encrypt_r5n13pke0smallct.a(r5_cca_kem.o):.../supercop-data/wolfdale/amd64/try/c/clang_-march=native_-Os_-fwrapv_-Qunused-arguments_-fPIC_-fPIE_-gdwarf-4_-Wall/timingleaks/crypto_encrypt/r5n13pke0smallct/ref/work/./r5_parameter_sets.h:69: multiple definition of `r5_parameter_set_names'; libcrypto_encrypt_r5n13pke0smallct.a(cca_encrypt.o):.../supercop-data/wolfdale/amd64/try/c/clang_-march=native_-Os_-fwrapv_-Qunused-arguments_-fPIC_-fPIE_-gdwarf-4_-Wall/timingleaks/crypto_encrypt/r5n13pke0smallct/ref/work/./r5_parameter_sets.h:69: first defined here
try.c: /usr/bin/ld: libcrypto_encrypt_r5n13pke0smallct.a(r5_cca_kem.o):.../supercop-data/wolfdale/amd64/try/c/clang_-march=native_-Os_-fwrapv_-Qunused-arguments_-fPIC_-fPIE_-gdwarf-4_-Wall/timingleaks/crypto_encrypt/r5n13pke0smallct/ref/work/./r5_parameter_sets.h:66: multiple definition of `r5_parameter_sets'; libcrypto_encrypt_r5n13pke0smallct.a(cca_encrypt.o):.../supercop-data/wolfdale/amd64/try/c/clang_-march=native_-Os_-fwrapv_-Qunused-arguments_-fPIC_-fPIE_-gdwarf-4_-Wall/timingleaks/crypto_encrypt/r5n13pke0smallct/ref/work/./r5_parameter_sets.h:66: first defined here
try.c: /usr/bin/ld: libcrypto_encrypt_r5n13pke0smallct.a(r5_cpa_pke.o):.../supercop-data/wolfdale/amd64/try/c/clang_-march=native_-Os_-fwrapv_-Qunused-arguments_-fPIC_-fPIE_-gdwarf-4_-Wall/timingleaks/crypto_encrypt/r5n13pke0smallct/ref/work/./r5_parameter_sets.h:69: multiple definition of `r5_parameter_set_names'; libcrypto_encrypt_r5n13pke0smallct.a(cca_encrypt.o):.../supercop-data/wolfdale/amd64/try/c/clang_-march=native_-Os_-fwrapv_-Qunused-arguments_-fPIC_-fPIE_-gdwarf-4_-Wall/timingleaks/crypto_encrypt/r5n13pke0smallct/ref/work/./r5_parameter_sets.h:69: first defined here
try.c: /usr/bin/ld: libcrypto_encrypt_r5n13pke0smallct.a(r5_cpa_pke.o):.../supercop-data/wolfdale/amd64/try/c/clang_-march=native_-Os_-fwrapv_-Qunused-arguments_-fPIC_-fPIE_-gdwarf-4_-Wall/timingleaks/crypto_encrypt/r5n13pke0smallct/ref/work/./r5_parameter_sets.h:66: multiple definition of `r5_parameter_sets'; libcrypto_encrypt_r5n13pke0smallct.a(cca_encrypt.o):.../supercop-data/wolfdale/amd64/try/c/clang_-march=native_-Os_-fwrapv_-Qunused-arguments_-fPIC_-fPIE_-gdwarf-4_-Wall/timingleaks/crypto_encrypt/r5n13pke0smallct/ref/work/./r5_parameter_sets.h:66: first defined here
try.c: /usr/bin/ld: libcrypto_encrypt_r5n13pke0smallct.a(r5_core.o):.../supercop-data/wolfdale/amd64/try/c/clang_-march=native_-Os_-fwrapv_-Qunused-arguments_-fPIC_-fPIE_-gdwarf-4_-Wall/timingleaks/crypto_encrypt/r5n13pke0smallct/ref/work/./r5_parameter_sets.h:69: multiple definition of `r5_parameter_set_names'; libcrypto_encrypt_r5n13pke0smallct.a(cca_encrypt.o):.../supercop-data/wolfdale/amd64/try/c/clang_-march=native_-Os_-fwrapv_-Qunused-arguments_-fPIC_-fPIE_-gdwarf-4_-Wall/timingleaks/crypto_encrypt/r5n13pke0smallct/ref/work/./r5_parameter_sets.h:69: first defined here
try.c: /usr/bin/ld: libcrypto_encrypt_r5n13pke0smallct.a(r5_core.o):.../supercop-data/wolfdale/amd64/try/c/clang_-march=native_-Os_-fwrapv_-Qunused-arguments_-fPIC_-fPIE_-gdwarf-4_-Wall/timingleaks/crypto_encrypt/r5n13pke0smallct/ref/work/./r5_parameter_sets.h:66: multiple definition of `r5_parameter_sets'; libcrypto_encrypt_r5n13pke0smallct.a(cca_encrypt.o):.../supercop-data/wolfdale/amd64/try/c/clang_-march=native_-Os_-fwrapv_-Qunused-arguments_-fPIC_-fPIE_-gdwarf-4_-Wall/timingleaks/crypto_encrypt/r5n13pke0smallct/ref/work/./r5_parameter_sets.h:66: first defined here
try.c: /usr/bin/ld: libcrypto_encrypt_r5n13pke0smallct.a(a_fixed.o):.../supercop-data/wolfdale/amd64/try/c/clang_-march=native_-Os_-fwrapv_-Qunused-arguments_-fPIC_-fPIE_-gdwarf-4_-Wall/timingleaks/crypto_encrypt/r5n13pke0smallct/ref/work/./r5_parameter_sets.h:69: multiple definition of `r5_parameter_set_names'; libcrypto_encrypt_r5n13pke0smallct.a(cca_encrypt.o):.../supercop-data/wolfdale/amd64/try/c/clang_-march=native_-Os_-fwrapv_-Qunused-arguments_-fPIC_-fPIE_-gdwarf-4_-Wall/timingleaks/crypto_encrypt/r5n13pke0smallct/ref/work/./r5_parameter_sets.h:69: first defined here
try.c: /usr/bin/ld: libcrypto_encrypt_r5n13pke0smallct.a(a_fixed.o):.../supercop-data/wolfdale/amd64/try/c/clang_-march=native_-Os_-fwrapv_-Qunused-arguments_-fPIC_-fPIE_-gdwarf-4_-Wall/timingleaks/crypto_encrypt/r5n13pke0smallct/ref/work/./r5_parameter_sets.h:66: multiple definition of `r5_parameter_sets'; libcrypto_encrypt_r5n13pke0smallct.a(cca_encrypt.o):.../supercop-data/wolfdale/amd64/try/c/clang_-march=native_-Os_-fwrapv_-Qunused-arguments_-fPIC_-fPIE_-gdwarf-4_-Wall/timingleaks/crypto_encrypt/r5n13pke0smallct/ref/work/./r5_parameter_sets.h:66: first defined here
try.c: /usr/bin/ld: libcrypto_encrypt_r5n13pke0smallct.a(a_random.o):.../supercop-data/wolfdale/amd64/try/c/clang_-march=native_-Os_-fwrapv_-Qunused-arguments_-fPIC_-fPIE_-gdwarf-4_-Wall/timingleaks/crypto_encrypt/r5n13pke0smallct/ref/work/./r5_parameter_sets.h:69: multiple definition of `r5_parameter_set_names'; libcrypto_encrypt_r5n13pke0smallct.a(cca_encrypt.o):.../supercop-data/wolfdale/amd64/try/c/clang_-march=native_-Os_-fwrapv_-Qunused-arguments_-fPIC_-fPIE_-gdwarf-4_-Wall/timingleaks/crypto_encrypt/r5n13pke0smallct/ref/work/./r5_parameter_sets.h:69: first defined here
try.c: /usr/bin/ld: libcrypto_encrypt_r5n13pke0smallct.a(a_random.o):.../supercop-data/wolfdale/amd64/try/c/clang_-march=native_-Os_-fwrapv_-Qunused-arguments_-fPIC_-fPIE_-gdwarf-4_-Wall/timingleaks/crypto_encrypt/r5n13pke0smallct/ref/work/./r5_parameter_sets.h:66: multiple definition of `r5_parameter_sets'; libcrypto_encrypt_r5n13pke0smallct.a(cca_encrypt.o):.../supercop-data/wolfdale/amd64/try/c/clang_-march=native_-Os_-fwrapv_-Qunused-arguments_-fPIC_-fPIE_-gdwarf-4_-Wall/timingleaks/crypto_encrypt/r5n13pke0smallct/ref/work/./r5_parameter_sets.h:66: first defined here
try.c: clang: error: linker command failed with exit code 1 (use -v to see invocation)

Number of similar (implementation,compiler) pairs: 1, namely:
ImplementationCompiler
T:refclang -march=native -Os -fwrapv -Qunused-arguments -fPIC -fPIE -gdwarf-4 -Wall (Debian_Clang_11.0.1)

Compiler output


try.c: /usr/bin/ld: libcrypto_encrypt_r5n13pke0smallct.a(parameters.o):.../supercop-data/wolfdale/amd64/try/c/clang_-mcpu=native_-O3_-fwrapv_-Qunused-arguments_-fPIC_-fPIE_-gdwarf-4_-Wall/timingleaks/crypto_encrypt/r5n13pke0smallct/ref/work/./r5_parameter_sets.h:69: multiple definition of `r5_parameter_set_names'; libcrypto_encrypt_r5n13pke0smallct.a(cca_encrypt.o):.../supercop-data/wolfdale/amd64/try/c/clang_-mcpu=native_-O3_-fwrapv_-Qunused-arguments_-fPIC_-fPIE_-gdwarf-4_-Wall/timingleaks/crypto_encrypt/r5n13pke0smallct/ref/work/./r5_parameter_sets.h:69: first defined here
try.c: /usr/bin/ld: libcrypto_encrypt_r5n13pke0smallct.a(parameters.o):.../supercop-data/wolfdale/amd64/try/c/clang_-mcpu=native_-O3_-fwrapv_-Qunused-arguments_-fPIC_-fPIE_-gdwarf-4_-Wall/timingleaks/crypto_encrypt/r5n13pke0smallct/ref/work/./r5_parameter_sets.h:66: multiple definition of `r5_parameter_sets'; libcrypto_encrypt_r5n13pke0smallct.a(cca_encrypt.o):.../supercop-data/wolfdale/amd64/try/c/clang_-mcpu=native_-O3_-fwrapv_-Qunused-arguments_-fPIC_-fPIE_-gdwarf-4_-Wall/timingleaks/crypto_encrypt/r5n13pke0smallct/ref/work/./r5_parameter_sets.h:66: first defined here
try.c: /usr/bin/ld: libcrypto_encrypt_r5n13pke0smallct.a(r5_cca_pke.o):.../supercop-data/wolfdale/amd64/try/c/clang_-mcpu=native_-O3_-fwrapv_-Qunused-arguments_-fPIC_-fPIE_-gdwarf-4_-Wall/timingleaks/crypto_encrypt/r5n13pke0smallct/ref/work/./r5_parameter_sets.h:69: multiple definition of `r5_parameter_set_names'; libcrypto_encrypt_r5n13pke0smallct.a(cca_encrypt.o):.../supercop-data/wolfdale/amd64/try/c/clang_-mcpu=native_-O3_-fwrapv_-Qunused-arguments_-fPIC_-fPIE_-gdwarf-4_-Wall/timingleaks/crypto_encrypt/r5n13pke0smallct/ref/work/./r5_parameter_sets.h:69: first defined here
try.c: /usr/bin/ld: libcrypto_encrypt_r5n13pke0smallct.a(r5_cca_pke.o):.../supercop-data/wolfdale/amd64/try/c/clang_-mcpu=native_-O3_-fwrapv_-Qunused-arguments_-fPIC_-fPIE_-gdwarf-4_-Wall/timingleaks/crypto_encrypt/r5n13pke0smallct/ref/work/./r5_parameter_sets.h:66: multiple definition of `r5_parameter_sets'; libcrypto_encrypt_r5n13pke0smallct.a(cca_encrypt.o):.../supercop-data/wolfdale/amd64/try/c/clang_-mcpu=native_-O3_-fwrapv_-Qunused-arguments_-fPIC_-fPIE_-gdwarf-4_-Wall/timingleaks/crypto_encrypt/r5n13pke0smallct/ref/work/./r5_parameter_sets.h:66: first defined here
try.c: /usr/bin/ld: libcrypto_encrypt_r5n13pke0smallct.a(r5_cca_kem.o):.../supercop-data/wolfdale/amd64/try/c/clang_-mcpu=native_-O3_-fwrapv_-Qunused-arguments_-fPIC_-fPIE_-gdwarf-4_-Wall/timingleaks/crypto_encrypt/r5n13pke0smallct/ref/work/./r5_parameter_sets.h:69: multiple definition of `r5_parameter_set_names'; libcrypto_encrypt_r5n13pke0smallct.a(cca_encrypt.o):.../supercop-data/wolfdale/amd64/try/c/clang_-mcpu=native_-O3_-fwrapv_-Qunused-arguments_-fPIC_-fPIE_-gdwarf-4_-Wall/timingleaks/crypto_encrypt/r5n13pke0smallct/ref/work/./r5_parameter_sets.h:69: first defined here
try.c: /usr/bin/ld: libcrypto_encrypt_r5n13pke0smallct.a(r5_cca_kem.o):.../supercop-data/wolfdale/amd64/try/c/clang_-mcpu=native_-O3_-fwrapv_-Qunused-arguments_-fPIC_-fPIE_-gdwarf-4_-Wall/timingleaks/crypto_encrypt/r5n13pke0smallct/ref/work/./r5_parameter_sets.h:66: multiple definition of `r5_parameter_sets'; libcrypto_encrypt_r5n13pke0smallct.a(cca_encrypt.o):.../supercop-data/wolfdale/amd64/try/c/clang_-mcpu=native_-O3_-fwrapv_-Qunused-arguments_-fPIC_-fPIE_-gdwarf-4_-Wall/timingleaks/crypto_encrypt/r5n13pke0smallct/ref/work/./r5_parameter_sets.h:66: first defined here
try.c: /usr/bin/ld: libcrypto_encrypt_r5n13pke0smallct.a(r5_cpa_pke.o):.../supercop-data/wolfdale/amd64/try/c/clang_-mcpu=native_-O3_-fwrapv_-Qunused-arguments_-fPIC_-fPIE_-gdwarf-4_-Wall/timingleaks/crypto_encrypt/r5n13pke0smallct/ref/work/./r5_parameter_sets.h:69: multiple definition of `r5_parameter_set_names'; libcrypto_encrypt_r5n13pke0smallct.a(cca_encrypt.o):.../supercop-data/wolfdale/amd64/try/c/clang_-mcpu=native_-O3_-fwrapv_-Qunused-arguments_-fPIC_-fPIE_-gdwarf-4_-Wall/timingleaks/crypto_encrypt/r5n13pke0smallct/ref/work/./r5_parameter_sets.h:69: first defined here
try.c: /usr/bin/ld: libcrypto_encrypt_r5n13pke0smallct.a(r5_cpa_pke.o):.../supercop-data/wolfdale/amd64/try/c/clang_-mcpu=native_-O3_-fwrapv_-Qunused-arguments_-fPIC_-fPIE_-gdwarf-4_-Wall/timingleaks/crypto_encrypt/r5n13pke0smallct/ref/work/./r5_parameter_sets.h:66: multiple definition of `r5_parameter_sets'; libcrypto_encrypt_r5n13pke0smallct.a(cca_encrypt.o):.../supercop-data/wolfdale/amd64/try/c/clang_-mcpu=native_-O3_-fwrapv_-Qunused-arguments_-fPIC_-fPIE_-gdwarf-4_-Wall/timingleaks/crypto_encrypt/r5n13pke0smallct/ref/work/./r5_parameter_sets.h:66: first defined here
try.c: /usr/bin/ld: libcrypto_encrypt_r5n13pke0smallct.a(r5_core.o):.../supercop-data/wolfdale/amd64/try/c/clang_-mcpu=native_-O3_-fwrapv_-Qunused-arguments_-fPIC_-fPIE_-gdwarf-4_-Wall/timingleaks/crypto_encrypt/r5n13pke0smallct/ref/work/./r5_parameter_sets.h:69: multiple definition of `r5_parameter_set_names'; libcrypto_encrypt_r5n13pke0smallct.a(cca_encrypt.o):.../supercop-data/wolfdale/amd64/try/c/clang_-mcpu=native_-O3_-fwrapv_-Qunused-arguments_-fPIC_-fPIE_-gdwarf-4_-Wall/timingleaks/crypto_encrypt/r5n13pke0smallct/ref/work/./r5_parameter_sets.h:69: first defined here
try.c: /usr/bin/ld: libcrypto_encrypt_r5n13pke0smallct.a(r5_core.o):.../supercop-data/wolfdale/amd64/try/c/clang_-mcpu=native_-O3_-fwrapv_-Qunused-arguments_-fPIC_-fPIE_-gdwarf-4_-Wall/timingleaks/crypto_encrypt/r5n13pke0smallct/ref/work/./r5_parameter_sets.h:66: multiple definition of `r5_parameter_sets'; libcrypto_encrypt_r5n13pke0smallct.a(cca_encrypt.o):.../supercop-data/wolfdale/amd64/try/c/clang_-mcpu=native_-O3_-fwrapv_-Qunused-arguments_-fPIC_-fPIE_-gdwarf-4_-Wall/timingleaks/crypto_encrypt/r5n13pke0smallct/ref/work/./r5_parameter_sets.h:66: first defined here
try.c: /usr/bin/ld: libcrypto_encrypt_r5n13pke0smallct.a(a_fixed.o):.../supercop-data/wolfdale/amd64/try/c/clang_-mcpu=native_-O3_-fwrapv_-Qunused-arguments_-fPIC_-fPIE_-gdwarf-4_-Wall/timingleaks/crypto_encrypt/r5n13pke0smallct/ref/work/./r5_parameter_sets.h:69: multiple definition of `r5_parameter_set_names'; libcrypto_encrypt_r5n13pke0smallct.a(cca_encrypt.o):.../supercop-data/wolfdale/amd64/try/c/clang_-mcpu=native_-O3_-fwrapv_-Qunused-arguments_-fPIC_-fPIE_-gdwarf-4_-Wall/timingleaks/crypto_encrypt/r5n13pke0smallct/ref/work/./r5_parameter_sets.h:69: first defined here
try.c: /usr/bin/ld: libcrypto_encrypt_r5n13pke0smallct.a(a_fixed.o):.../supercop-data/wolfdale/amd64/try/c/clang_-mcpu=native_-O3_-fwrapv_-Qunused-arguments_-fPIC_-fPIE_-gdwarf-4_-Wall/timingleaks/crypto_encrypt/r5n13pke0smallct/ref/work/./r5_parameter_sets.h:66: multiple definition of `r5_parameter_sets'; libcrypto_encrypt_r5n13pke0smallct.a(cca_encrypt.o):.../supercop-data/wolfdale/amd64/try/c/clang_-mcpu=native_-O3_-fwrapv_-Qunused-arguments_-fPIC_-fPIE_-gdwarf-4_-Wall/timingleaks/crypto_encrypt/r5n13pke0smallct/ref/work/./r5_parameter_sets.h:66: first defined here
try.c: /usr/bin/ld: libcrypto_encrypt_r5n13pke0smallct.a(a_random.o):.../supercop-data/wolfdale/amd64/try/c/clang_-mcpu=native_-O3_-fwrapv_-Qunused-arguments_-fPIC_-fPIE_-gdwarf-4_-Wall/timingleaks/crypto_encrypt/r5n13pke0smallct/ref/work/./r5_parameter_sets.h:69: multiple definition of `r5_parameter_set_names'; libcrypto_encrypt_r5n13pke0smallct.a(cca_encrypt.o):.../supercop-data/wolfdale/amd64/try/c/clang_-mcpu=native_-O3_-fwrapv_-Qunused-arguments_-fPIC_-fPIE_-gdwarf-4_-Wall/timingleaks/crypto_encrypt/r5n13pke0smallct/ref/work/./r5_parameter_sets.h:69: first defined here
try.c: /usr/bin/ld: libcrypto_encrypt_r5n13pke0smallct.a(a_random.o):.../supercop-data/wolfdale/amd64/try/c/clang_-mcpu=native_-O3_-fwrapv_-Qunused-arguments_-fPIC_-fPIE_-gdwarf-4_-Wall/timingleaks/crypto_encrypt/r5n13pke0smallct/ref/work/./r5_parameter_sets.h:66: multiple definition of `r5_parameter_sets'; libcrypto_encrypt_r5n13pke0smallct.a(cca_encrypt.o):.../supercop-data/wolfdale/amd64/try/c/clang_-mcpu=native_-O3_-fwrapv_-Qunused-arguments_-fPIC_-fPIE_-gdwarf-4_-Wall/timingleaks/crypto_encrypt/r5n13pke0smallct/ref/work/./r5_parameter_sets.h:66: first defined here
try.c: clang: error: linker command failed with exit code 1 (use -v to see invocation)

Number of similar (implementation,compiler) pairs: 1, namely:
ImplementationCompiler
T:refclang -mcpu=native -O3 -fwrapv -Qunused-arguments -fPIC -fPIE -gdwarf-4 -Wall (Debian_Clang_11.0.1)

Compiler output


try.c: /usr/bin/ld: libcrypto_encrypt_r5n13pke0smallct.a(parameters.o):.../supercop-data/wolfdale/amd64/try/c/gcc_-march=native_-mtune=native_-O2_-fwrapv_-fPIC_-fPIE_-gdwarf-4_-Wall/timingleaks/crypto_encrypt/r5n13pke0smallct/ref/work/r5_parameter_sets.h:69: multiple definition of `r5_parameter_set_names'; libcrypto_encrypt_r5n13pke0smallct.a(cca_encrypt.o):.../supercop-data/wolfdale/amd64/try/c/gcc_-march=native_-mtune=native_-O2_-fwrapv_-fPIC_-fPIE_-gdwarf-4_-Wall/timingleaks/crypto_encrypt/r5n13pke0smallct/ref/work/r5_parameter_sets.h:69: first defined here
try.c: /usr/bin/ld: libcrypto_encrypt_r5n13pke0smallct.a(parameters.o):.../supercop-data/wolfdale/amd64/try/c/gcc_-march=native_-mtune=native_-O2_-fwrapv_-fPIC_-fPIE_-gdwarf-4_-Wall/timingleaks/crypto_encrypt/r5n13pke0smallct/ref/work/r5_parameter_sets.h:66: multiple definition of `r5_parameter_sets'; libcrypto_encrypt_r5n13pke0smallct.a(cca_encrypt.o):.../supercop-data/wolfdale/amd64/try/c/gcc_-march=native_-mtune=native_-O2_-fwrapv_-fPIC_-fPIE_-gdwarf-4_-Wall/timingleaks/crypto_encrypt/r5n13pke0smallct/ref/work/r5_parameter_sets.h:66: first defined here
try.c: /usr/bin/ld: libcrypto_encrypt_r5n13pke0smallct.a(r5_cca_pke.o):.../supercop-data/wolfdale/amd64/try/c/gcc_-march=native_-mtune=native_-O2_-fwrapv_-fPIC_-fPIE_-gdwarf-4_-Wall/timingleaks/crypto_encrypt/r5n13pke0smallct/ref/work/r5_parameter_sets.h:69: multiple definition of `r5_parameter_set_names'; libcrypto_encrypt_r5n13pke0smallct.a(cca_encrypt.o):.../supercop-data/wolfdale/amd64/try/c/gcc_-march=native_-mtune=native_-O2_-fwrapv_-fPIC_-fPIE_-gdwarf-4_-Wall/timingleaks/crypto_encrypt/r5n13pke0smallct/ref/work/r5_parameter_sets.h:69: first defined here
try.c: /usr/bin/ld: libcrypto_encrypt_r5n13pke0smallct.a(r5_cca_pke.o):.../supercop-data/wolfdale/amd64/try/c/gcc_-march=native_-mtune=native_-O2_-fwrapv_-fPIC_-fPIE_-gdwarf-4_-Wall/timingleaks/crypto_encrypt/r5n13pke0smallct/ref/work/r5_parameter_sets.h:66: multiple definition of `r5_parameter_sets'; libcrypto_encrypt_r5n13pke0smallct.a(cca_encrypt.o):.../supercop-data/wolfdale/amd64/try/c/gcc_-march=native_-mtune=native_-O2_-fwrapv_-fPIC_-fPIE_-gdwarf-4_-Wall/timingleaks/crypto_encrypt/r5n13pke0smallct/ref/work/r5_parameter_sets.h:66: first defined here
try.c: /usr/bin/ld: libcrypto_encrypt_r5n13pke0smallct.a(r5_cca_kem.o):.../supercop-data/wolfdale/amd64/try/c/gcc_-march=native_-mtune=native_-O2_-fwrapv_-fPIC_-fPIE_-gdwarf-4_-Wall/timingleaks/crypto_encrypt/r5n13pke0smallct/ref/work/r5_parameter_sets.h:69: multiple definition of `r5_parameter_set_names'; libcrypto_encrypt_r5n13pke0smallct.a(cca_encrypt.o):.../supercop-data/wolfdale/amd64/try/c/gcc_-march=native_-mtune=native_-O2_-fwrapv_-fPIC_-fPIE_-gdwarf-4_-Wall/timingleaks/crypto_encrypt/r5n13pke0smallct/ref/work/r5_parameter_sets.h:69: first defined here
try.c: /usr/bin/ld: libcrypto_encrypt_r5n13pke0smallct.a(r5_cca_kem.o):.../supercop-data/wolfdale/amd64/try/c/gcc_-march=native_-mtune=native_-O2_-fwrapv_-fPIC_-fPIE_-gdwarf-4_-Wall/timingleaks/crypto_encrypt/r5n13pke0smallct/ref/work/r5_parameter_sets.h:66: multiple definition of `r5_parameter_sets'; libcrypto_encrypt_r5n13pke0smallct.a(cca_encrypt.o):.../supercop-data/wolfdale/amd64/try/c/gcc_-march=native_-mtune=native_-O2_-fwrapv_-fPIC_-fPIE_-gdwarf-4_-Wall/timingleaks/crypto_encrypt/r5n13pke0smallct/ref/work/r5_parameter_sets.h:66: first defined here
try.c: /usr/bin/ld: libcrypto_encrypt_r5n13pke0smallct.a(r5_cpa_pke.o):.../supercop-data/wolfdale/amd64/try/c/gcc_-march=native_-mtune=native_-O2_-fwrapv_-fPIC_-fPIE_-gdwarf-4_-Wall/timingleaks/crypto_encrypt/r5n13pke0smallct/ref/work/r5_parameter_sets.h:69: multiple definition of `r5_parameter_set_names'; libcrypto_encrypt_r5n13pke0smallct.a(cca_encrypt.o):.../supercop-data/wolfdale/amd64/try/c/gcc_-march=native_-mtune=native_-O2_-fwrapv_-fPIC_-fPIE_-gdwarf-4_-Wall/timingleaks/crypto_encrypt/r5n13pke0smallct/ref/work/r5_parameter_sets.h:69: first defined here
try.c: /usr/bin/ld: libcrypto_encrypt_r5n13pke0smallct.a(r5_cpa_pke.o):.../supercop-data/wolfdale/amd64/try/c/gcc_-march=native_-mtune=native_-O2_-fwrapv_-fPIC_-fPIE_-gdwarf-4_-Wall/timingleaks/crypto_encrypt/r5n13pke0smallct/ref/work/r5_parameter_sets.h:66: multiple definition of `r5_parameter_sets'; libcrypto_encrypt_r5n13pke0smallct.a(cca_encrypt.o):.../supercop-data/wolfdale/amd64/try/c/gcc_-march=native_-mtune=native_-O2_-fwrapv_-fPIC_-fPIE_-gdwarf-4_-Wall/timingleaks/crypto_encrypt/r5n13pke0smallct/ref/work/r5_parameter_sets.h:66: first defined here
try.c: /usr/bin/ld: libcrypto_encrypt_r5n13pke0smallct.a(r5_core.o):.../supercop-data/wolfdale/amd64/try/c/gcc_-march=native_-mtune=native_-O2_-fwrapv_-fPIC_-fPIE_-gdwarf-4_-Wall/timingleaks/crypto_encrypt/r5n13pke0smallct/ref/work/r5_parameter_sets.h:69: multiple definition of `r5_parameter_set_names'; libcrypto_encrypt_r5n13pke0smallct.a(cca_encrypt.o):.../supercop-data/wolfdale/amd64/try/c/gcc_-march=native_-mtune=native_-O2_-fwrapv_-fPIC_-fPIE_-gdwarf-4_-Wall/timingleaks/crypto_encrypt/r5n13pke0smallct/ref/work/r5_parameter_sets.h:69: first defined here
try.c: /usr/bin/ld: libcrypto_encrypt_r5n13pke0smallct.a(r5_core.o):.../supercop-data/wolfdale/amd64/try/c/gcc_-march=native_-mtune=native_-O2_-fwrapv_-fPIC_-fPIE_-gdwarf-4_-Wall/timingleaks/crypto_encrypt/r5n13pke0smallct/ref/work/r5_parameter_sets.h:66: multiple definition of `r5_parameter_sets'; libcrypto_encrypt_r5n13pke0smallct.a(cca_encrypt.o):.../supercop-data/wolfdale/amd64/try/c/gcc_-march=native_-mtune=native_-O2_-fwrapv_-fPIC_-fPIE_-gdwarf-4_-Wall/timingleaks/crypto_encrypt/r5n13pke0smallct/ref/work/r5_parameter_sets.h:66: first defined here
try.c: /usr/bin/ld: libcrypto_encrypt_r5n13pke0smallct.a(a_fixed.o):.../supercop-data/wolfdale/amd64/try/c/gcc_-march=native_-mtune=native_-O2_-fwrapv_-fPIC_-fPIE_-gdwarf-4_-Wall/timingleaks/crypto_encrypt/r5n13pke0smallct/ref/work/r5_parameter_sets.h:69: multiple definition of `r5_parameter_set_names'; libcrypto_encrypt_r5n13pke0smallct.a(cca_encrypt.o):.../supercop-data/wolfdale/amd64/try/c/gcc_-march=native_-mtune=native_-O2_-fwrapv_-fPIC_-fPIE_-gdwarf-4_-Wall/timingleaks/crypto_encrypt/r5n13pke0smallct/ref/work/r5_parameter_sets.h:69: first defined here
try.c: /usr/bin/ld: libcrypto_encrypt_r5n13pke0smallct.a(a_fixed.o):.../supercop-data/wolfdale/amd64/try/c/gcc_-march=native_-mtune=native_-O2_-fwrapv_-fPIC_-fPIE_-gdwarf-4_-Wall/timingleaks/crypto_encrypt/r5n13pke0smallct/ref/work/r5_parameter_sets.h:66: multiple definition of `r5_parameter_sets'; libcrypto_encrypt_r5n13pke0smallct.a(cca_encrypt.o):.../supercop-data/wolfdale/amd64/try/c/gcc_-march=native_-mtune=native_-O2_-fwrapv_-fPIC_-fPIE_-gdwarf-4_-Wall/timingleaks/crypto_encrypt/r5n13pke0smallct/ref/work/r5_parameter_sets.h:66: first defined here
try.c: /usr/bin/ld: libcrypto_encrypt_r5n13pke0smallct.a(a_random.o):.../supercop-data/wolfdale/amd64/try/c/gcc_-march=native_-mtune=native_-O2_-fwrapv_-fPIC_-fPIE_-gdwarf-4_-Wall/timingleaks/crypto_encrypt/r5n13pke0smallct/ref/work/r5_parameter_sets.h:69: multiple definition of `r5_parameter_set_names'; libcrypto_encrypt_r5n13pke0smallct.a(cca_encrypt.o):.../supercop-data/wolfdale/amd64/try/c/gcc_-march=native_-mtune=native_-O2_-fwrapv_-fPIC_-fPIE_-gdwarf-4_-Wall/timingleaks/crypto_encrypt/r5n13pke0smallct/ref/work/r5_parameter_sets.h:69: first defined here
try.c: /usr/bin/ld: libcrypto_encrypt_r5n13pke0smallct.a(a_random.o):.../supercop-data/wolfdale/amd64/try/c/gcc_-march=native_-mtune=native_-O2_-fwrapv_-fPIC_-fPIE_-gdwarf-4_-Wall/timingleaks/crypto_encrypt/r5n13pke0smallct/ref/work/r5_parameter_sets.h:66: multiple definition of `r5_parameter_sets'; libcrypto_encrypt_r5n13pke0smallct.a(cca_encrypt.o):.../supercop-data/wolfdale/amd64/try/c/gcc_-march=native_-mtune=native_-O2_-fwrapv_-fPIC_-fPIE_-gdwarf-4_-Wall/timingleaks/crypto_encrypt/r5n13pke0smallct/ref/work/r5_parameter_sets.h:66: first defined here
try.c: collect2: error: ld returned 1 exit status

Number of similar (implementation,compiler) pairs: 1, namely:
ImplementationCompiler
T:refgcc -march=native -mtune=native -O2 -fwrapv -fPIC -fPIE -gdwarf-4 -Wall (10.2.1_20210110)

Compiler output


try.c: /usr/bin/ld: libcrypto_encrypt_r5n13pke0smallct.a(parameters.o):.../supercop-data/wolfdale/amd64/try/c/gcc_-march=native_-mtune=native_-O3_-fwrapv_-fPIC_-fPIE_-gdwarf-4_-Wall/timingleaks/crypto_encrypt/r5n13pke0smallct/ref/work/r5_parameter_sets.h:69: multiple definition of `r5_parameter_set_names'; libcrypto_encrypt_r5n13pke0smallct.a(cca_encrypt.o):.../supercop-data/wolfdale/amd64/try/c/gcc_-march=native_-mtune=native_-O3_-fwrapv_-fPIC_-fPIE_-gdwarf-4_-Wall/timingleaks/crypto_encrypt/r5n13pke0smallct/ref/work/r5_parameter_sets.h:69: first defined here
try.c: /usr/bin/ld: libcrypto_encrypt_r5n13pke0smallct.a(parameters.o):.../supercop-data/wolfdale/amd64/try/c/gcc_-march=native_-mtune=native_-O3_-fwrapv_-fPIC_-fPIE_-gdwarf-4_-Wall/timingleaks/crypto_encrypt/r5n13pke0smallct/ref/work/r5_parameter_sets.h:66: multiple definition of `r5_parameter_sets'; libcrypto_encrypt_r5n13pke0smallct.a(cca_encrypt.o):.../supercop-data/wolfdale/amd64/try/c/gcc_-march=native_-mtune=native_-O3_-fwrapv_-fPIC_-fPIE_-gdwarf-4_-Wall/timingleaks/crypto_encrypt/r5n13pke0smallct/ref/work/r5_parameter_sets.h:66: first defined here
try.c: /usr/bin/ld: libcrypto_encrypt_r5n13pke0smallct.a(r5_cca_pke.o):.../supercop-data/wolfdale/amd64/try/c/gcc_-march=native_-mtune=native_-O3_-fwrapv_-fPIC_-fPIE_-gdwarf-4_-Wall/timingleaks/crypto_encrypt/r5n13pke0smallct/ref/work/r5_parameter_sets.h:69: multiple definition of `r5_parameter_set_names'; libcrypto_encrypt_r5n13pke0smallct.a(cca_encrypt.o):.../supercop-data/wolfdale/amd64/try/c/gcc_-march=native_-mtune=native_-O3_-fwrapv_-fPIC_-fPIE_-gdwarf-4_-Wall/timingleaks/crypto_encrypt/r5n13pke0smallct/ref/work/r5_parameter_sets.h:69: first defined here
try.c: /usr/bin/ld: libcrypto_encrypt_r5n13pke0smallct.a(r5_cca_pke.o):.../supercop-data/wolfdale/amd64/try/c/gcc_-march=native_-mtune=native_-O3_-fwrapv_-fPIC_-fPIE_-gdwarf-4_-Wall/timingleaks/crypto_encrypt/r5n13pke0smallct/ref/work/r5_parameter_sets.h:66: multiple definition of `r5_parameter_sets'; libcrypto_encrypt_r5n13pke0smallct.a(cca_encrypt.o):.../supercop-data/wolfdale/amd64/try/c/gcc_-march=native_-mtune=native_-O3_-fwrapv_-fPIC_-fPIE_-gdwarf-4_-Wall/timingleaks/crypto_encrypt/r5n13pke0smallct/ref/work/r5_parameter_sets.h:66: first defined here
try.c: /usr/bin/ld: libcrypto_encrypt_r5n13pke0smallct.a(r5_cca_kem.o):.../supercop-data/wolfdale/amd64/try/c/gcc_-march=native_-mtune=native_-O3_-fwrapv_-fPIC_-fPIE_-gdwarf-4_-Wall/timingleaks/crypto_encrypt/r5n13pke0smallct/ref/work/r5_parameter_sets.h:69: multiple definition of `r5_parameter_set_names'; libcrypto_encrypt_r5n13pke0smallct.a(cca_encrypt.o):.../supercop-data/wolfdale/amd64/try/c/gcc_-march=native_-mtune=native_-O3_-fwrapv_-fPIC_-fPIE_-gdwarf-4_-Wall/timingleaks/crypto_encrypt/r5n13pke0smallct/ref/work/r5_parameter_sets.h:69: first defined here
try.c: /usr/bin/ld: libcrypto_encrypt_r5n13pke0smallct.a(r5_cca_kem.o):.../supercop-data/wolfdale/amd64/try/c/gcc_-march=native_-mtune=native_-O3_-fwrapv_-fPIC_-fPIE_-gdwarf-4_-Wall/timingleaks/crypto_encrypt/r5n13pke0smallct/ref/work/r5_parameter_sets.h:66: multiple definition of `r5_parameter_sets'; libcrypto_encrypt_r5n13pke0smallct.a(cca_encrypt.o):.../supercop-data/wolfdale/amd64/try/c/gcc_-march=native_-mtune=native_-O3_-fwrapv_-fPIC_-fPIE_-gdwarf-4_-Wall/timingleaks/crypto_encrypt/r5n13pke0smallct/ref/work/r5_parameter_sets.h:66: first defined here
try.c: /usr/bin/ld: libcrypto_encrypt_r5n13pke0smallct.a(r5_cpa_pke.o):.../supercop-data/wolfdale/amd64/try/c/gcc_-march=native_-mtune=native_-O3_-fwrapv_-fPIC_-fPIE_-gdwarf-4_-Wall/timingleaks/crypto_encrypt/r5n13pke0smallct/ref/work/r5_parameter_sets.h:69: multiple definition of `r5_parameter_set_names'; libcrypto_encrypt_r5n13pke0smallct.a(cca_encrypt.o):.../supercop-data/wolfdale/amd64/try/c/gcc_-march=native_-mtune=native_-O3_-fwrapv_-fPIC_-fPIE_-gdwarf-4_-Wall/timingleaks/crypto_encrypt/r5n13pke0smallct/ref/work/r5_parameter_sets.h:69: first defined here
try.c: /usr/bin/ld: libcrypto_encrypt_r5n13pke0smallct.a(r5_cpa_pke.o):.../supercop-data/wolfdale/amd64/try/c/gcc_-march=native_-mtune=native_-O3_-fwrapv_-fPIC_-fPIE_-gdwarf-4_-Wall/timingleaks/crypto_encrypt/r5n13pke0smallct/ref/work/r5_parameter_sets.h:66: multiple definition of `r5_parameter_sets'; libcrypto_encrypt_r5n13pke0smallct.a(cca_encrypt.o):.../supercop-data/wolfdale/amd64/try/c/gcc_-march=native_-mtune=native_-O3_-fwrapv_-fPIC_-fPIE_-gdwarf-4_-Wall/timingleaks/crypto_encrypt/r5n13pke0smallct/ref/work/r5_parameter_sets.h:66: first defined here
try.c: /usr/bin/ld: libcrypto_encrypt_r5n13pke0smallct.a(r5_core.o):.../supercop-data/wolfdale/amd64/try/c/gcc_-march=native_-mtune=native_-O3_-fwrapv_-fPIC_-fPIE_-gdwarf-4_-Wall/timingleaks/crypto_encrypt/r5n13pke0smallct/ref/work/r5_parameter_sets.h:69: multiple definition of `r5_parameter_set_names'; libcrypto_encrypt_r5n13pke0smallct.a(cca_encrypt.o):.../supercop-data/wolfdale/amd64/try/c/gcc_-march=native_-mtune=native_-O3_-fwrapv_-fPIC_-fPIE_-gdwarf-4_-Wall/timingleaks/crypto_encrypt/r5n13pke0smallct/ref/work/r5_parameter_sets.h:69: first defined here
try.c: /usr/bin/ld: libcrypto_encrypt_r5n13pke0smallct.a(r5_core.o):.../supercop-data/wolfdale/amd64/try/c/gcc_-march=native_-mtune=native_-O3_-fwrapv_-fPIC_-fPIE_-gdwarf-4_-Wall/timingleaks/crypto_encrypt/r5n13pke0smallct/ref/work/r5_parameter_sets.h:66: multiple definition of `r5_parameter_sets'; libcrypto_encrypt_r5n13pke0smallct.a(cca_encrypt.o):.../supercop-data/wolfdale/amd64/try/c/gcc_-march=native_-mtune=native_-O3_-fwrapv_-fPIC_-fPIE_-gdwarf-4_-Wall/timingleaks/crypto_encrypt/r5n13pke0smallct/ref/work/r5_parameter_sets.h:66: first defined here
try.c: /usr/bin/ld: libcrypto_encrypt_r5n13pke0smallct.a(a_fixed.o):.../supercop-data/wolfdale/amd64/try/c/gcc_-march=native_-mtune=native_-O3_-fwrapv_-fPIC_-fPIE_-gdwarf-4_-Wall/timingleaks/crypto_encrypt/r5n13pke0smallct/ref/work/r5_parameter_sets.h:69: multiple definition of `r5_parameter_set_names'; libcrypto_encrypt_r5n13pke0smallct.a(cca_encrypt.o):.../supercop-data/wolfdale/amd64/try/c/gcc_-march=native_-mtune=native_-O3_-fwrapv_-fPIC_-fPIE_-gdwarf-4_-Wall/timingleaks/crypto_encrypt/r5n13pke0smallct/ref/work/r5_parameter_sets.h:69: first defined here
try.c: /usr/bin/ld: libcrypto_encrypt_r5n13pke0smallct.a(a_fixed.o):.../supercop-data/wolfdale/amd64/try/c/gcc_-march=native_-mtune=native_-O3_-fwrapv_-fPIC_-fPIE_-gdwarf-4_-Wall/timingleaks/crypto_encrypt/r5n13pke0smallct/ref/work/r5_parameter_sets.h:66: multiple definition of `r5_parameter_sets'; libcrypto_encrypt_r5n13pke0smallct.a(cca_encrypt.o):.../supercop-data/wolfdale/amd64/try/c/gcc_-march=native_-mtune=native_-O3_-fwrapv_-fPIC_-fPIE_-gdwarf-4_-Wall/timingleaks/crypto_encrypt/r5n13pke0smallct/ref/work/r5_parameter_sets.h:66: first defined here
try.c: /usr/bin/ld: libcrypto_encrypt_r5n13pke0smallct.a(a_random.o):.../supercop-data/wolfdale/amd64/try/c/gcc_-march=native_-mtune=native_-O3_-fwrapv_-fPIC_-fPIE_-gdwarf-4_-Wall/timingleaks/crypto_encrypt/r5n13pke0smallct/ref/work/r5_parameter_sets.h:69: multiple definition of `r5_parameter_set_names'; libcrypto_encrypt_r5n13pke0smallct.a(cca_encrypt.o):.../supercop-data/wolfdale/amd64/try/c/gcc_-march=native_-mtune=native_-O3_-fwrapv_-fPIC_-fPIE_-gdwarf-4_-Wall/timingleaks/crypto_encrypt/r5n13pke0smallct/ref/work/r5_parameter_sets.h:69: first defined here
try.c: /usr/bin/ld: libcrypto_encrypt_r5n13pke0smallct.a(a_random.o):.../supercop-data/wolfdale/amd64/try/c/gcc_-march=native_-mtune=native_-O3_-fwrapv_-fPIC_-fPIE_-gdwarf-4_-Wall/timingleaks/crypto_encrypt/r5n13pke0smallct/ref/work/r5_parameter_sets.h:66: multiple definition of `r5_parameter_sets'; libcrypto_encrypt_r5n13pke0smallct.a(cca_encrypt.o):.../supercop-data/wolfdale/amd64/try/c/gcc_-march=native_-mtune=native_-O3_-fwrapv_-fPIC_-fPIE_-gdwarf-4_-Wall/timingleaks/crypto_encrypt/r5n13pke0smallct/ref/work/r5_parameter_sets.h:66: first defined here
try.c: collect2: error: ld returned 1 exit status

Number of similar (implementation,compiler) pairs: 1, namely:
ImplementationCompiler
T:refgcc -march=native -mtune=native -O3 -fwrapv -fPIC -fPIE -gdwarf-4 -Wall (10.2.1_20210110)

Compiler output


try.c: /usr/bin/ld: libcrypto_encrypt_r5n13pke0smallct.a(parameters.o):.../supercop-data/wolfdale/amd64/try/c/gcc_-march=native_-mtune=native_-O_-fwrapv_-fPIC_-fPIE_-gdwarf-4_-Wall/timingleaks/crypto_encrypt/r5n13pke0smallct/ref/work/r5_parameter_sets.h:69: multiple definition of `r5_parameter_set_names'; libcrypto_encrypt_r5n13pke0smallct.a(cca_encrypt.o):.../supercop-data/wolfdale/amd64/try/c/gcc_-march=native_-mtune=native_-O_-fwrapv_-fPIC_-fPIE_-gdwarf-4_-Wall/timingleaks/crypto_encrypt/r5n13pke0smallct/ref/work/r5_parameter_sets.h:69: first defined here
try.c: /usr/bin/ld: libcrypto_encrypt_r5n13pke0smallct.a(parameters.o):.../supercop-data/wolfdale/amd64/try/c/gcc_-march=native_-mtune=native_-O_-fwrapv_-fPIC_-fPIE_-gdwarf-4_-Wall/timingleaks/crypto_encrypt/r5n13pke0smallct/ref/work/r5_parameter_sets.h:66: multiple definition of `r5_parameter_sets'; libcrypto_encrypt_r5n13pke0smallct.a(cca_encrypt.o):.../supercop-data/wolfdale/amd64/try/c/gcc_-march=native_-mtune=native_-O_-fwrapv_-fPIC_-fPIE_-gdwarf-4_-Wall/timingleaks/crypto_encrypt/r5n13pke0smallct/ref/work/r5_parameter_sets.h:66: first defined here
try.c: /usr/bin/ld: libcrypto_encrypt_r5n13pke0smallct.a(r5_cca_pke.o):.../supercop-data/wolfdale/amd64/try/c/gcc_-march=native_-mtune=native_-O_-fwrapv_-fPIC_-fPIE_-gdwarf-4_-Wall/timingleaks/crypto_encrypt/r5n13pke0smallct/ref/work/r5_parameter_sets.h:69: multiple definition of `r5_parameter_set_names'; libcrypto_encrypt_r5n13pke0smallct.a(cca_encrypt.o):.../supercop-data/wolfdale/amd64/try/c/gcc_-march=native_-mtune=native_-O_-fwrapv_-fPIC_-fPIE_-gdwarf-4_-Wall/timingleaks/crypto_encrypt/r5n13pke0smallct/ref/work/r5_parameter_sets.h:69: first defined here
try.c: /usr/bin/ld: libcrypto_encrypt_r5n13pke0smallct.a(r5_cca_pke.o):.../supercop-data/wolfdale/amd64/try/c/gcc_-march=native_-mtune=native_-O_-fwrapv_-fPIC_-fPIE_-gdwarf-4_-Wall/timingleaks/crypto_encrypt/r5n13pke0smallct/ref/work/r5_parameter_sets.h:66: multiple definition of `r5_parameter_sets'; libcrypto_encrypt_r5n13pke0smallct.a(cca_encrypt.o):.../supercop-data/wolfdale/amd64/try/c/gcc_-march=native_-mtune=native_-O_-fwrapv_-fPIC_-fPIE_-gdwarf-4_-Wall/timingleaks/crypto_encrypt/r5n13pke0smallct/ref/work/r5_parameter_sets.h:66: first defined here
try.c: /usr/bin/ld: libcrypto_encrypt_r5n13pke0smallct.a(r5_cca_kem.o):.../supercop-data/wolfdale/amd64/try/c/gcc_-march=native_-mtune=native_-O_-fwrapv_-fPIC_-fPIE_-gdwarf-4_-Wall/timingleaks/crypto_encrypt/r5n13pke0smallct/ref/work/r5_parameter_sets.h:69: multiple definition of `r5_parameter_set_names'; libcrypto_encrypt_r5n13pke0smallct.a(cca_encrypt.o):.../supercop-data/wolfdale/amd64/try/c/gcc_-march=native_-mtune=native_-O_-fwrapv_-fPIC_-fPIE_-gdwarf-4_-Wall/timingleaks/crypto_encrypt/r5n13pke0smallct/ref/work/r5_parameter_sets.h:69: first defined here
try.c: /usr/bin/ld: libcrypto_encrypt_r5n13pke0smallct.a(r5_cca_kem.o):.../supercop-data/wolfdale/amd64/try/c/gcc_-march=native_-mtune=native_-O_-fwrapv_-fPIC_-fPIE_-gdwarf-4_-Wall/timingleaks/crypto_encrypt/r5n13pke0smallct/ref/work/r5_parameter_sets.h:66: multiple definition of `r5_parameter_sets'; libcrypto_encrypt_r5n13pke0smallct.a(cca_encrypt.o):.../supercop-data/wolfdale/amd64/try/c/gcc_-march=native_-mtune=native_-O_-fwrapv_-fPIC_-fPIE_-gdwarf-4_-Wall/timingleaks/crypto_encrypt/r5n13pke0smallct/ref/work/r5_parameter_sets.h:66: first defined here
try.c: /usr/bin/ld: libcrypto_encrypt_r5n13pke0smallct.a(r5_cpa_pke.o):.../supercop-data/wolfdale/amd64/try/c/gcc_-march=native_-mtune=native_-O_-fwrapv_-fPIC_-fPIE_-gdwarf-4_-Wall/timingleaks/crypto_encrypt/r5n13pke0smallct/ref/work/r5_parameter_sets.h:69: multiple definition of `r5_parameter_set_names'; libcrypto_encrypt_r5n13pke0smallct.a(cca_encrypt.o):.../supercop-data/wolfdale/amd64/try/c/gcc_-march=native_-mtune=native_-O_-fwrapv_-fPIC_-fPIE_-gdwarf-4_-Wall/timingleaks/crypto_encrypt/r5n13pke0smallct/ref/work/r5_parameter_sets.h:69: first defined here
try.c: /usr/bin/ld: libcrypto_encrypt_r5n13pke0smallct.a(r5_cpa_pke.o):.../supercop-data/wolfdale/amd64/try/c/gcc_-march=native_-mtune=native_-O_-fwrapv_-fPIC_-fPIE_-gdwarf-4_-Wall/timingleaks/crypto_encrypt/r5n13pke0smallct/ref/work/r5_parameter_sets.h:66: multiple definition of `r5_parameter_sets'; libcrypto_encrypt_r5n13pke0smallct.a(cca_encrypt.o):.../supercop-data/wolfdale/amd64/try/c/gcc_-march=native_-mtune=native_-O_-fwrapv_-fPIC_-fPIE_-gdwarf-4_-Wall/timingleaks/crypto_encrypt/r5n13pke0smallct/ref/work/r5_parameter_sets.h:66: first defined here
try.c: /usr/bin/ld: libcrypto_encrypt_r5n13pke0smallct.a(r5_core.o):.../supercop-data/wolfdale/amd64/try/c/gcc_-march=native_-mtune=native_-O_-fwrapv_-fPIC_-fPIE_-gdwarf-4_-Wall/timingleaks/crypto_encrypt/r5n13pke0smallct/ref/work/r5_parameter_sets.h:69: multiple definition of `r5_parameter_set_names'; libcrypto_encrypt_r5n13pke0smallct.a(cca_encrypt.o):.../supercop-data/wolfdale/amd64/try/c/gcc_-march=native_-mtune=native_-O_-fwrapv_-fPIC_-fPIE_-gdwarf-4_-Wall/timingleaks/crypto_encrypt/r5n13pke0smallct/ref/work/r5_parameter_sets.h:69: first defined here
try.c: /usr/bin/ld: libcrypto_encrypt_r5n13pke0smallct.a(r5_core.o):.../supercop-data/wolfdale/amd64/try/c/gcc_-march=native_-mtune=native_-O_-fwrapv_-fPIC_-fPIE_-gdwarf-4_-Wall/timingleaks/crypto_encrypt/r5n13pke0smallct/ref/work/r5_parameter_sets.h:66: multiple definition of `r5_parameter_sets'; libcrypto_encrypt_r5n13pke0smallct.a(cca_encrypt.o):.../supercop-data/wolfdale/amd64/try/c/gcc_-march=native_-mtune=native_-O_-fwrapv_-fPIC_-fPIE_-gdwarf-4_-Wall/timingleaks/crypto_encrypt/r5n13pke0smallct/ref/work/r5_parameter_sets.h:66: first defined here
try.c: /usr/bin/ld: libcrypto_encrypt_r5n13pke0smallct.a(a_fixed.o):.../supercop-data/wolfdale/amd64/try/c/gcc_-march=native_-mtune=native_-O_-fwrapv_-fPIC_-fPIE_-gdwarf-4_-Wall/timingleaks/crypto_encrypt/r5n13pke0smallct/ref/work/r5_parameter_sets.h:69: multiple definition of `r5_parameter_set_names'; libcrypto_encrypt_r5n13pke0smallct.a(cca_encrypt.o):.../supercop-data/wolfdale/amd64/try/c/gcc_-march=native_-mtune=native_-O_-fwrapv_-fPIC_-fPIE_-gdwarf-4_-Wall/timingleaks/crypto_encrypt/r5n13pke0smallct/ref/work/r5_parameter_sets.h:69: first defined here
try.c: /usr/bin/ld: libcrypto_encrypt_r5n13pke0smallct.a(a_fixed.o):.../supercop-data/wolfdale/amd64/try/c/gcc_-march=native_-mtune=native_-O_-fwrapv_-fPIC_-fPIE_-gdwarf-4_-Wall/timingleaks/crypto_encrypt/r5n13pke0smallct/ref/work/r5_parameter_sets.h:66: multiple definition of `r5_parameter_sets'; libcrypto_encrypt_r5n13pke0smallct.a(cca_encrypt.o):.../supercop-data/wolfdale/amd64/try/c/gcc_-march=native_-mtune=native_-O_-fwrapv_-fPIC_-fPIE_-gdwarf-4_-Wall/timingleaks/crypto_encrypt/r5n13pke0smallct/ref/work/r5_parameter_sets.h:66: first defined here
try.c: /usr/bin/ld: libcrypto_encrypt_r5n13pke0smallct.a(a_random.o):.../supercop-data/wolfdale/amd64/try/c/gcc_-march=native_-mtune=native_-O_-fwrapv_-fPIC_-fPIE_-gdwarf-4_-Wall/timingleaks/crypto_encrypt/r5n13pke0smallct/ref/work/r5_parameter_sets.h:69: multiple definition of `r5_parameter_set_names'; libcrypto_encrypt_r5n13pke0smallct.a(cca_encrypt.o):.../supercop-data/wolfdale/amd64/try/c/gcc_-march=native_-mtune=native_-O_-fwrapv_-fPIC_-fPIE_-gdwarf-4_-Wall/timingleaks/crypto_encrypt/r5n13pke0smallct/ref/work/r5_parameter_sets.h:69: first defined here
try.c: /usr/bin/ld: libcrypto_encrypt_r5n13pke0smallct.a(a_random.o):.../supercop-data/wolfdale/amd64/try/c/gcc_-march=native_-mtune=native_-O_-fwrapv_-fPIC_-fPIE_-gdwarf-4_-Wall/timingleaks/crypto_encrypt/r5n13pke0smallct/ref/work/r5_parameter_sets.h:66: multiple definition of `r5_parameter_sets'; libcrypto_encrypt_r5n13pke0smallct.a(cca_encrypt.o):.../supercop-data/wolfdale/amd64/try/c/gcc_-march=native_-mtune=native_-O_-fwrapv_-fPIC_-fPIE_-gdwarf-4_-Wall/timingleaks/crypto_encrypt/r5n13pke0smallct/ref/work/r5_parameter_sets.h:66: first defined here
try.c: collect2: error: ld returned 1 exit status

Number of similar (implementation,compiler) pairs: 1, namely:
ImplementationCompiler
T:refgcc -march=native -mtune=native -O -fwrapv -fPIC -fPIE -gdwarf-4 -Wall (10.2.1_20210110)

Compiler output


try.c: /usr/bin/ld: libcrypto_encrypt_r5n13pke0smallct.a(parameters.o):.../supercop-data/wolfdale/amd64/try/c/gcc_-march=native_-mtune=native_-Os_-fwrapv_-fPIC_-fPIE_-gdwarf-4_-Wall/timingleaks/crypto_encrypt/r5n13pke0smallct/ref/work/r5_parameter_sets.h:69: multiple definition of `r5_parameter_set_names'; libcrypto_encrypt_r5n13pke0smallct.a(cca_encrypt.o):.../supercop-data/wolfdale/amd64/try/c/gcc_-march=native_-mtune=native_-Os_-fwrapv_-fPIC_-fPIE_-gdwarf-4_-Wall/timingleaks/crypto_encrypt/r5n13pke0smallct/ref/work/r5_parameter_sets.h:69: first defined here
try.c: /usr/bin/ld: libcrypto_encrypt_r5n13pke0smallct.a(parameters.o):.../supercop-data/wolfdale/amd64/try/c/gcc_-march=native_-mtune=native_-Os_-fwrapv_-fPIC_-fPIE_-gdwarf-4_-Wall/timingleaks/crypto_encrypt/r5n13pke0smallct/ref/work/r5_parameter_sets.h:66: multiple definition of `r5_parameter_sets'; libcrypto_encrypt_r5n13pke0smallct.a(cca_encrypt.o):.../supercop-data/wolfdale/amd64/try/c/gcc_-march=native_-mtune=native_-Os_-fwrapv_-fPIC_-fPIE_-gdwarf-4_-Wall/timingleaks/crypto_encrypt/r5n13pke0smallct/ref/work/r5_parameter_sets.h:66: first defined here
try.c: /usr/bin/ld: libcrypto_encrypt_r5n13pke0smallct.a(r5_cca_pke.o):.../supercop-data/wolfdale/amd64/try/c/gcc_-march=native_-mtune=native_-Os_-fwrapv_-fPIC_-fPIE_-gdwarf-4_-Wall/timingleaks/crypto_encrypt/r5n13pke0smallct/ref/work/r5_parameter_sets.h:69: multiple definition of `r5_parameter_set_names'; libcrypto_encrypt_r5n13pke0smallct.a(cca_encrypt.o):.../supercop-data/wolfdale/amd64/try/c/gcc_-march=native_-mtune=native_-Os_-fwrapv_-fPIC_-fPIE_-gdwarf-4_-Wall/timingleaks/crypto_encrypt/r5n13pke0smallct/ref/work/r5_parameter_sets.h:69: first defined here
try.c: /usr/bin/ld: libcrypto_encrypt_r5n13pke0smallct.a(r5_cca_pke.o):.../supercop-data/wolfdale/amd64/try/c/gcc_-march=native_-mtune=native_-Os_-fwrapv_-fPIC_-fPIE_-gdwarf-4_-Wall/timingleaks/crypto_encrypt/r5n13pke0smallct/ref/work/r5_parameter_sets.h:66: multiple definition of `r5_parameter_sets'; libcrypto_encrypt_r5n13pke0smallct.a(cca_encrypt.o):.../supercop-data/wolfdale/amd64/try/c/gcc_-march=native_-mtune=native_-Os_-fwrapv_-fPIC_-fPIE_-gdwarf-4_-Wall/timingleaks/crypto_encrypt/r5n13pke0smallct/ref/work/r5_parameter_sets.h:66: first defined here
try.c: /usr/bin/ld: libcrypto_encrypt_r5n13pke0smallct.a(r5_cca_kem.o):.../supercop-data/wolfdale/amd64/try/c/gcc_-march=native_-mtune=native_-Os_-fwrapv_-fPIC_-fPIE_-gdwarf-4_-Wall/timingleaks/crypto_encrypt/r5n13pke0smallct/ref/work/r5_parameter_sets.h:69: multiple definition of `r5_parameter_set_names'; libcrypto_encrypt_r5n13pke0smallct.a(cca_encrypt.o):.../supercop-data/wolfdale/amd64/try/c/gcc_-march=native_-mtune=native_-Os_-fwrapv_-fPIC_-fPIE_-gdwarf-4_-Wall/timingleaks/crypto_encrypt/r5n13pke0smallct/ref/work/r5_parameter_sets.h:69: first defined here
try.c: /usr/bin/ld: libcrypto_encrypt_r5n13pke0smallct.a(r5_cca_kem.o):.../supercop-data/wolfdale/amd64/try/c/gcc_-march=native_-mtune=native_-Os_-fwrapv_-fPIC_-fPIE_-gdwarf-4_-Wall/timingleaks/crypto_encrypt/r5n13pke0smallct/ref/work/r5_parameter_sets.h:66: multiple definition of `r5_parameter_sets'; libcrypto_encrypt_r5n13pke0smallct.a(cca_encrypt.o):.../supercop-data/wolfdale/amd64/try/c/gcc_-march=native_-mtune=native_-Os_-fwrapv_-fPIC_-fPIE_-gdwarf-4_-Wall/timingleaks/crypto_encrypt/r5n13pke0smallct/ref/work/r5_parameter_sets.h:66: first defined here
try.c: /usr/bin/ld: libcrypto_encrypt_r5n13pke0smallct.a(r5_cpa_pke.o):.../supercop-data/wolfdale/amd64/try/c/gcc_-march=native_-mtune=native_-Os_-fwrapv_-fPIC_-fPIE_-gdwarf-4_-Wall/timingleaks/crypto_encrypt/r5n13pke0smallct/ref/work/r5_parameter_sets.h:69: multiple definition of `r5_parameter_set_names'; libcrypto_encrypt_r5n13pke0smallct.a(cca_encrypt.o):.../supercop-data/wolfdale/amd64/try/c/gcc_-march=native_-mtune=native_-Os_-fwrapv_-fPIC_-fPIE_-gdwarf-4_-Wall/timingleaks/crypto_encrypt/r5n13pke0smallct/ref/work/r5_parameter_sets.h:69: first defined here
try.c: /usr/bin/ld: libcrypto_encrypt_r5n13pke0smallct.a(r5_cpa_pke.o):.../supercop-data/wolfdale/amd64/try/c/gcc_-march=native_-mtune=native_-Os_-fwrapv_-fPIC_-fPIE_-gdwarf-4_-Wall/timingleaks/crypto_encrypt/r5n13pke0smallct/ref/work/r5_parameter_sets.h:66: multiple definition of `r5_parameter_sets'; libcrypto_encrypt_r5n13pke0smallct.a(cca_encrypt.o):.../supercop-data/wolfdale/amd64/try/c/gcc_-march=native_-mtune=native_-Os_-fwrapv_-fPIC_-fPIE_-gdwarf-4_-Wall/timingleaks/crypto_encrypt/r5n13pke0smallct/ref/work/r5_parameter_sets.h:66: first defined here
try.c: /usr/bin/ld: libcrypto_encrypt_r5n13pke0smallct.a(r5_core.o):.../supercop-data/wolfdale/amd64/try/c/gcc_-march=native_-mtune=native_-Os_-fwrapv_-fPIC_-fPIE_-gdwarf-4_-Wall/timingleaks/crypto_encrypt/r5n13pke0smallct/ref/work/r5_parameter_sets.h:69: multiple definition of `r5_parameter_set_names'; libcrypto_encrypt_r5n13pke0smallct.a(cca_encrypt.o):.../supercop-data/wolfdale/amd64/try/c/gcc_-march=native_-mtune=native_-Os_-fwrapv_-fPIC_-fPIE_-gdwarf-4_-Wall/timingleaks/crypto_encrypt/r5n13pke0smallct/ref/work/r5_parameter_sets.h:69: first defined here
try.c: /usr/bin/ld: libcrypto_encrypt_r5n13pke0smallct.a(r5_core.o):.../supercop-data/wolfdale/amd64/try/c/gcc_-march=native_-mtune=native_-Os_-fwrapv_-fPIC_-fPIE_-gdwarf-4_-Wall/timingleaks/crypto_encrypt/r5n13pke0smallct/ref/work/r5_parameter_sets.h:66: multiple definition of `r5_parameter_sets'; libcrypto_encrypt_r5n13pke0smallct.a(cca_encrypt.o):.../supercop-data/wolfdale/amd64/try/c/gcc_-march=native_-mtune=native_-Os_-fwrapv_-fPIC_-fPIE_-gdwarf-4_-Wall/timingleaks/crypto_encrypt/r5n13pke0smallct/ref/work/r5_parameter_sets.h:66: first defined here
try.c: /usr/bin/ld: libcrypto_encrypt_r5n13pke0smallct.a(a_fixed.o):.../supercop-data/wolfdale/amd64/try/c/gcc_-march=native_-mtune=native_-Os_-fwrapv_-fPIC_-fPIE_-gdwarf-4_-Wall/timingleaks/crypto_encrypt/r5n13pke0smallct/ref/work/r5_parameter_sets.h:69: multiple definition of `r5_parameter_set_names'; libcrypto_encrypt_r5n13pke0smallct.a(cca_encrypt.o):.../supercop-data/wolfdale/amd64/try/c/gcc_-march=native_-mtune=native_-Os_-fwrapv_-fPIC_-fPIE_-gdwarf-4_-Wall/timingleaks/crypto_encrypt/r5n13pke0smallct/ref/work/r5_parameter_sets.h:69: first defined here
try.c: /usr/bin/ld: libcrypto_encrypt_r5n13pke0smallct.a(a_fixed.o):.../supercop-data/wolfdale/amd64/try/c/gcc_-march=native_-mtune=native_-Os_-fwrapv_-fPIC_-fPIE_-gdwarf-4_-Wall/timingleaks/crypto_encrypt/r5n13pke0smallct/ref/work/r5_parameter_sets.h:66: multiple definition of `r5_parameter_sets'; libcrypto_encrypt_r5n13pke0smallct.a(cca_encrypt.o):.../supercop-data/wolfdale/amd64/try/c/gcc_-march=native_-mtune=native_-Os_-fwrapv_-fPIC_-fPIE_-gdwarf-4_-Wall/timingleaks/crypto_encrypt/r5n13pke0smallct/ref/work/r5_parameter_sets.h:66: first defined here
try.c: /usr/bin/ld: libcrypto_encrypt_r5n13pke0smallct.a(a_random.o):.../supercop-data/wolfdale/amd64/try/c/gcc_-march=native_-mtune=native_-Os_-fwrapv_-fPIC_-fPIE_-gdwarf-4_-Wall/timingleaks/crypto_encrypt/r5n13pke0smallct/ref/work/r5_parameter_sets.h:69: multiple definition of `r5_parameter_set_names'; libcrypto_encrypt_r5n13pke0smallct.a(cca_encrypt.o):.../supercop-data/wolfdale/amd64/try/c/gcc_-march=native_-mtune=native_-Os_-fwrapv_-fPIC_-fPIE_-gdwarf-4_-Wall/timingleaks/crypto_encrypt/r5n13pke0smallct/ref/work/r5_parameter_sets.h:69: first defined here
try.c: /usr/bin/ld: libcrypto_encrypt_r5n13pke0smallct.a(a_random.o):.../supercop-data/wolfdale/amd64/try/c/gcc_-march=native_-mtune=native_-Os_-fwrapv_-fPIC_-fPIE_-gdwarf-4_-Wall/timingleaks/crypto_encrypt/r5n13pke0smallct/ref/work/r5_parameter_sets.h:66: multiple definition of `r5_parameter_sets'; libcrypto_encrypt_r5n13pke0smallct.a(cca_encrypt.o):.../supercop-data/wolfdale/amd64/try/c/gcc_-march=native_-mtune=native_-Os_-fwrapv_-fPIC_-fPIE_-gdwarf-4_-Wall/timingleaks/crypto_encrypt/r5n13pke0smallct/ref/work/r5_parameter_sets.h:66: first defined here
try.c: collect2: error: ld returned 1 exit status

Number of similar (implementation,compiler) pairs: 1, namely:
ImplementationCompiler
T:refgcc -march=native -mtune=native -Os -fwrapv -fPIC -fPIE -gdwarf-4 -Wall (10.2.1_20210110)