Test results for amd64, wolfdale, crypto_aead/ascon80pqv12

[Page version: 20240911 13:27:25]

Measurements for amd64, wolfdale, crypto_aead Test results for amd64, wolfdale, crypto_aead Test results for crypto_aead/ascon80pqv12
Computer: wolfdale
Microarchitecture: amd64; Core 2 45nm (1067a)
Architecture: amd64
CPU ID: GenuineIntel-0001067a-bfebfbff
SUPERCOP version: 20240909
Operation: crypto_aead
Primitive: ascon80pqv12
TimeObject sizeTest sizeImplementationCompilerBenchmark dateSUPERCOP version
9445215136 0 029054 804 1016opt64clang -march=native -O -fwrapv -Qunused-arguments -fPIC -fPIE -gdwarf-4 -Wall2024081120240808
9451315004 0 031400 812 1016opt64clang -march=native -O3 -fwrapv -Qunused-arguments -fPIC -fPIE -gdwarf-4 -Wall2024081120240808
9453514949 0 028286 804 1016opt64clang -march=native -Os -fwrapv -Qunused-arguments -fPIC -fPIE -gdwarf-4 -Wall2024081120240808
9473215004 0 030584 812 1016opt64clang -march=native -O2 -fwrapv -Qunused-arguments -fPIC -fPIE -gdwarf-4 -Wall2024081120240808
9483915006 0 031272 812 1016opt64clang -mcpu=native -O3 -fwrapv -Qunused-arguments -fPIC -fPIE -gdwarf-4 -Wall2024081120240808
9612522794 0 038720 812 1016refclang -mcpu=native -O3 -fwrapv -Qunused-arguments -fPIC -fPIE -gdwarf-4 -Wall2024081120240808
9612822677 0 038720 812 1016refclang -march=native -O3 -fwrapv -Qunused-arguments -fPIC -fPIE -gdwarf-4 -Wall2024081120240808
9650422661 0 037888 812 1016refclang -march=native -O2 -fwrapv -Qunused-arguments -fPIC -fPIE -gdwarf-4 -Wall2024081120240808
10243616273 0 030752 780 1080opt64gcc -march=native -mtune=native -O2 -fwrapv -fPIC -fPIE -gdwarf-4 -Wall2024081120240808
10252816257 0 031672 780 1080opt64gcc -march=native -mtune=native -O3 -fwrapv -fPIC -fPIE -gdwarf-4 -Wall2024081120240808
10402015944 0 028795 756 1048opt64gcc -march=native -mtune=native -Os -fwrapv -fPIC -fPIE -gdwarf-4 -Wall2024081120240808
10994818637 0 034056 780 1080refgcc -march=native -mtune=native -O3 -fwrapv -fPIC -fPIE -gdwarf-4 -Wall2024081120240808
11331019102 0 033151 772 1080opt64gcc -march=native -mtune=native -O -fwrapv -fPIC -fPIE -gdwarf-4 -Wall2024081120240808
1164741719 0 016216 780 1080opt64_lowsizegcc -march=native -mtune=native -O2 -fwrapv -fPIC -fPIE -gdwarf-4 -Wall2024081120240808
1175441607 0 014926 804 1016opt64_lowsizeclang -march=native -Os -fwrapv -Qunused-arguments -fPIC -fPIE -gdwarf-4 -Wall2024081120240808
1182361542 0 014347 756 1048opt64_lowsizegcc -march=native -mtune=native -Os -fwrapv -fPIC -fPIE -gdwarf-4 -Wall2024081120240808
1184012153 0 017576 780 1080opt64_lowsizegcc -march=native -mtune=native -O3 -fwrapv -fPIC -fPIE -gdwarf-4 -Wall2024081120240808
1185241761 0 017992 812 1016opt64_lowsizeclang -mcpu=native -O3 -fwrapv -Qunused-arguments -fPIC -fPIE -gdwarf-4 -Wall2024081120240808
1185801607 0 015486 804 1016opt64_lowsizeclang -march=native -O -fwrapv -Qunused-arguments -fPIC -fPIE -gdwarf-4 -Wall2024081120240808
1186531854 0 018232 812 1016opt64_lowsizeclang -march=native -O3 -fwrapv -Qunused-arguments -fPIC -fPIE -gdwarf-4 -Wall2024081120240808
1186571778 0 017352 812 1016opt64_lowsizeclang -march=native -O2 -fwrapv -Qunused-arguments -fPIC -fPIE -gdwarf-4 -Wall2024081120240808
12447017428 0 030678 804 1016refclang -march=native -Os -fwrapv -Qunused-arguments -fPIC -fPIE -gdwarf-4 -Wall2024081120240808
12486119784 0 033702 804 1016opt32clang -march=native -O -fwrapv -Qunused-arguments -fPIC -fPIE -gdwarf-4 -Wall2024081120240808
12491619588 0 035984 812 1016opt32clang -march=native -O3 -fwrapv -Qunused-arguments -fPIC -fPIE -gdwarf-4 -Wall2024081120240808
12491619590 0 035856 812 1016opt32clang -mcpu=native -O3 -fwrapv -Qunused-arguments -fPIC -fPIE -gdwarf-4 -Wall2024081120240808
12512319565 0 032902 804 1016opt32clang -march=native -Os -fwrapv -Qunused-arguments -fPIC -fPIE -gdwarf-4 -Wall2024081120240808
12543819588 0 035168 812 1016opt32clang -march=native -O2 -fwrapv -Qunused-arguments -fPIC -fPIE -gdwarf-4 -Wall2024081120240808
12745319385 0 032235 756 1048opt32gcc -march=native -mtune=native -Os -fwrapv -fPIC -fPIE -gdwarf-4 -Wall2024081120240808
12852020017 0 035432 780 1080opt32gcc -march=native -mtune=native -O3 -fwrapv -fPIC -fPIE -gdwarf-4 -Wall2024081120240808
12854520017 0 034496 780 1080opt32gcc -march=native -mtune=native -O2 -fwrapv -fPIC -fPIE -gdwarf-4 -Wall2024081120240808
12872310849 0 025344 780 1080refgcc -march=native -mtune=native -O2 -fwrapv -fPIC -fPIE -gdwarf-4 -Wall2024081120240808
13053210870 0 024943 772 1080refgcc -march=native -mtune=native -O -fwrapv -fPIC -fPIE -gdwarf-4 -Wall2024081120240808
1379131907 0 018296 812 1016opt32_lowsizeclang -march=native -O3 -fwrapv -Qunused-arguments -fPIC -fPIE -gdwarf-4 -Wall2024081120240808
1381732937 0 016967 772 1080opt64_lowsizegcc -march=native -mtune=native -O -fwrapv -fPIC -fPIE -gdwarf-4 -Wall2024081120240808
1385161831 0 017416 812 1016opt32_lowsizeclang -march=native -O2 -fwrapv -Qunused-arguments -fPIC -fPIE -gdwarf-4 -Wall2024081120240808
1435751660 0 015550 804 1016opt32_lowsizeclang -march=native -O -fwrapv -Qunused-arguments -fPIC -fPIE -gdwarf-4 -Wall2024081120240808
1436441814 0 018056 812 1016opt32_lowsizeclang -mcpu=native -O3 -fwrapv -Qunused-arguments -fPIC -fPIE -gdwarf-4 -Wall2024081120240808
14413523292 0 037343 772 1080opt32gcc -march=native -mtune=native -O -fwrapv -fPIC -fPIE -gdwarf-4 -Wall2024081120240808
1447551660 0 014974 804 1016opt32_lowsizeclang -march=native -Os -fwrapv -Qunused-arguments -fPIC -fPIE -gdwarf-4 -Wall2024081120240808
1475841605 0 014403 756 1048opt32_lowsizegcc -march=native -mtune=native -Os -fwrapv -fPIC -fPIE -gdwarf-4 -Wall2024081120240808
1481671779 0 016272 780 1080opt32_lowsizegcc -march=native -mtune=native -O2 -fwrapv -fPIC -fPIE -gdwarf-4 -Wall2024081120240808
1516682213 0 017632 780 1080opt32_lowsizegcc -march=native -mtune=native -O3 -fwrapv -fPIC -fPIE -gdwarf-4 -Wall2024081120240808
1640532999 0 017039 772 1080opt32_lowsizegcc -march=native -mtune=native -O -fwrapv -fPIC -fPIE -gdwarf-4 -Wall2024081120240808
1672582216 0 015107 756 1048refgcc -march=native -mtune=native -Os -fwrapv -fPIC -fPIE -gdwarf-4 -Wall2024081120240808
24529614657 0 027475 756 1048bi32gcc -march=native -mtune=native -Os -fwrapv -fPIC -fPIE -gdwarf-4 -Wall2024081120240808
24571514704 0 029176 780 1080bi32gcc -march=native -mtune=native -O2 -fwrapv -fPIC -fPIE -gdwarf-4 -Wall2024081120240808
24670314752 0 030152 780 1080bi32gcc -march=native -mtune=native -O3 -fwrapv -fPIC -fPIE -gdwarf-4 -Wall2024081120240808
26126317170 0 031207 772 1080bi32gcc -march=native -mtune=native -O -fwrapv -fPIC -fPIE -gdwarf-4 -Wall2024081120240808
2816108850 0 023424 780 1080bi32_lowreggcc -march=native -mtune=native -O2 -fwrapv -fPIC -fPIE -gdwarf-4 -Wall2024081120240808
2822778874 0 024376 780 1080bi32_lowreggcc -march=native -mtune=native -O3 -fwrapv -fPIC -fPIE -gdwarf-4 -Wall2024081120240808
28292315775 0 029670 804 1016bi32clang -march=native -O -fwrapv -Qunused-arguments -fPIC -fPIE -gdwarf-4 -Wall2024081120240808
28354615739 0 031288 812 1016bi32clang -march=native -O2 -fwrapv -Qunused-arguments -fPIC -fPIE -gdwarf-4 -Wall2024081120240808
28360715739 0 032104 812 1016bi32clang -march=native -O3 -fwrapv -Qunused-arguments -fPIC -fPIE -gdwarf-4 -Wall2024081120240808
28363315978 0 032184 812 1016bi32clang -mcpu=native -O3 -fwrapv -Qunused-arguments -fPIC -fPIE -gdwarf-4 -Wall2024081120240808
28494915810 0 029134 804 1016bi32clang -march=native -Os -fwrapv -Qunused-arguments -fPIC -fPIE -gdwarf-4 -Wall2024081120240808
2926652586 0 017088 780 1080bi32_lowsizegcc -march=native -mtune=native -O2 -fwrapv -fPIC -fPIE -gdwarf-4 -Wall2024081120240808
2939333151 0 018576 780 1080bi32_lowsizegcc -march=native -mtune=native -O3 -fwrapv -fPIC -fPIE -gdwarf-4 -Wall2024081120240808
2949288963 0 021883 756 1048bi32_lowreggcc -march=native -mtune=native -Os -fwrapv -fPIC -fPIE -gdwarf-4 -Wall2024081120240808
3047392375 0 015179 756 1048bi32_lowsizegcc -march=native -mtune=native -Os -fwrapv -fPIC -fPIE -gdwarf-4 -Wall2024081120240808
31471510704 0 024855 772 1080bi32_lowreggcc -march=native -mtune=native -O -fwrapv -fPIC -fPIE -gdwarf-4 -Wall2024081120240808
3257779576 0 025232 812 1016bi32_lowregclang -march=native -O2 -fwrapv -Qunused-arguments -fPIC -fPIE -gdwarf-4 -Wall2024081120240808
3261909612 0 025936 812 1016bi32_lowregclang -mcpu=native -O3 -fwrapv -Qunused-arguments -fPIC -fPIE -gdwarf-4 -Wall2024081120240808
3262339576 0 026048 812 1016bi32_lowregclang -march=native -O3 -fwrapv -Qunused-arguments -fPIC -fPIE -gdwarf-4 -Wall2024081120240808
3263942761 0 016807 772 1080bi32_lowsizegcc -march=native -mtune=native -O -fwrapv -fPIC -fPIE -gdwarf-4 -Wall2024081120240808
3265579475 0 022886 804 1016bi32_lowregclang -march=native -Os -fwrapv -Qunused-arguments -fPIC -fPIE -gdwarf-4 -Wall2024081120240808
3301782826 0 019072 812 1016bi32_lowsizeclang -mcpu=native -O3 -fwrapv -Qunused-arguments -fPIC -fPIE -gdwarf-4 -Wall2024081120240808
3310442770 0 018320 812 1016bi32_lowsizeclang -march=native -O2 -fwrapv -Qunused-arguments -fPIC -fPIE -gdwarf-4 -Wall2024081120240808
3313192856 0 019232 812 1016bi32_lowsizeclang -march=native -O3 -fwrapv -Qunused-arguments -fPIC -fPIE -gdwarf-4 -Wall2024081120240808
3320092622 0 015910 804 1016bi32_lowsizeclang -march=native -Os -fwrapv -Qunused-arguments -fPIC -fPIE -gdwarf-4 -Wall2024081120240808
3484479412 0 023398 804 1016bi32_lowregclang -march=native -O -fwrapv -Qunused-arguments -fPIC -fPIE -gdwarf-4 -Wall2024081120240808
3536482642 0 016534 804 1016bi32_lowsizeclang -march=native -O -fwrapv -Qunused-arguments -fPIC -fPIE -gdwarf-4 -Wall2024081120240808
3616182752 0 016726 804 1016refclang -march=native -O -fwrapv -Qunused-arguments -fPIC -fPIE -gdwarf-4 -Wall2024081120240808
5419464905 0 020496 812 1016opt8clang -march=native -O2 -fwrapv -Qunused-arguments -fPIC -fPIE -gdwarf-4 -Wall2024081120240808
5485435328 0 020928 812 1016opt8_lowsizeclang -march=native -O2 -fwrapv -Qunused-arguments -fPIC -fPIE -gdwarf-4 -Wall2024081120240808
5643472918 0 016270 804 1016opt8clang -march=native -Os -fwrapv -Qunused-arguments -fPIC -fPIE -gdwarf-4 -Wall2024081120240808
5681022979 0 016294 804 1016opt8_lowsizeclang -march=native -Os -fwrapv -Qunused-arguments -fPIC -fPIE -gdwarf-4 -Wall2024081120240808
8403629424 0 022230 804 1016bi8clang -march=native -Os -fwrapv -Qunused-arguments -fPIC -fPIE -gdwarf-4 -Wall2024081120240808
8444289584 0 025344 812 1016bi8clang -mcpu=native -O3 -fwrapv -Qunused-arguments -fPIC -fPIE -gdwarf-4 -Wall2024081120240808
8444499477 0 024544 812 1016bi8clang -march=native -O2 -fwrapv -Qunused-arguments -fPIC -fPIE -gdwarf-4 -Wall2024081120240808
8446269477 0 025360 812 1016bi8clang -march=native -O3 -fwrapv -Qunused-arguments -fPIC -fPIE -gdwarf-4 -Wall2024081120240808
85841110028 0 023582 804 1016bi8clang -march=native -O -fwrapv -Qunused-arguments -fPIC -fPIE -gdwarf-4 -Wall2024081120240808
8815726365 0 022648 812 1016opt8_lowsizeclang -mcpu=native -O3 -fwrapv -Qunused-arguments -fPIC -fPIE -gdwarf-4 -Wall2024081120240808
8837785765 0 022160 812 1016opt8clang -march=native -O3 -fwrapv -Qunused-arguments -fPIC -fPIE -gdwarf-4 -Wall2024081120240808
8839925732 0 022032 812 1016opt8clang -mcpu=native -O3 -fwrapv -Qunused-arguments -fPIC -fPIE -gdwarf-4 -Wall2024081120240808
8840016412 0 022816 812 1016opt8_lowsizeclang -march=native -O3 -fwrapv -Qunused-arguments -fPIC -fPIE -gdwarf-4 -Wall2024081120240808
104123710342 0 025368 780 1080bi8gcc -march=native -mtune=native -O3 -fwrapv -fPIC -fPIE -gdwarf-4 -Wall2024081120240808
11578083367 0 017318 804 1016opt8clang -march=native -O -fwrapv -Qunused-arguments -fPIC -fPIE -gdwarf-4 -Wall2024081120240808
11639603404 0 017334 804 1016opt8_lowsizeclang -march=native -O -fwrapv -Qunused-arguments -fPIC -fPIE -gdwarf-4 -Wall2024081120240808
130710612198 0 024667 756 1048bi8gcc -march=native -mtune=native -Os -fwrapv -fPIC -fPIE -gdwarf-4 -Wall2024081120240808
139502113616 0 027295 772 1080bi8gcc -march=native -mtune=native -O -fwrapv -fPIC -fPIE -gdwarf-4 -Wall2024081120240808
141982211020 0 025104 780 1080bi8gcc -march=native -mtune=native -O2 -fwrapv -fPIC -fPIE -gdwarf-4 -Wall2024081120240808
32200096729 0 022176 780 1080opt8gcc -march=native -mtune=native -O3 -fwrapv -fPIC -fPIE -gdwarf-4 -Wall2024081120240808
32219726649 0 022112 780 1080opt8_lowsizegcc -march=native -mtune=native -O3 -fwrapv -fPIC -fPIE -gdwarf-4 -Wall2024081120240808
33265365291 0 019808 780 1080opt8gcc -march=native -mtune=native -O2 -fwrapv -fPIC -fPIE -gdwarf-4 -Wall2024081120240808
33286405094 0 019616 780 1080opt8_lowsizegcc -march=native -mtune=native -O2 -fwrapv -fPIC -fPIE -gdwarf-4 -Wall2024081120240808
34715944944 0 017819 756 1048opt8gcc -march=native -mtune=native -Os -fwrapv -fPIC -fPIE -gdwarf-4 -Wall2024081120240808
34768164765 0 017603 756 1048opt8_lowsizegcc -march=native -mtune=native -Os -fwrapv -fPIC -fPIE -gdwarf-4 -Wall2024081120240808
35900135628 0 019711 772 1080opt8gcc -march=native -mtune=native -O -fwrapv -fPIC -fPIE -gdwarf-4 -Wall2024081120240808
35955595474 0 019559 772 1080opt8_lowsizegcc -march=native -mtune=native -O -fwrapv -fPIC -fPIE -gdwarf-4 -Wall2024081120240808

Compiler output


ascon.S: ascon.S:1:10: fatal error: 'xtensa/coreasm.h' file not found
ascon.S: #include <xtensa/coreasm.h>
ascon.S:          ^~~~~~~~~~~~~~~~~~
ascon.S: 1 error generated.

Number of similar (implementation,compiler) pairs: 5, namely:
ImplementationCompiler
T:asm_esp32clang -march=native -O2 -fwrapv -Qunused-arguments -fPIC -fPIE -gdwarf-4 -Wall (Debian_Clang_11.0.1)
T:asm_esp32clang -march=native -O3 -fwrapv -Qunused-arguments -fPIC -fPIE -gdwarf-4 -Wall (Debian_Clang_11.0.1)
T:asm_esp32clang -march=native -O -fwrapv -Qunused-arguments -fPIC -fPIE -gdwarf-4 -Wall (Debian_Clang_11.0.1)
T:asm_esp32clang -march=native -Os -fwrapv -Qunused-arguments -fPIC -fPIE -gdwarf-4 -Wall (Debian_Clang_11.0.1)
T:asm_esp32clang -mcpu=native -O3 -fwrapv -Qunused-arguments -fPIC -fPIE -gdwarf-4 -Wall (Debian_Clang_11.0.1)

Compiler output


ascon.S: ascon.S:1:10: fatal error: xtensa/coreasm.h: No such file or directory
ascon.S:     1 | #include <xtensa/coreasm.h>
ascon.S:       |          ^~~~~~~~~~~~~~~~~~
ascon.S: compilation terminated.

Number of similar (implementation,compiler) pairs: 4, namely:
ImplementationCompiler
T:asm_esp32gcc -march=native -mtune=native -O2 -fwrapv -fPIC -fPIE -gdwarf-4 -Wall (10.2.1_20210110)
T:asm_esp32gcc -march=native -mtune=native -O3 -fwrapv -fPIC -fPIE -gdwarf-4 -Wall (10.2.1_20210110)
T:asm_esp32gcc -march=native -mtune=native -O -fwrapv -fPIC -fPIE -gdwarf-4 -Wall (10.2.1_20210110)
T:asm_esp32gcc -march=native -mtune=native -Os -fwrapv -fPIC -fPIE -gdwarf-4 -Wall (10.2.1_20210110)

Compiler output


permutations.S: permutations.S:29:10: fatal error: 'avr/io.h' file not found
permutations.S: #include "avr/io.h"
permutations.S:          ^~~~~~~~~~
permutations.S: 1 error generated.

Number of similar (implementation,compiler) pairs: 10, namely:
ImplementationCompiler
avrclang -march=native -O2 -fwrapv -Qunused-arguments -fPIC -fPIE -gdwarf-4 -Wall (Debian_Clang_11.0.1)
avrclang -march=native -O3 -fwrapv -Qunused-arguments -fPIC -fPIE -gdwarf-4 -Wall (Debian_Clang_11.0.1)
avrclang -march=native -O -fwrapv -Qunused-arguments -fPIC -fPIE -gdwarf-4 -Wall (Debian_Clang_11.0.1)
avrclang -march=native -Os -fwrapv -Qunused-arguments -fPIC -fPIE -gdwarf-4 -Wall (Debian_Clang_11.0.1)
avrclang -mcpu=native -O3 -fwrapv -Qunused-arguments -fPIC -fPIE -gdwarf-4 -Wall (Debian_Clang_11.0.1)
avr_lowsizeclang -march=native -O2 -fwrapv -Qunused-arguments -fPIC -fPIE -gdwarf-4 -Wall (Debian_Clang_11.0.1)
avr_lowsizeclang -march=native -O3 -fwrapv -Qunused-arguments -fPIC -fPIE -gdwarf-4 -Wall (Debian_Clang_11.0.1)
avr_lowsizeclang -march=native -O -fwrapv -Qunused-arguments -fPIC -fPIE -gdwarf-4 -Wall (Debian_Clang_11.0.1)
avr_lowsizeclang -march=native -Os -fwrapv -Qunused-arguments -fPIC -fPIE -gdwarf-4 -Wall (Debian_Clang_11.0.1)
avr_lowsizeclang -mcpu=native -O3 -fwrapv -Qunused-arguments -fPIC -fPIE -gdwarf-4 -Wall (Debian_Clang_11.0.1)

Compiler output


aead.c: In file included from round.h:8,
aead.c:                  from permutations.h:11,
aead.c:                  from aead.c:5:
aead.c: word.h:61:11: warning: 'crypto_int64_bitmod_01' is static but used in inline function 'NOTZERO' which is not static
aead.c:    61 |   return (crypto_int64_bitmod_01(((int)(result & 0xff) - 1),8)) - 1;
aead.c:       |           ^~~~~~~~~~~~~~~~~~~~~~
permutations.S: permutations.S:29:10: fatal error: avr/io.h: No such file or directory
permutations.S:    29 | #include "avr/io.h"
permutations.S:       |          ^~~~~~~~~~
permutations.S: compilation terminated.

Number of similar (implementation,compiler) pairs: 4, namely:
ImplementationCompiler
avrgcc -march=native -mtune=native -O2 -fwrapv -fPIC -fPIE -gdwarf-4 -Wall (10.2.1_20210110)
avrgcc -march=native -mtune=native -O3 -fwrapv -fPIC -fPIE -gdwarf-4 -Wall (10.2.1_20210110)
avrgcc -march=native -mtune=native -O -fwrapv -fPIC -fPIE -gdwarf-4 -Wall (10.2.1_20210110)
avrgcc -march=native -mtune=native -Os -fwrapv -fPIC -fPIE -gdwarf-4 -Wall (10.2.1_20210110)

Compiler output


aead.c: In file included from round.h:8,
aead.c:                  from permutations.h:11,
aead.c:                  from aead.c:5:
aead.c: word.h:61:11: warning: 'crypto_int64_bitmod_01' is static but used in inline function 'NOTZERO' which is not static
aead.c:    61 |   return (crypto_int64_bitmod_01(((int)(result & 0xff) - 1),8)) - 1;
aead.c:       |           ^~~~~~~~~~~~~~~~~~~~~~
update.c: In file included from round.h:8,
update.c:                  from permutations.h:11,
update.c:                  from update.c:3:
update.c: word.h:61:11: warning: 'crypto_int64_bitmod_01' is static but used in inline function 'NOTZERO' which is not static
update.c:    61 |   return (crypto_int64_bitmod_01(((int)(result & 0xff) - 1),8)) - 1;
update.c:       |           ^~~~~~~~~~~~~~~~~~~~~~
permutations.S: permutations.S:29:10: fatal error: avr/io.h: No such file or directory
permutations.S:    29 | #include "avr/io.h"
permutations.S:       |          ^~~~~~~~~~
permutations.S: compilation terminated.

Number of similar (implementation,compiler) pairs: 4, namely:
ImplementationCompiler
avr_lowsizegcc -march=native -mtune=native -O2 -fwrapv -fPIC -fPIE -gdwarf-4 -Wall (10.2.1_20210110)
avr_lowsizegcc -march=native -mtune=native -O3 -fwrapv -fPIC -fPIE -gdwarf-4 -Wall (10.2.1_20210110)
avr_lowsizegcc -march=native -mtune=native -O -fwrapv -fPIC -fPIE -gdwarf-4 -Wall (10.2.1_20210110)
avr_lowsizegcc -march=native -mtune=native -Os -fwrapv -fPIC -fPIE -gdwarf-4 -Wall (10.2.1_20210110)

Compiler output


aead.c: In file included from round.h:8,
aead.c:                  from permutations.h:11,
aead.c:                  from aead.c:4:
aead.c: word.h:55:11: warning: 'crypto_int64_bitmod_01' is static but used in inline function 'NOTZERO' which is not static
aead.c:    55 |   return (crypto_int64_bitmod_01(((int)(result & 0xff) - 1),8)) - 1;
aead.c:       |           ^~~~~~~~~~~~~~~~~~~~~~
permutations.c: In file included from round.h:8,
permutations.c:                  from permutations.h:11,
permutations.c:                  from permutations.c:1:
permutations.c: word.h:55:11: warning: 'crypto_int64_bitmod_01' is static but used in inline function 'NOTZERO' which is not static
permutations.c:    55 |   return (crypto_int64_bitmod_01(((int)(result & 0xff) - 1),8)) - 1;
permutations.c:       |           ^~~~~~~~~~~~~~~~~~~~~~

Number of similar (implementation,compiler) pairs: 12, namely:
ImplementationCompiler
bi32gcc -march=native -mtune=native -O2 -fwrapv -fPIC -fPIE -gdwarf-4 -Wall (10.2.1_20210110)
bi32gcc -march=native -mtune=native -O3 -fwrapv -fPIC -fPIE -gdwarf-4 -Wall (10.2.1_20210110)
bi32gcc -march=native -mtune=native -O -fwrapv -fPIC -fPIE -gdwarf-4 -Wall (10.2.1_20210110)
bi32gcc -march=native -mtune=native -Os -fwrapv -fPIC -fPIE -gdwarf-4 -Wall (10.2.1_20210110)
bi32_lowreggcc -march=native -mtune=native -O2 -fwrapv -fPIC -fPIE -gdwarf-4 -Wall (10.2.1_20210110)
bi32_lowreggcc -march=native -mtune=native -O3 -fwrapv -fPIC -fPIE -gdwarf-4 -Wall (10.2.1_20210110)
bi32_lowreggcc -march=native -mtune=native -O -fwrapv -fPIC -fPIE -gdwarf-4 -Wall (10.2.1_20210110)
bi32_lowreggcc -march=native -mtune=native -Os -fwrapv -fPIC -fPIE -gdwarf-4 -Wall (10.2.1_20210110)
bi8gcc -march=native -mtune=native -O2 -fwrapv -fPIC -fPIE -gdwarf-4 -Wall (10.2.1_20210110)
bi8gcc -march=native -mtune=native -O3 -fwrapv -fPIC -fPIE -gdwarf-4 -Wall (10.2.1_20210110)
bi8gcc -march=native -mtune=native -O -fwrapv -fPIC -fPIE -gdwarf-4 -Wall (10.2.1_20210110)
bi8gcc -march=native -mtune=native -Os -fwrapv -fPIC -fPIE -gdwarf-4 -Wall (10.2.1_20210110)

Compiler output


update.c: update.c:21:13: warning: unused variable 'rate' [-Wunused-variable]
update.c:   const int rate = ASCON_AEAD_RATE;
update.c:             ^
update.c: 1 warning generated.

Number of similar (implementation,compiler) pairs: 15, namely:
ImplementationCompiler
bi32_lowsizeclang -march=native -O2 -fwrapv -Qunused-arguments -fPIC -fPIE -gdwarf-4 -Wall (Debian_Clang_11.0.1)
bi32_lowsizeclang -march=native -O3 -fwrapv -Qunused-arguments -fPIC -fPIE -gdwarf-4 -Wall (Debian_Clang_11.0.1)
bi32_lowsizeclang -march=native -O -fwrapv -Qunused-arguments -fPIC -fPIE -gdwarf-4 -Wall (Debian_Clang_11.0.1)
bi32_lowsizeclang -march=native -Os -fwrapv -Qunused-arguments -fPIC -fPIE -gdwarf-4 -Wall (Debian_Clang_11.0.1)
bi32_lowsizeclang -mcpu=native -O3 -fwrapv -Qunused-arguments -fPIC -fPIE -gdwarf-4 -Wall (Debian_Clang_11.0.1)
opt32_lowsizeclang -march=native -O2 -fwrapv -Qunused-arguments -fPIC -fPIE -gdwarf-4 -Wall (Debian_Clang_11.0.1)
opt32_lowsizeclang -march=native -O3 -fwrapv -Qunused-arguments -fPIC -fPIE -gdwarf-4 -Wall (Debian_Clang_11.0.1)
opt32_lowsizeclang -march=native -O -fwrapv -Qunused-arguments -fPIC -fPIE -gdwarf-4 -Wall (Debian_Clang_11.0.1)
opt32_lowsizeclang -march=native -Os -fwrapv -Qunused-arguments -fPIC -fPIE -gdwarf-4 -Wall (Debian_Clang_11.0.1)
opt32_lowsizeclang -mcpu=native -O3 -fwrapv -Qunused-arguments -fPIC -fPIE -gdwarf-4 -Wall (Debian_Clang_11.0.1)
opt64_lowsizeclang -march=native -O2 -fwrapv -Qunused-arguments -fPIC -fPIE -gdwarf-4 -Wall (Debian_Clang_11.0.1)
opt64_lowsizeclang -march=native -O3 -fwrapv -Qunused-arguments -fPIC -fPIE -gdwarf-4 -Wall (Debian_Clang_11.0.1)
opt64_lowsizeclang -march=native -O -fwrapv -Qunused-arguments -fPIC -fPIE -gdwarf-4 -Wall (Debian_Clang_11.0.1)
opt64_lowsizeclang -march=native -Os -fwrapv -Qunused-arguments -fPIC -fPIE -gdwarf-4 -Wall (Debian_Clang_11.0.1)
opt64_lowsizeclang -mcpu=native -O3 -fwrapv -Qunused-arguments -fPIC -fPIE -gdwarf-4 -Wall (Debian_Clang_11.0.1)

Compiler output


aead.c: In file included from round.h:8,
aead.c:                  from permutations.h:11,
aead.c:                  from aead.c:3:
aead.c: word.h:55:11: warning: 'crypto_int64_bitmod_01' is static but used in inline function 'NOTZERO' which is not static
aead.c:    55 |   return (crypto_int64_bitmod_01(((int)(result & 0xff) - 1),8)) - 1;
aead.c:       |           ^~~~~~~~~~~~~~~~~~~~~~
crypto_aead.c: In file included from round.h:8,
crypto_aead.c:                  from permutations.h:11,
crypto_aead.c:                  from crypto_aead.c:8:
crypto_aead.c: word.h:55:11: warning: 'crypto_int64_bitmod_01' is static but used in inline function 'NOTZERO' which is not static
crypto_aead.c:    55 |   return (crypto_int64_bitmod_01(((int)(result & 0xff) - 1),8)) - 1;
crypto_aead.c:       |           ^~~~~~~~~~~~~~~~~~~~~~
permutations.c: In file included from round.h:8,
permutations.c:                  from permutations.h:11,
permutations.c:                  from permutations.c:1:
permutations.c: word.h:55:11: warning: 'crypto_int64_bitmod_01' is static but used in inline function 'NOTZERO' which is not static
permutations.c:    55 |   return (crypto_int64_bitmod_01(((int)(result & 0xff) - 1),8)) - 1;
permutations.c:       |           ^~~~~~~~~~~~~~~~~~~~~~
update.c: update.c: In function 'ascon_update':
update.c: update.c:21:13: warning: unused variable 'rate' [-Wunused-variable]
update.c:    21 |   const int rate = ASCON_AEAD_RATE;
update.c:       |             ^~~~
update.c: In file included from round.h:8,
update.c:                  from permutations.h:11,
update.c:                  from update.c:3:
update.c: update.c: At top level:
update.c: word.h:55:11: warning: 'crypto_int64_bitmod_01' is static but used in inline function 'NOTZERO' which is not static
update.c:    55 |   return (crypto_int64_bitmod_01(((int)(result & 0xff) - 1),8)) - 1;
update.c:       |           ^~~~~~~~~~~~~~~~~~~~~~

Number of similar (implementation,compiler) pairs: 4, namely:
ImplementationCompiler
bi32_lowsizegcc -march=native -mtune=native -O2 -fwrapv -fPIC -fPIE -gdwarf-4 -Wall (10.2.1_20210110)
bi32_lowsizegcc -march=native -mtune=native -O3 -fwrapv -fPIC -fPIE -gdwarf-4 -Wall (10.2.1_20210110)
bi32_lowsizegcc -march=native -mtune=native -O -fwrapv -fPIC -fPIE -gdwarf-4 -Wall (10.2.1_20210110)
bi32_lowsizegcc -march=native -mtune=native -Os -fwrapv -fPIC -fPIE -gdwarf-4 -Wall (10.2.1_20210110)

Compiler output


try.c: /usr/bin/ld: /tmp/try-small-061c46.o: in function `doit':
try.c: .../supercop-data/wolfdale/amd64/try/c/clang_-march=native_-O2_-fwrapv_-Qunused-arguments_-fPIC_-fPIE_-gdwarf-4_-Wall/timingleaks/crypto_aead/ascon80pqv12/esp32/work/./try.c:133: undefined reference to `crypto_aead_ascon80pqv12_esp32_timingleaks_encrypt'
try.c: /usr/bin/ld: .../supercop-data/wolfdale/amd64/try/c/clang_-march=native_-O2_-fwrapv_-Qunused-arguments_-fPIC_-fPIE_-gdwarf-4_-Wall/timingleaks/crypto_aead/ascon80pqv12/esp32/work/./try.c:135: undefined reference to `crypto_aead_ascon80pqv12_esp32_timingleaks_decrypt'
try.c: /usr/bin/ld: /tmp/try-small-061c46.o: in function `test':
try.c: .../supercop-data/wolfdale/amd64/try/c/clang_-march=native_-O2_-fwrapv_-Qunused-arguments_-fPIC_-fPIE_-gdwarf-4_-Wall/timingleaks/crypto_aead/ascon80pqv12/esp32/work/./try.c:159: undefined reference to `crypto_aead_ascon80pqv12_esp32_timingleaks_encrypt'
try.c: /usr/bin/ld: .../supercop-data/wolfdale/amd64/try/c/clang_-march=native_-O2_-fwrapv_-Qunused-arguments_-fPIC_-fPIE_-gdwarf-4_-Wall/timingleaks/crypto_aead/ascon80pqv12/esp32/work/./try.c:189: undefined reference to `crypto_aead_ascon80pqv12_esp32_timingleaks_encrypt'
try.c: /usr/bin/ld: .../supercop-data/wolfdale/amd64/try/c/clang_-march=native_-O2_-fwrapv_-Qunused-arguments_-fPIC_-fPIE_-gdwarf-4_-Wall/timingleaks/crypto_aead/ascon80pqv12/esp32/work/./try.c:300: undefined reference to `crypto_aead_ascon80pqv12_esp32_timingleaks_decrypt'
try.c: /usr/bin/ld: .../supercop-data/wolfdale/amd64/try/c/clang_-march=native_-O2_-fwrapv_-Qunused-arguments_-fPIC_-fPIE_-gdwarf-4_-Wall/timingleaks/crypto_aead/ascon80pqv12/esp32/work/./try.c:331: undefined reference to `crypto_aead_ascon80pqv12_esp32_timingleaks_decrypt'
try.c: /usr/bin/ld: .../supercop-data/wolfdale/amd64/try/c/clang_-march=native_-O2_-fwrapv_-Qunused-arguments_-fPIC_-fPIE_-gdwarf-4_-Wall/timingleaks/crypto_aead/ascon80pqv12/esp32/work/./try.c:476: undefined reference to `crypto_aead_ascon80pqv12_esp32_timingleaks_decrypt'
try.c: /usr/bin/ld: .../supercop-data/wolfdale/amd64/try/c/clang_-march=native_-O2_-fwrapv_-Qunused-arguments_-fPIC_-fPIE_-gdwarf-4_-Wall/timingleaks/crypto_aead/ascon80pqv12/esp32/work/./try.c:480: undefined reference to `crypto_aead_ascon80pqv12_esp32_timingleaks_decrypt'
try.c: /usr/bin/ld: .../supercop-data/wolfdale/amd64/try/c/clang_-march=native_-O2_-fwrapv_-Qunused-arguments_-fPIC_-fPIE_-gdwarf-4_-Wall/timingleaks/crypto_aead/ascon80pqv12/esp32/work/./try.c:484: undefined reference to `crypto_aead_ascon80pqv12_esp32_timingleaks_decrypt'
try.c: clang: error: linker command failed with exit code 1 (use -v to see invocation)

Number of similar (implementation,compiler) pairs: 1, namely:
ImplementationCompiler
T:esp32clang -march=native -O2 -fwrapv -Qunused-arguments -fPIC -fPIE -gdwarf-4 -Wall (Debian_Clang_11.0.1)

Compiler output


try.c: /usr/bin/ld: /tmp/try-small-14e85a.o: in function `doit':
try.c: .../supercop-data/wolfdale/amd64/try/c/clang_-march=native_-O3_-fwrapv_-Qunused-arguments_-fPIC_-fPIE_-gdwarf-4_-Wall/timingleaks/crypto_aead/ascon80pqv12/esp32/work/./try.c:133: undefined reference to `crypto_aead_ascon80pqv12_esp32_timingleaks_encrypt'
try.c: /usr/bin/ld: .../supercop-data/wolfdale/amd64/try/c/clang_-march=native_-O3_-fwrapv_-Qunused-arguments_-fPIC_-fPIE_-gdwarf-4_-Wall/timingleaks/crypto_aead/ascon80pqv12/esp32/work/./try.c:135: undefined reference to `crypto_aead_ascon80pqv12_esp32_timingleaks_decrypt'
try.c: /usr/bin/ld: /tmp/try-small-14e85a.o: in function `test':
try.c: .../supercop-data/wolfdale/amd64/try/c/clang_-march=native_-O3_-fwrapv_-Qunused-arguments_-fPIC_-fPIE_-gdwarf-4_-Wall/timingleaks/crypto_aead/ascon80pqv12/esp32/work/./try.c:159: undefined reference to `crypto_aead_ascon80pqv12_esp32_timingleaks_encrypt'
try.c: /usr/bin/ld: .../supercop-data/wolfdale/amd64/try/c/clang_-march=native_-O3_-fwrapv_-Qunused-arguments_-fPIC_-fPIE_-gdwarf-4_-Wall/timingleaks/crypto_aead/ascon80pqv12/esp32/work/./try.c:189: undefined reference to `crypto_aead_ascon80pqv12_esp32_timingleaks_encrypt'
try.c: /usr/bin/ld: .../supercop-data/wolfdale/amd64/try/c/clang_-march=native_-O3_-fwrapv_-Qunused-arguments_-fPIC_-fPIE_-gdwarf-4_-Wall/timingleaks/crypto_aead/ascon80pqv12/esp32/work/./try.c:300: undefined reference to `crypto_aead_ascon80pqv12_esp32_timingleaks_decrypt'
try.c: /usr/bin/ld: .../supercop-data/wolfdale/amd64/try/c/clang_-march=native_-O3_-fwrapv_-Qunused-arguments_-fPIC_-fPIE_-gdwarf-4_-Wall/timingleaks/crypto_aead/ascon80pqv12/esp32/work/./try.c:331: undefined reference to `crypto_aead_ascon80pqv12_esp32_timingleaks_decrypt'
try.c: /usr/bin/ld: .../supercop-data/wolfdale/amd64/try/c/clang_-march=native_-O3_-fwrapv_-Qunused-arguments_-fPIC_-fPIE_-gdwarf-4_-Wall/timingleaks/crypto_aead/ascon80pqv12/esp32/work/./try.c:476: undefined reference to `crypto_aead_ascon80pqv12_esp32_timingleaks_decrypt'
try.c: /usr/bin/ld: .../supercop-data/wolfdale/amd64/try/c/clang_-march=native_-O3_-fwrapv_-Qunused-arguments_-fPIC_-fPIE_-gdwarf-4_-Wall/timingleaks/crypto_aead/ascon80pqv12/esp32/work/./try.c:480: undefined reference to `crypto_aead_ascon80pqv12_esp32_timingleaks_decrypt'
try.c: /usr/bin/ld: .../supercop-data/wolfdale/amd64/try/c/clang_-march=native_-O3_-fwrapv_-Qunused-arguments_-fPIC_-fPIE_-gdwarf-4_-Wall/timingleaks/crypto_aead/ascon80pqv12/esp32/work/./try.c:484: undefined reference to `crypto_aead_ascon80pqv12_esp32_timingleaks_decrypt'
try.c: clang: error: linker command failed with exit code 1 (use -v to see invocation)

Number of similar (implementation,compiler) pairs: 1, namely:
ImplementationCompiler
T:esp32clang -march=native -O3 -fwrapv -Qunused-arguments -fPIC -fPIE -gdwarf-4 -Wall (Debian_Clang_11.0.1)

Compiler output


try.c: /usr/bin/ld: /tmp/try-small-603d2b.o: in function `doit':
try.c: .../supercop-data/wolfdale/amd64/try/c/clang_-march=native_-O_-fwrapv_-Qunused-arguments_-fPIC_-fPIE_-gdwarf-4_-Wall/timingleaks/crypto_aead/ascon80pqv12/esp32/work/./try.c:133: undefined reference to `crypto_aead_ascon80pqv12_esp32_timingleaks_encrypt'
try.c: /usr/bin/ld: .../supercop-data/wolfdale/amd64/try/c/clang_-march=native_-O_-fwrapv_-Qunused-arguments_-fPIC_-fPIE_-gdwarf-4_-Wall/timingleaks/crypto_aead/ascon80pqv12/esp32/work/./try.c:135: undefined reference to `crypto_aead_ascon80pqv12_esp32_timingleaks_decrypt'
try.c: /usr/bin/ld: /tmp/try-small-603d2b.o: in function `test':
try.c: .../supercop-data/wolfdale/amd64/try/c/clang_-march=native_-O_-fwrapv_-Qunused-arguments_-fPIC_-fPIE_-gdwarf-4_-Wall/timingleaks/crypto_aead/ascon80pqv12/esp32/work/./try.c:159: undefined reference to `crypto_aead_ascon80pqv12_esp32_timingleaks_encrypt'
try.c: /usr/bin/ld: .../supercop-data/wolfdale/amd64/try/c/clang_-march=native_-O_-fwrapv_-Qunused-arguments_-fPIC_-fPIE_-gdwarf-4_-Wall/timingleaks/crypto_aead/ascon80pqv12/esp32/work/./try.c:189: undefined reference to `crypto_aead_ascon80pqv12_esp32_timingleaks_encrypt'
try.c: /usr/bin/ld: .../supercop-data/wolfdale/amd64/try/c/clang_-march=native_-O_-fwrapv_-Qunused-arguments_-fPIC_-fPIE_-gdwarf-4_-Wall/timingleaks/crypto_aead/ascon80pqv12/esp32/work/./try.c:300: undefined reference to `crypto_aead_ascon80pqv12_esp32_timingleaks_decrypt'
try.c: /usr/bin/ld: .../supercop-data/wolfdale/amd64/try/c/clang_-march=native_-O_-fwrapv_-Qunused-arguments_-fPIC_-fPIE_-gdwarf-4_-Wall/timingleaks/crypto_aead/ascon80pqv12/esp32/work/./try.c:331: undefined reference to `crypto_aead_ascon80pqv12_esp32_timingleaks_decrypt'
try.c: /usr/bin/ld: .../supercop-data/wolfdale/amd64/try/c/clang_-march=native_-O_-fwrapv_-Qunused-arguments_-fPIC_-fPIE_-gdwarf-4_-Wall/timingleaks/crypto_aead/ascon80pqv12/esp32/work/./try.c:476: undefined reference to `crypto_aead_ascon80pqv12_esp32_timingleaks_decrypt'
try.c: /usr/bin/ld: .../supercop-data/wolfdale/amd64/try/c/clang_-march=native_-O_-fwrapv_-Qunused-arguments_-fPIC_-fPIE_-gdwarf-4_-Wall/timingleaks/crypto_aead/ascon80pqv12/esp32/work/./try.c:480: undefined reference to `crypto_aead_ascon80pqv12_esp32_timingleaks_decrypt'
try.c: /usr/bin/ld: .../supercop-data/wolfdale/amd64/try/c/clang_-march=native_-O_-fwrapv_-Qunused-arguments_-fPIC_-fPIE_-gdwarf-4_-Wall/timingleaks/crypto_aead/ascon80pqv12/esp32/work/./try.c:484: undefined reference to `crypto_aead_ascon80pqv12_esp32_timingleaks_decrypt'
try.c: clang: error: linker command failed with exit code 1 (use -v to see invocation)

Number of similar (implementation,compiler) pairs: 1, namely:
ImplementationCompiler
T:esp32clang -march=native -O -fwrapv -Qunused-arguments -fPIC -fPIE -gdwarf-4 -Wall (Debian_Clang_11.0.1)

Compiler output


try.c: /usr/bin/ld: /tmp/try-small-a71528.o: in function `doit':
try.c: .../supercop-data/wolfdale/amd64/try/c/clang_-march=native_-Os_-fwrapv_-Qunused-arguments_-fPIC_-fPIE_-gdwarf-4_-Wall/timingleaks/crypto_aead/ascon80pqv12/esp32/work/./try.c:133: undefined reference to `crypto_aead_ascon80pqv12_esp32_timingleaks_encrypt'
try.c: /usr/bin/ld: .../supercop-data/wolfdale/amd64/try/c/clang_-march=native_-Os_-fwrapv_-Qunused-arguments_-fPIC_-fPIE_-gdwarf-4_-Wall/timingleaks/crypto_aead/ascon80pqv12/esp32/work/./try.c:135: undefined reference to `crypto_aead_ascon80pqv12_esp32_timingleaks_decrypt'
try.c: /usr/bin/ld: /tmp/try-small-a71528.o: in function `test':
try.c: .../supercop-data/wolfdale/amd64/try/c/clang_-march=native_-Os_-fwrapv_-Qunused-arguments_-fPIC_-fPIE_-gdwarf-4_-Wall/timingleaks/crypto_aead/ascon80pqv12/esp32/work/./try.c:159: undefined reference to `crypto_aead_ascon80pqv12_esp32_timingleaks_encrypt'
try.c: /usr/bin/ld: .../supercop-data/wolfdale/amd64/try/c/clang_-march=native_-Os_-fwrapv_-Qunused-arguments_-fPIC_-fPIE_-gdwarf-4_-Wall/timingleaks/crypto_aead/ascon80pqv12/esp32/work/./try.c:189: undefined reference to `crypto_aead_ascon80pqv12_esp32_timingleaks_encrypt'
try.c: /usr/bin/ld: .../supercop-data/wolfdale/amd64/try/c/clang_-march=native_-Os_-fwrapv_-Qunused-arguments_-fPIC_-fPIE_-gdwarf-4_-Wall/timingleaks/crypto_aead/ascon80pqv12/esp32/work/./try.c:300: undefined reference to `crypto_aead_ascon80pqv12_esp32_timingleaks_decrypt'
try.c: /usr/bin/ld: .../supercop-data/wolfdale/amd64/try/c/clang_-march=native_-Os_-fwrapv_-Qunused-arguments_-fPIC_-fPIE_-gdwarf-4_-Wall/timingleaks/crypto_aead/ascon80pqv12/esp32/work/./try.c:331: undefined reference to `crypto_aead_ascon80pqv12_esp32_timingleaks_decrypt'
try.c: /usr/bin/ld: .../supercop-data/wolfdale/amd64/try/c/clang_-march=native_-Os_-fwrapv_-Qunused-arguments_-fPIC_-fPIE_-gdwarf-4_-Wall/timingleaks/crypto_aead/ascon80pqv12/esp32/work/./try.c:476: undefined reference to `crypto_aead_ascon80pqv12_esp32_timingleaks_decrypt'
try.c: /usr/bin/ld: .../supercop-data/wolfdale/amd64/try/c/clang_-march=native_-Os_-fwrapv_-Qunused-arguments_-fPIC_-fPIE_-gdwarf-4_-Wall/timingleaks/crypto_aead/ascon80pqv12/esp32/work/./try.c:480: undefined reference to `crypto_aead_ascon80pqv12_esp32_timingleaks_decrypt'
try.c: /usr/bin/ld: .../supercop-data/wolfdale/amd64/try/c/clang_-march=native_-Os_-fwrapv_-Qunused-arguments_-fPIC_-fPIE_-gdwarf-4_-Wall/timingleaks/crypto_aead/ascon80pqv12/esp32/work/./try.c:484: undefined reference to `crypto_aead_ascon80pqv12_esp32_timingleaks_decrypt'
try.c: clang: error: linker command failed with exit code 1 (use -v to see invocation)

Number of similar (implementation,compiler) pairs: 1, namely:
ImplementationCompiler
T:esp32clang -march=native -Os -fwrapv -Qunused-arguments -fPIC -fPIE -gdwarf-4 -Wall (Debian_Clang_11.0.1)

Compiler output


try.c: /usr/bin/ld: /tmp/try-small-72b1c4.o: in function `doit':
try.c: .../supercop-data/wolfdale/amd64/try/c/clang_-mcpu=native_-O3_-fwrapv_-Qunused-arguments_-fPIC_-fPIE_-gdwarf-4_-Wall/timingleaks/crypto_aead/ascon80pqv12/esp32/work/./try.c:133: undefined reference to `crypto_aead_ascon80pqv12_esp32_timingleaks_encrypt'
try.c: /usr/bin/ld: .../supercop-data/wolfdale/amd64/try/c/clang_-mcpu=native_-O3_-fwrapv_-Qunused-arguments_-fPIC_-fPIE_-gdwarf-4_-Wall/timingleaks/crypto_aead/ascon80pqv12/esp32/work/./try.c:135: undefined reference to `crypto_aead_ascon80pqv12_esp32_timingleaks_decrypt'
try.c: /usr/bin/ld: /tmp/try-small-72b1c4.o: in function `test':
try.c: .../supercop-data/wolfdale/amd64/try/c/clang_-mcpu=native_-O3_-fwrapv_-Qunused-arguments_-fPIC_-fPIE_-gdwarf-4_-Wall/timingleaks/crypto_aead/ascon80pqv12/esp32/work/./try.c:159: undefined reference to `crypto_aead_ascon80pqv12_esp32_timingleaks_encrypt'
try.c: /usr/bin/ld: .../supercop-data/wolfdale/amd64/try/c/clang_-mcpu=native_-O3_-fwrapv_-Qunused-arguments_-fPIC_-fPIE_-gdwarf-4_-Wall/timingleaks/crypto_aead/ascon80pqv12/esp32/work/./try.c:189: undefined reference to `crypto_aead_ascon80pqv12_esp32_timingleaks_encrypt'
try.c: /usr/bin/ld: .../supercop-data/wolfdale/amd64/try/c/clang_-mcpu=native_-O3_-fwrapv_-Qunused-arguments_-fPIC_-fPIE_-gdwarf-4_-Wall/timingleaks/crypto_aead/ascon80pqv12/esp32/work/./try.c:300: undefined reference to `crypto_aead_ascon80pqv12_esp32_timingleaks_decrypt'
try.c: /usr/bin/ld: .../supercop-data/wolfdale/amd64/try/c/clang_-mcpu=native_-O3_-fwrapv_-Qunused-arguments_-fPIC_-fPIE_-gdwarf-4_-Wall/timingleaks/crypto_aead/ascon80pqv12/esp32/work/./try.c:331: undefined reference to `crypto_aead_ascon80pqv12_esp32_timingleaks_decrypt'
try.c: /usr/bin/ld: .../supercop-data/wolfdale/amd64/try/c/clang_-mcpu=native_-O3_-fwrapv_-Qunused-arguments_-fPIC_-fPIE_-gdwarf-4_-Wall/timingleaks/crypto_aead/ascon80pqv12/esp32/work/./try.c:476: undefined reference to `crypto_aead_ascon80pqv12_esp32_timingleaks_decrypt'
try.c: /usr/bin/ld: .../supercop-data/wolfdale/amd64/try/c/clang_-mcpu=native_-O3_-fwrapv_-Qunused-arguments_-fPIC_-fPIE_-gdwarf-4_-Wall/timingleaks/crypto_aead/ascon80pqv12/esp32/work/./try.c:480: undefined reference to `crypto_aead_ascon80pqv12_esp32_timingleaks_decrypt'
try.c: /usr/bin/ld: .../supercop-data/wolfdale/amd64/try/c/clang_-mcpu=native_-O3_-fwrapv_-Qunused-arguments_-fPIC_-fPIE_-gdwarf-4_-Wall/timingleaks/crypto_aead/ascon80pqv12/esp32/work/./try.c:484: undefined reference to `crypto_aead_ascon80pqv12_esp32_timingleaks_decrypt'
try.c: clang: error: linker command failed with exit code 1 (use -v to see invocation)

Number of similar (implementation,compiler) pairs: 1, namely:
ImplementationCompiler
T:esp32clang -mcpu=native -O3 -fwrapv -Qunused-arguments -fPIC -fPIE -gdwarf-4 -Wall (Debian_Clang_11.0.1)

Compiler output


try.c: /usr/bin/ld: /tmp/ccFQrZlG.o: in function `doit':
try.c: .../supercop-data/wolfdale/amd64/try/c/gcc_-march=native_-mtune=native_-O2_-fwrapv_-fPIC_-fPIE_-gdwarf-4_-Wall/timingleaks/crypto_aead/ascon80pqv12/esp32/work/try.c:133: undefined reference to `crypto_aead_ascon80pqv12_esp32_timingleaks_encrypt'
try.c: /usr/bin/ld: .../supercop-data/wolfdale/amd64/try/c/gcc_-march=native_-mtune=native_-O2_-fwrapv_-fPIC_-fPIE_-gdwarf-4_-Wall/timingleaks/crypto_aead/ascon80pqv12/esp32/work/try.c:135: undefined reference to `crypto_aead_ascon80pqv12_esp32_timingleaks_decrypt'
try.c: /usr/bin/ld: /tmp/ccFQrZlG.o: in function `test':
try.c: .../supercop-data/wolfdale/amd64/try/c/gcc_-march=native_-mtune=native_-O2_-fwrapv_-fPIC_-fPIE_-gdwarf-4_-Wall/timingleaks/crypto_aead/ascon80pqv12/esp32/work/try.c:189: undefined reference to `crypto_aead_ascon80pqv12_esp32_timingleaks_encrypt'
try.c: /usr/bin/ld: .../supercop-data/wolfdale/amd64/try/c/gcc_-march=native_-mtune=native_-O2_-fwrapv_-fPIC_-fPIE_-gdwarf-4_-Wall/timingleaks/crypto_aead/ascon80pqv12/esp32/work/try.c:300: undefined reference to `crypto_aead_ascon80pqv12_esp32_timingleaks_decrypt'
try.c: /usr/bin/ld: .../supercop-data/wolfdale/amd64/try/c/gcc_-march=native_-mtune=native_-O2_-fwrapv_-fPIC_-fPIE_-gdwarf-4_-Wall/timingleaks/crypto_aead/ascon80pqv12/esp32/work/try.c:331: undefined reference to `crypto_aead_ascon80pqv12_esp32_timingleaks_decrypt'
try.c: /usr/bin/ld: .../supercop-data/wolfdale/amd64/try/c/gcc_-march=native_-mtune=native_-O2_-fwrapv_-fPIC_-fPIE_-gdwarf-4_-Wall/timingleaks/crypto_aead/ascon80pqv12/esp32/work/try.c:476: undefined reference to `crypto_aead_ascon80pqv12_esp32_timingleaks_decrypt'
try.c: /usr/bin/ld: .../supercop-data/wolfdale/amd64/try/c/gcc_-march=native_-mtune=native_-O2_-fwrapv_-fPIC_-fPIE_-gdwarf-4_-Wall/timingleaks/crypto_aead/ascon80pqv12/esp32/work/try.c:480: undefined reference to `crypto_aead_ascon80pqv12_esp32_timingleaks_decrypt'
try.c: /usr/bin/ld: .../supercop-data/wolfdale/amd64/try/c/gcc_-march=native_-mtune=native_-O2_-fwrapv_-fPIC_-fPIE_-gdwarf-4_-Wall/timingleaks/crypto_aead/ascon80pqv12/esp32/work/try.c:484: undefined reference to `crypto_aead_ascon80pqv12_esp32_timingleaks_decrypt'
try.c: /usr/bin/ld: .../supercop-data/wolfdale/amd64/try/c/gcc_-march=native_-mtune=native_-O2_-fwrapv_-fPIC_-fPIE_-gdwarf-4_-Wall/timingleaks/crypto_aead/ascon80pqv12/esp32/work/try.c:159: undefined reference to `crypto_aead_ascon80pqv12_esp32_timingleaks_encrypt'
try.c: collect2: error: ld returned 1 exit status

Number of similar (implementation,compiler) pairs: 1, namely:
ImplementationCompiler
T:esp32gcc -march=native -mtune=native -O2 -fwrapv -fPIC -fPIE -gdwarf-4 -Wall (10.2.1_20210110)

Compiler output


try.c: /usr/bin/ld: /tmp/ccyXD3fH.o: in function `doit':
try.c: .../supercop-data/wolfdale/amd64/try/c/gcc_-march=native_-mtune=native_-O3_-fwrapv_-fPIC_-fPIE_-gdwarf-4_-Wall/timingleaks/crypto_aead/ascon80pqv12/esp32/work/try.c:133: undefined reference to `crypto_aead_ascon80pqv12_esp32_timingleaks_encrypt'
try.c: /usr/bin/ld: .../supercop-data/wolfdale/amd64/try/c/gcc_-march=native_-mtune=native_-O3_-fwrapv_-fPIC_-fPIE_-gdwarf-4_-Wall/timingleaks/crypto_aead/ascon80pqv12/esp32/work/try.c:135: undefined reference to `crypto_aead_ascon80pqv12_esp32_timingleaks_decrypt'
try.c: /usr/bin/ld: /tmp/ccyXD3fH.o: in function `test':
try.c: .../supercop-data/wolfdale/amd64/try/c/gcc_-march=native_-mtune=native_-O3_-fwrapv_-fPIC_-fPIE_-gdwarf-4_-Wall/timingleaks/crypto_aead/ascon80pqv12/esp32/work/try.c:189: undefined reference to `crypto_aead_ascon80pqv12_esp32_timingleaks_encrypt'
try.c: /usr/bin/ld: .../supercop-data/wolfdale/amd64/try/c/gcc_-march=native_-mtune=native_-O3_-fwrapv_-fPIC_-fPIE_-gdwarf-4_-Wall/timingleaks/crypto_aead/ascon80pqv12/esp32/work/try.c:300: undefined reference to `crypto_aead_ascon80pqv12_esp32_timingleaks_decrypt'
try.c: /usr/bin/ld: .../supercop-data/wolfdale/amd64/try/c/gcc_-march=native_-mtune=native_-O3_-fwrapv_-fPIC_-fPIE_-gdwarf-4_-Wall/timingleaks/crypto_aead/ascon80pqv12/esp32/work/try.c:331: undefined reference to `crypto_aead_ascon80pqv12_esp32_timingleaks_decrypt'
try.c: /usr/bin/ld: .../supercop-data/wolfdale/amd64/try/c/gcc_-march=native_-mtune=native_-O3_-fwrapv_-fPIC_-fPIE_-gdwarf-4_-Wall/timingleaks/crypto_aead/ascon80pqv12/esp32/work/try.c:476: undefined reference to `crypto_aead_ascon80pqv12_esp32_timingleaks_decrypt'
try.c: /usr/bin/ld: .../supercop-data/wolfdale/amd64/try/c/gcc_-march=native_-mtune=native_-O3_-fwrapv_-fPIC_-fPIE_-gdwarf-4_-Wall/timingleaks/crypto_aead/ascon80pqv12/esp32/work/try.c:480: undefined reference to `crypto_aead_ascon80pqv12_esp32_timingleaks_decrypt'
try.c: /usr/bin/ld: .../supercop-data/wolfdale/amd64/try/c/gcc_-march=native_-mtune=native_-O3_-fwrapv_-fPIC_-fPIE_-gdwarf-4_-Wall/timingleaks/crypto_aead/ascon80pqv12/esp32/work/try.c:484: undefined reference to `crypto_aead_ascon80pqv12_esp32_timingleaks_decrypt'
try.c: /usr/bin/ld: .../supercop-data/wolfdale/amd64/try/c/gcc_-march=native_-mtune=native_-O3_-fwrapv_-fPIC_-fPIE_-gdwarf-4_-Wall/timingleaks/crypto_aead/ascon80pqv12/esp32/work/try.c:159: undefined reference to `crypto_aead_ascon80pqv12_esp32_timingleaks_encrypt'
try.c: collect2: error: ld returned 1 exit status

Number of similar (implementation,compiler) pairs: 1, namely:
ImplementationCompiler
T:esp32gcc -march=native -mtune=native -O3 -fwrapv -fPIC -fPIE -gdwarf-4 -Wall (10.2.1_20210110)

Compiler output


try.c: /usr/bin/ld: /tmp/ccgaRuuu.o: in function `doit':
try.c: .../supercop-data/wolfdale/amd64/try/c/gcc_-march=native_-mtune=native_-O_-fwrapv_-fPIC_-fPIE_-gdwarf-4_-Wall/timingleaks/crypto_aead/ascon80pqv12/esp32/work/try.c:133: undefined reference to `crypto_aead_ascon80pqv12_esp32_timingleaks_encrypt'
try.c: /usr/bin/ld: .../supercop-data/wolfdale/amd64/try/c/gcc_-march=native_-mtune=native_-O_-fwrapv_-fPIC_-fPIE_-gdwarf-4_-Wall/timingleaks/crypto_aead/ascon80pqv12/esp32/work/try.c:135: undefined reference to `crypto_aead_ascon80pqv12_esp32_timingleaks_decrypt'
try.c: /usr/bin/ld: /tmp/ccgaRuuu.o: in function `test':
try.c: .../supercop-data/wolfdale/amd64/try/c/gcc_-march=native_-mtune=native_-O_-fwrapv_-fPIC_-fPIE_-gdwarf-4_-Wall/timingleaks/crypto_aead/ascon80pqv12/esp32/work/try.c:159: undefined reference to `crypto_aead_ascon80pqv12_esp32_timingleaks_encrypt'
try.c: /usr/bin/ld: .../supercop-data/wolfdale/amd64/try/c/gcc_-march=native_-mtune=native_-O_-fwrapv_-fPIC_-fPIE_-gdwarf-4_-Wall/timingleaks/crypto_aead/ascon80pqv12/esp32/work/try.c:189: undefined reference to `crypto_aead_ascon80pqv12_esp32_timingleaks_encrypt'
try.c: /usr/bin/ld: .../supercop-data/wolfdale/amd64/try/c/gcc_-march=native_-mtune=native_-O_-fwrapv_-fPIC_-fPIE_-gdwarf-4_-Wall/timingleaks/crypto_aead/ascon80pqv12/esp32/work/try.c:300: undefined reference to `crypto_aead_ascon80pqv12_esp32_timingleaks_decrypt'
try.c: /usr/bin/ld: .../supercop-data/wolfdale/amd64/try/c/gcc_-march=native_-mtune=native_-O_-fwrapv_-fPIC_-fPIE_-gdwarf-4_-Wall/timingleaks/crypto_aead/ascon80pqv12/esp32/work/try.c:331: undefined reference to `crypto_aead_ascon80pqv12_esp32_timingleaks_decrypt'
try.c: /usr/bin/ld: .../supercop-data/wolfdale/amd64/try/c/gcc_-march=native_-mtune=native_-O_-fwrapv_-fPIC_-fPIE_-gdwarf-4_-Wall/timingleaks/crypto_aead/ascon80pqv12/esp32/work/try.c:476: undefined reference to `crypto_aead_ascon80pqv12_esp32_timingleaks_decrypt'
try.c: /usr/bin/ld: .../supercop-data/wolfdale/amd64/try/c/gcc_-march=native_-mtune=native_-O_-fwrapv_-fPIC_-fPIE_-gdwarf-4_-Wall/timingleaks/crypto_aead/ascon80pqv12/esp32/work/try.c:480: undefined reference to `crypto_aead_ascon80pqv12_esp32_timingleaks_decrypt'
try.c: /usr/bin/ld: .../supercop-data/wolfdale/amd64/try/c/gcc_-march=native_-mtune=native_-O_-fwrapv_-fPIC_-fPIE_-gdwarf-4_-Wall/timingleaks/crypto_aead/ascon80pqv12/esp32/work/try.c:484: undefined reference to `crypto_aead_ascon80pqv12_esp32_timingleaks_decrypt'
try.c: collect2: error: ld returned 1 exit status

Number of similar (implementation,compiler) pairs: 1, namely:
ImplementationCompiler
T:esp32gcc -march=native -mtune=native -O -fwrapv -fPIC -fPIE -gdwarf-4 -Wall (10.2.1_20210110)

Compiler output


try.c: /usr/bin/ld: /tmp/ccPNa6u0.o: in function `doit':
try.c: .../supercop-data/wolfdale/amd64/try/c/gcc_-march=native_-mtune=native_-Os_-fwrapv_-fPIC_-fPIE_-gdwarf-4_-Wall/timingleaks/crypto_aead/ascon80pqv12/esp32/work/try.c:133: undefined reference to `crypto_aead_ascon80pqv12_esp32_timingleaks_encrypt'
try.c: /usr/bin/ld: .../supercop-data/wolfdale/amd64/try/c/gcc_-march=native_-mtune=native_-Os_-fwrapv_-fPIC_-fPIE_-gdwarf-4_-Wall/timingleaks/crypto_aead/ascon80pqv12/esp32/work/try.c:135: undefined reference to `crypto_aead_ascon80pqv12_esp32_timingleaks_decrypt'
try.c: /usr/bin/ld: /tmp/ccPNa6u0.o: in function `test':
try.c: .../supercop-data/wolfdale/amd64/try/c/gcc_-march=native_-mtune=native_-Os_-fwrapv_-fPIC_-fPIE_-gdwarf-4_-Wall/timingleaks/crypto_aead/ascon80pqv12/esp32/work/try.c:159: undefined reference to `crypto_aead_ascon80pqv12_esp32_timingleaks_encrypt'
try.c: /usr/bin/ld: .../supercop-data/wolfdale/amd64/try/c/gcc_-march=native_-mtune=native_-Os_-fwrapv_-fPIC_-fPIE_-gdwarf-4_-Wall/timingleaks/crypto_aead/ascon80pqv12/esp32/work/try.c:189: undefined reference to `crypto_aead_ascon80pqv12_esp32_timingleaks_encrypt'
try.c: /usr/bin/ld: .../supercop-data/wolfdale/amd64/try/c/gcc_-march=native_-mtune=native_-Os_-fwrapv_-fPIC_-fPIE_-gdwarf-4_-Wall/timingleaks/crypto_aead/ascon80pqv12/esp32/work/try.c:300: undefined reference to `crypto_aead_ascon80pqv12_esp32_timingleaks_decrypt'
try.c: /usr/bin/ld: .../supercop-data/wolfdale/amd64/try/c/gcc_-march=native_-mtune=native_-Os_-fwrapv_-fPIC_-fPIE_-gdwarf-4_-Wall/timingleaks/crypto_aead/ascon80pqv12/esp32/work/try.c:331: undefined reference to `crypto_aead_ascon80pqv12_esp32_timingleaks_decrypt'
try.c: /usr/bin/ld: .../supercop-data/wolfdale/amd64/try/c/gcc_-march=native_-mtune=native_-Os_-fwrapv_-fPIC_-fPIE_-gdwarf-4_-Wall/timingleaks/crypto_aead/ascon80pqv12/esp32/work/try.c:476: undefined reference to `crypto_aead_ascon80pqv12_esp32_timingleaks_decrypt'
try.c: /usr/bin/ld: .../supercop-data/wolfdale/amd64/try/c/gcc_-march=native_-mtune=native_-Os_-fwrapv_-fPIC_-fPIE_-gdwarf-4_-Wall/timingleaks/crypto_aead/ascon80pqv12/esp32/work/try.c:480: undefined reference to `crypto_aead_ascon80pqv12_esp32_timingleaks_decrypt'
try.c: /usr/bin/ld: .../supercop-data/wolfdale/amd64/try/c/gcc_-march=native_-mtune=native_-Os_-fwrapv_-fPIC_-fPIE_-gdwarf-4_-Wall/timingleaks/crypto_aead/ascon80pqv12/esp32/work/try.c:484: undefined reference to `crypto_aead_ascon80pqv12_esp32_timingleaks_decrypt'
try.c: collect2: error: ld returned 1 exit status

Number of similar (implementation,compiler) pairs: 1, namely:
ImplementationCompiler
T:esp32gcc -march=native -mtune=native -Os -fwrapv -fPIC -fPIE -gdwarf-4 -Wall (10.2.1_20210110)

Compiler output


aead.c: In file included from round.h:8,
aead.c:                  from permutations.h:11,
aead.c:                  from aead.c:4:
aead.c: word.h:32:11: warning: 'crypto_int64_bitmod_01' is static but used in inline function 'NOTZERO' which is not static
aead.c:    32 |   return (crypto_int64_bitmod_01(((int)(result & 0xff) - 1),8)) - 1;
aead.c:       |           ^~~~~~~~~~~~~~~~~~~~~~
permutations.c: In file included from round.h:8,
permutations.c:                  from permutations.h:11,
permutations.c:                  from permutations.c:1:
permutations.c: word.h:32:11: warning: 'crypto_int64_bitmod_01' is static but used in inline function 'NOTZERO' which is not static
permutations.c:    32 |   return (crypto_int64_bitmod_01(((int)(result & 0xff) - 1),8)) - 1;
permutations.c:       |           ^~~~~~~~~~~~~~~~~~~~~~

Number of similar (implementation,compiler) pairs: 8, namely:
ImplementationCompiler
opt32gcc -march=native -mtune=native -O2 -fwrapv -fPIC -fPIE -gdwarf-4 -Wall (10.2.1_20210110)
opt32gcc -march=native -mtune=native -O3 -fwrapv -fPIC -fPIE -gdwarf-4 -Wall (10.2.1_20210110)
opt32gcc -march=native -mtune=native -O -fwrapv -fPIC -fPIE -gdwarf-4 -Wall (10.2.1_20210110)
opt32gcc -march=native -mtune=native -Os -fwrapv -fPIC -fPIE -gdwarf-4 -Wall (10.2.1_20210110)
opt64gcc -march=native -mtune=native -O2 -fwrapv -fPIC -fPIE -gdwarf-4 -Wall (10.2.1_20210110)
opt64gcc -march=native -mtune=native -O3 -fwrapv -fPIC -fPIE -gdwarf-4 -Wall (10.2.1_20210110)
opt64gcc -march=native -mtune=native -O -fwrapv -fPIC -fPIE -gdwarf-4 -Wall (10.2.1_20210110)
opt64gcc -march=native -mtune=native -Os -fwrapv -fPIC -fPIE -gdwarf-4 -Wall (10.2.1_20210110)

Compiler output


aead.c: In file included from round.h:8,
aead.c:                  from permutations.h:11,
aead.c:                  from aead.c:3:
aead.c: word.h:32:11: warning: 'crypto_int64_bitmod_01' is static but used in inline function 'NOTZERO' which is not static
aead.c:    32 |   return (crypto_int64_bitmod_01(((int)(result & 0xff) - 1),8)) - 1;
aead.c:       |           ^~~~~~~~~~~~~~~~~~~~~~
crypto_aead.c: In file included from round.h:8,
crypto_aead.c:                  from permutations.h:11,
crypto_aead.c:                  from crypto_aead.c:8:
crypto_aead.c: word.h:32:11: warning: 'crypto_int64_bitmod_01' is static but used in inline function 'NOTZERO' which is not static
crypto_aead.c:    32 |   return (crypto_int64_bitmod_01(((int)(result & 0xff) - 1),8)) - 1;
crypto_aead.c:       |           ^~~~~~~~~~~~~~~~~~~~~~
permutations.c: In file included from round.h:8,
permutations.c:                  from permutations.h:11,
permutations.c:                  from permutations.c:1:
permutations.c: word.h:32:11: warning: 'crypto_int64_bitmod_01' is static but used in inline function 'NOTZERO' which is not static
permutations.c:    32 |   return (crypto_int64_bitmod_01(((int)(result & 0xff) - 1),8)) - 1;
permutations.c:       |           ^~~~~~~~~~~~~~~~~~~~~~
update.c: update.c: In function 'ascon_update':
update.c: update.c:21:13: warning: unused variable 'rate' [-Wunused-variable]
update.c:    21 |   const int rate = ASCON_AEAD_RATE;
update.c:       |             ^~~~
update.c: In file included from round.h:8,
update.c:                  from permutations.h:11,
update.c:                  from update.c:3:
update.c: update.c: At top level:
update.c: word.h:32:11: warning: 'crypto_int64_bitmod_01' is static but used in inline function 'NOTZERO' which is not static
update.c:    32 |   return (crypto_int64_bitmod_01(((int)(result & 0xff) - 1),8)) - 1;
update.c:       |           ^~~~~~~~~~~~~~~~~~~~~~

Number of similar (implementation,compiler) pairs: 8, namely:
ImplementationCompiler
opt32_lowsizegcc -march=native -mtune=native -O2 -fwrapv -fPIC -fPIE -gdwarf-4 -Wall (10.2.1_20210110)
opt32_lowsizegcc -march=native -mtune=native -O3 -fwrapv -fPIC -fPIE -gdwarf-4 -Wall (10.2.1_20210110)
opt32_lowsizegcc -march=native -mtune=native -O -fwrapv -fPIC -fPIE -gdwarf-4 -Wall (10.2.1_20210110)
opt32_lowsizegcc -march=native -mtune=native -Os -fwrapv -fPIC -fPIE -gdwarf-4 -Wall (10.2.1_20210110)
opt64_lowsizegcc -march=native -mtune=native -O2 -fwrapv -fPIC -fPIE -gdwarf-4 -Wall (10.2.1_20210110)
opt64_lowsizegcc -march=native -mtune=native -O3 -fwrapv -fPIC -fPIE -gdwarf-4 -Wall (10.2.1_20210110)
opt64_lowsizegcc -march=native -mtune=native -O -fwrapv -fPIC -fPIE -gdwarf-4 -Wall (10.2.1_20210110)
opt64_lowsizegcc -march=native -mtune=native -Os -fwrapv -fPIC -fPIE -gdwarf-4 -Wall (10.2.1_20210110)

Compiler output


aead.c: In file included from round.h:8,
aead.c:                  from permutations.h:11,
aead.c:                  from aead.c:5:
aead.c: word.h:61:11: warning: 'crypto_int64_bitmod_01' is static but used in inline function 'NOTZERO' which is not static
aead.c:    61 |   return (crypto_int64_bitmod_01(((int)(result & 0xff) - 1),8)) - 1;
aead.c:       |           ^~~~~~~~~~~~~~~~~~~~~~
permutations.c: In file included from round.h:8,
permutations.c:                  from permutations.h:11,
permutations.c:                  from permutations.c:1:
permutations.c: word.h:61:11: warning: 'crypto_int64_bitmod_01' is static but used in inline function 'NOTZERO' which is not static
permutations.c:    61 |   return (crypto_int64_bitmod_01(((int)(result & 0xff) - 1),8)) - 1;
permutations.c:       |           ^~~~~~~~~~~~~~~~~~~~~~

Number of similar (implementation,compiler) pairs: 4, namely:
ImplementationCompiler
opt8gcc -march=native -mtune=native -O2 -fwrapv -fPIC -fPIE -gdwarf-4 -Wall (10.2.1_20210110)
opt8gcc -march=native -mtune=native -O3 -fwrapv -fPIC -fPIE -gdwarf-4 -Wall (10.2.1_20210110)
opt8gcc -march=native -mtune=native -O -fwrapv -fPIC -fPIE -gdwarf-4 -Wall (10.2.1_20210110)
opt8gcc -march=native -mtune=native -Os -fwrapv -fPIC -fPIE -gdwarf-4 -Wall (10.2.1_20210110)

Compiler output


aead.c: In file included from round.h:8,
aead.c:                  from permutations.h:11,
aead.c:                  from aead.c:5:
aead.c: word.h:61:11: warning: 'crypto_int64_bitmod_01' is static but used in inline function 'NOTZERO' which is not static
aead.c:    61 |   return (crypto_int64_bitmod_01(((int)(result & 0xff) - 1),8)) - 1;
aead.c:       |           ^~~~~~~~~~~~~~~~~~~~~~
permutations.c: In file included from round.h:8,
permutations.c:                  from permutations.h:11,
permutations.c:                  from permutations.c:1:
permutations.c: word.h:61:11: warning: 'crypto_int64_bitmod_01' is static but used in inline function 'NOTZERO' which is not static
permutations.c:    61 |   return (crypto_int64_bitmod_01(((int)(result & 0xff) - 1),8)) - 1;
permutations.c:       |           ^~~~~~~~~~~~~~~~~~~~~~
update.c: In file included from round.h:8,
update.c:                  from permutations.h:11,
update.c:                  from update.c:3:
update.c: word.h:61:11: warning: 'crypto_int64_bitmod_01' is static but used in inline function 'NOTZERO' which is not static
update.c:    61 |   return (crypto_int64_bitmod_01(((int)(result & 0xff) - 1),8)) - 1;
update.c:       |           ^~~~~~~~~~~~~~~~~~~~~~

Number of similar (implementation,compiler) pairs: 4, namely:
ImplementationCompiler
opt8_lowsizegcc -march=native -mtune=native -O2 -fwrapv -fPIC -fPIE -gdwarf-4 -Wall (10.2.1_20210110)
opt8_lowsizegcc -march=native -mtune=native -O3 -fwrapv -fPIC -fPIE -gdwarf-4 -Wall (10.2.1_20210110)
opt8_lowsizegcc -march=native -mtune=native -O -fwrapv -fPIC -fPIE -gdwarf-4 -Wall (10.2.1_20210110)
opt8_lowsizegcc -march=native -mtune=native -Os -fwrapv -fPIC -fPIE -gdwarf-4 -Wall (10.2.1_20210110)

Namespace violations


constants.o constants R
interleave.o B R
permutations.o P12 T
permutations.o P6 T

Number of similar (implementation,compiler) pairs: 9, namely:
ImplementationCompiler
bi32clang -march=native -O2 -fwrapv -Qunused-arguments -fPIC -fPIE -gdwarf-4 -Wall (Debian_Clang_11.0.1)
bi32clang -march=native -O3 -fwrapv -Qunused-arguments -fPIC -fPIE -gdwarf-4 -Wall (Debian_Clang_11.0.1)
bi32clang -march=native -O -fwrapv -Qunused-arguments -fPIC -fPIE -gdwarf-4 -Wall (Debian_Clang_11.0.1)
bi32clang -march=native -Os -fwrapv -Qunused-arguments -fPIC -fPIE -gdwarf-4 -Wall (Debian_Clang_11.0.1)
bi32clang -mcpu=native -O3 -fwrapv -Qunused-arguments -fPIC -fPIE -gdwarf-4 -Wall (Debian_Clang_11.0.1)
bi32gcc -march=native -mtune=native -O2 -fwrapv -fPIC -fPIE -gdwarf-4 -Wall (10.2.1_20210110)
bi32gcc -march=native -mtune=native -O3 -fwrapv -fPIC -fPIE -gdwarf-4 -Wall (10.2.1_20210110)
bi32gcc -march=native -mtune=native -O -fwrapv -fPIC -fPIE -gdwarf-4 -Wall (10.2.1_20210110)
bi32gcc -march=native -mtune=native -Os -fwrapv -fPIC -fPIE -gdwarf-4 -Wall (10.2.1_20210110)

Namespace violations


aead.o ascon_adata T
aead.o ascon_decrypt T
aead.o ascon_encrypt T
aead.o ascon_final T
aead.o ascon_initaead T
aead.o ascon_loadkey T
constants.o constants R
interleave.o B R

Number of similar (implementation,compiler) pairs: 9, namely:
ImplementationCompiler
bi32_lowregclang -march=native -O2 -fwrapv -Qunused-arguments -fPIC -fPIE -gdwarf-4 -Wall (Debian_Clang_11.0.1)
bi32_lowregclang -march=native -O3 -fwrapv -Qunused-arguments -fPIC -fPIE -gdwarf-4 -Wall (Debian_Clang_11.0.1)
bi32_lowregclang -march=native -O -fwrapv -Qunused-arguments -fPIC -fPIE -gdwarf-4 -Wall (Debian_Clang_11.0.1)
bi32_lowregclang -march=native -Os -fwrapv -Qunused-arguments -fPIC -fPIE -gdwarf-4 -Wall (Debian_Clang_11.0.1)
bi32_lowregclang -mcpu=native -O3 -fwrapv -Qunused-arguments -fPIC -fPIE -gdwarf-4 -Wall (Debian_Clang_11.0.1)
bi32_lowreggcc -march=native -mtune=native -O2 -fwrapv -fPIC -fPIE -gdwarf-4 -Wall (10.2.1_20210110)
bi32_lowreggcc -march=native -mtune=native -O3 -fwrapv -fPIC -fPIE -gdwarf-4 -Wall (10.2.1_20210110)
bi32_lowreggcc -march=native -mtune=native -O -fwrapv -fPIC -fPIE -gdwarf-4 -Wall (10.2.1_20210110)
bi32_lowreggcc -march=native -mtune=native -Os -fwrapv -fPIC -fPIE -gdwarf-4 -Wall (10.2.1_20210110)

Namespace violations


aead.o ascon_aead T
constants.o constants R
interleave.o B R
interleave.o FROMBI T
interleave.o TOBI T
permutations.o P T
update.o ascon_update T

Number of similar (implementation,compiler) pairs: 9, namely:
ImplementationCompiler
bi32_lowsizeclang -march=native -O2 -fwrapv -Qunused-arguments -fPIC -fPIE -gdwarf-4 -Wall (Debian_Clang_11.0.1)
bi32_lowsizeclang -march=native -O3 -fwrapv -Qunused-arguments -fPIC -fPIE -gdwarf-4 -Wall (Debian_Clang_11.0.1)
bi32_lowsizeclang -march=native -O -fwrapv -Qunused-arguments -fPIC -fPIE -gdwarf-4 -Wall (Debian_Clang_11.0.1)
bi32_lowsizeclang -march=native -Os -fwrapv -Qunused-arguments -fPIC -fPIE -gdwarf-4 -Wall (Debian_Clang_11.0.1)
bi32_lowsizeclang -mcpu=native -O3 -fwrapv -Qunused-arguments -fPIC -fPIE -gdwarf-4 -Wall (Debian_Clang_11.0.1)
bi32_lowsizegcc -march=native -mtune=native -O2 -fwrapv -fPIC -fPIE -gdwarf-4 -Wall (10.2.1_20210110)
bi32_lowsizegcc -march=native -mtune=native -O3 -fwrapv -fPIC -fPIE -gdwarf-4 -Wall (10.2.1_20210110)
bi32_lowsizegcc -march=native -mtune=native -O -fwrapv -fPIC -fPIE -gdwarf-4 -Wall (10.2.1_20210110)
bi32_lowsizegcc -march=native -mtune=native -Os -fwrapv -fPIC -fPIE -gdwarf-4 -Wall (10.2.1_20210110)

Namespace violations


constants.o constants R
interleave.o FROMBI T
interleave.o TOBI T
permutations.o P T

Number of similar (implementation,compiler) pairs: 9, namely:
ImplementationCompiler
bi8clang -march=native -O2 -fwrapv -Qunused-arguments -fPIC -fPIE -gdwarf-4 -Wall (Debian_Clang_11.0.1)
bi8clang -march=native -O3 -fwrapv -Qunused-arguments -fPIC -fPIE -gdwarf-4 -Wall (Debian_Clang_11.0.1)
bi8clang -march=native -O -fwrapv -Qunused-arguments -fPIC -fPIE -gdwarf-4 -Wall (Debian_Clang_11.0.1)
bi8clang -march=native -Os -fwrapv -Qunused-arguments -fPIC -fPIE -gdwarf-4 -Wall (Debian_Clang_11.0.1)
bi8clang -mcpu=native -O3 -fwrapv -Qunused-arguments -fPIC -fPIE -gdwarf-4 -Wall (Debian_Clang_11.0.1)
bi8gcc -march=native -mtune=native -O2 -fwrapv -fPIC -fPIE -gdwarf-4 -Wall (10.2.1_20210110)
bi8gcc -march=native -mtune=native -O3 -fwrapv -fPIC -fPIE -gdwarf-4 -Wall (10.2.1_20210110)
bi8gcc -march=native -mtune=native -O -fwrapv -fPIC -fPIE -gdwarf-4 -Wall (10.2.1_20210110)
bi8gcc -march=native -mtune=native -Os -fwrapv -fPIC -fPIE -gdwarf-4 -Wall (10.2.1_20210110)

Namespace violations


aead.o ascon_aead T
permutations.o P T
update.o ascon_update T

Number of similar (implementation,compiler) pairs: 18, namely:
ImplementationCompiler
opt32_lowsizeclang -march=native -O2 -fwrapv -Qunused-arguments -fPIC -fPIE -gdwarf-4 -Wall (Debian_Clang_11.0.1)
opt32_lowsizeclang -march=native -O3 -fwrapv -Qunused-arguments -fPIC -fPIE -gdwarf-4 -Wall (Debian_Clang_11.0.1)
opt32_lowsizeclang -march=native -O -fwrapv -Qunused-arguments -fPIC -fPIE -gdwarf-4 -Wall (Debian_Clang_11.0.1)
opt32_lowsizeclang -march=native -Os -fwrapv -Qunused-arguments -fPIC -fPIE -gdwarf-4 -Wall (Debian_Clang_11.0.1)
opt32_lowsizeclang -mcpu=native -O3 -fwrapv -Qunused-arguments -fPIC -fPIE -gdwarf-4 -Wall (Debian_Clang_11.0.1)
opt32_lowsizegcc -march=native -mtune=native -O2 -fwrapv -fPIC -fPIE -gdwarf-4 -Wall (10.2.1_20210110)
opt32_lowsizegcc -march=native -mtune=native -O3 -fwrapv -fPIC -fPIE -gdwarf-4 -Wall (10.2.1_20210110)
opt32_lowsizegcc -march=native -mtune=native -O -fwrapv -fPIC -fPIE -gdwarf-4 -Wall (10.2.1_20210110)
opt32_lowsizegcc -march=native -mtune=native -Os -fwrapv -fPIC -fPIE -gdwarf-4 -Wall (10.2.1_20210110)
opt64_lowsizeclang -march=native -O2 -fwrapv -Qunused-arguments -fPIC -fPIE -gdwarf-4 -Wall (Debian_Clang_11.0.1)
opt64_lowsizeclang -march=native -O3 -fwrapv -Qunused-arguments -fPIC -fPIE -gdwarf-4 -Wall (Debian_Clang_11.0.1)
opt64_lowsizeclang -march=native -O -fwrapv -Qunused-arguments -fPIC -fPIE -gdwarf-4 -Wall (Debian_Clang_11.0.1)
opt64_lowsizeclang -march=native -Os -fwrapv -Qunused-arguments -fPIC -fPIE -gdwarf-4 -Wall (Debian_Clang_11.0.1)
opt64_lowsizeclang -mcpu=native -O3 -fwrapv -Qunused-arguments -fPIC -fPIE -gdwarf-4 -Wall (Debian_Clang_11.0.1)
opt64_lowsizegcc -march=native -mtune=native -O2 -fwrapv -fPIC -fPIE -gdwarf-4 -Wall (10.2.1_20210110)
opt64_lowsizegcc -march=native -mtune=native -O3 -fwrapv -fPIC -fPIE -gdwarf-4 -Wall (10.2.1_20210110)
opt64_lowsizegcc -march=native -mtune=native -O -fwrapv -fPIC -fPIE -gdwarf-4 -Wall (10.2.1_20210110)
opt64_lowsizegcc -march=native -mtune=native -Os -fwrapv -fPIC -fPIE -gdwarf-4 -Wall (10.2.1_20210110)

Namespace violations


aead.o ascon_adata T
aead.o ascon_decrypt T
aead.o ascon_encrypt T
aead.o ascon_final T
aead.o ascon_initaead T
aead.o ascon_loadkey T
permutations.o P T

Number of similar (implementation,compiler) pairs: 9, namely:
ImplementationCompiler
opt8clang -march=native -O2 -fwrapv -Qunused-arguments -fPIC -fPIE -gdwarf-4 -Wall (Debian_Clang_11.0.1)
opt8clang -march=native -O3 -fwrapv -Qunused-arguments -fPIC -fPIE -gdwarf-4 -Wall (Debian_Clang_11.0.1)
opt8clang -march=native -O -fwrapv -Qunused-arguments -fPIC -fPIE -gdwarf-4 -Wall (Debian_Clang_11.0.1)
opt8clang -march=native -Os -fwrapv -Qunused-arguments -fPIC -fPIE -gdwarf-4 -Wall (Debian_Clang_11.0.1)
opt8clang -mcpu=native -O3 -fwrapv -Qunused-arguments -fPIC -fPIE -gdwarf-4 -Wall (Debian_Clang_11.0.1)
opt8gcc -march=native -mtune=native -O2 -fwrapv -fPIC -fPIE -gdwarf-4 -Wall (10.2.1_20210110)
opt8gcc -march=native -mtune=native -O3 -fwrapv -fPIC -fPIE -gdwarf-4 -Wall (10.2.1_20210110)
opt8gcc -march=native -mtune=native -O -fwrapv -fPIC -fPIE -gdwarf-4 -Wall (10.2.1_20210110)
opt8gcc -march=native -mtune=native -Os -fwrapv -fPIC -fPIE -gdwarf-4 -Wall (10.2.1_20210110)

Namespace violations


aead.o ascon_final T
aead.o ascon_initaead T
aead.o ascon_loadkey T
permutations.o P T
update.o ascon_update T

Number of similar (implementation,compiler) pairs: 9, namely:
ImplementationCompiler
opt8_lowsizeclang -march=native -O2 -fwrapv -Qunused-arguments -fPIC -fPIE -gdwarf-4 -Wall (Debian_Clang_11.0.1)
opt8_lowsizeclang -march=native -O3 -fwrapv -Qunused-arguments -fPIC -fPIE -gdwarf-4 -Wall (Debian_Clang_11.0.1)
opt8_lowsizeclang -march=native -O -fwrapv -Qunused-arguments -fPIC -fPIE -gdwarf-4 -Wall (Debian_Clang_11.0.1)
opt8_lowsizeclang -march=native -Os -fwrapv -Qunused-arguments -fPIC -fPIE -gdwarf-4 -Wall (Debian_Clang_11.0.1)
opt8_lowsizeclang -mcpu=native -O3 -fwrapv -Qunused-arguments -fPIC -fPIE -gdwarf-4 -Wall (Debian_Clang_11.0.1)
opt8_lowsizegcc -march=native -mtune=native -O2 -fwrapv -fPIC -fPIE -gdwarf-4 -Wall (10.2.1_20210110)
opt8_lowsizegcc -march=native -mtune=native -O3 -fwrapv -fPIC -fPIE -gdwarf-4 -Wall (10.2.1_20210110)
opt8_lowsizegcc -march=native -mtune=native -O -fwrapv -fPIC -fPIE -gdwarf-4 -Wall (10.2.1_20210110)
opt8_lowsizegcc -march=native -mtune=native -Os -fwrapv -fPIC -fPIE -gdwarf-4 -Wall (10.2.1_20210110)

Passed TIMECOP


TIMECOP iterations: 10

Number of similar (implementation,compiler) pairs: 99, namely:
ImplementationCompiler
bi32clang -march=native -O2 -fwrapv -Qunused-arguments -fPIC -fPIE -gdwarf-4 -Wall (Debian_Clang_11.0.1)
bi32clang -march=native -O3 -fwrapv -Qunused-arguments -fPIC -fPIE -gdwarf-4 -Wall (Debian_Clang_11.0.1)
bi32clang -march=native -O -fwrapv -Qunused-arguments -fPIC -fPIE -gdwarf-4 -Wall (Debian_Clang_11.0.1)
bi32clang -march=native -Os -fwrapv -Qunused-arguments -fPIC -fPIE -gdwarf-4 -Wall (Debian_Clang_11.0.1)
bi32clang -mcpu=native -O3 -fwrapv -Qunused-arguments -fPIC -fPIE -gdwarf-4 -Wall (Debian_Clang_11.0.1)
bi32gcc -march=native -mtune=native -O2 -fwrapv -fPIC -fPIE -gdwarf-4 -Wall (10.2.1_20210110)
bi32gcc -march=native -mtune=native -O3 -fwrapv -fPIC -fPIE -gdwarf-4 -Wall (10.2.1_20210110)
bi32gcc -march=native -mtune=native -O -fwrapv -fPIC -fPIE -gdwarf-4 -Wall (10.2.1_20210110)
bi32gcc -march=native -mtune=native -Os -fwrapv -fPIC -fPIE -gdwarf-4 -Wall (10.2.1_20210110)
bi32_lowregclang -march=native -O2 -fwrapv -Qunused-arguments -fPIC -fPIE -gdwarf-4 -Wall (Debian_Clang_11.0.1)
bi32_lowregclang -march=native -O3 -fwrapv -Qunused-arguments -fPIC -fPIE -gdwarf-4 -Wall (Debian_Clang_11.0.1)
bi32_lowregclang -march=native -O -fwrapv -Qunused-arguments -fPIC -fPIE -gdwarf-4 -Wall (Debian_Clang_11.0.1)
bi32_lowregclang -march=native -Os -fwrapv -Qunused-arguments -fPIC -fPIE -gdwarf-4 -Wall (Debian_Clang_11.0.1)
bi32_lowregclang -mcpu=native -O3 -fwrapv -Qunused-arguments -fPIC -fPIE -gdwarf-4 -Wall (Debian_Clang_11.0.1)
bi32_lowreggcc -march=native -mtune=native -O2 -fwrapv -fPIC -fPIE -gdwarf-4 -Wall (10.2.1_20210110)
bi32_lowreggcc -march=native -mtune=native -O3 -fwrapv -fPIC -fPIE -gdwarf-4 -Wall (10.2.1_20210110)
bi32_lowreggcc -march=native -mtune=native -O -fwrapv -fPIC -fPIE -gdwarf-4 -Wall (10.2.1_20210110)
bi32_lowreggcc -march=native -mtune=native -Os -fwrapv -fPIC -fPIE -gdwarf-4 -Wall (10.2.1_20210110)
bi32_lowsizeclang -march=native -O2 -fwrapv -Qunused-arguments -fPIC -fPIE -gdwarf-4 -Wall (Debian_Clang_11.0.1)
bi32_lowsizeclang -march=native -O3 -fwrapv -Qunused-arguments -fPIC -fPIE -gdwarf-4 -Wall (Debian_Clang_11.0.1)
bi32_lowsizeclang -march=native -O -fwrapv -Qunused-arguments -fPIC -fPIE -gdwarf-4 -Wall (Debian_Clang_11.0.1)
bi32_lowsizeclang -march=native -Os -fwrapv -Qunused-arguments -fPIC -fPIE -gdwarf-4 -Wall (Debian_Clang_11.0.1)
bi32_lowsizeclang -mcpu=native -O3 -fwrapv -Qunused-arguments -fPIC -fPIE -gdwarf-4 -Wall (Debian_Clang_11.0.1)
bi32_lowsizegcc -march=native -mtune=native -O2 -fwrapv -fPIC -fPIE -gdwarf-4 -Wall (10.2.1_20210110)
bi32_lowsizegcc -march=native -mtune=native -O3 -fwrapv -fPIC -fPIE -gdwarf-4 -Wall (10.2.1_20210110)
bi32_lowsizegcc -march=native -mtune=native -O -fwrapv -fPIC -fPIE -gdwarf-4 -Wall (10.2.1_20210110)
bi32_lowsizegcc -march=native -mtune=native -Os -fwrapv -fPIC -fPIE -gdwarf-4 -Wall (10.2.1_20210110)
bi8clang -march=native -O2 -fwrapv -Qunused-arguments -fPIC -fPIE -gdwarf-4 -Wall (Debian_Clang_11.0.1)
bi8clang -march=native -O3 -fwrapv -Qunused-arguments -fPIC -fPIE -gdwarf-4 -Wall (Debian_Clang_11.0.1)
bi8clang -march=native -O -fwrapv -Qunused-arguments -fPIC -fPIE -gdwarf-4 -Wall (Debian_Clang_11.0.1)
bi8clang -march=native -Os -fwrapv -Qunused-arguments -fPIC -fPIE -gdwarf-4 -Wall (Debian_Clang_11.0.1)
bi8clang -mcpu=native -O3 -fwrapv -Qunused-arguments -fPIC -fPIE -gdwarf-4 -Wall (Debian_Clang_11.0.1)
bi8gcc -march=native -mtune=native -O2 -fwrapv -fPIC -fPIE -gdwarf-4 -Wall (10.2.1_20210110)
bi8gcc -march=native -mtune=native -O3 -fwrapv -fPIC -fPIE -gdwarf-4 -Wall (10.2.1_20210110)
bi8gcc -march=native -mtune=native -O -fwrapv -fPIC -fPIE -gdwarf-4 -Wall (10.2.1_20210110)
bi8gcc -march=native -mtune=native -Os -fwrapv -fPIC -fPIE -gdwarf-4 -Wall (10.2.1_20210110)
opt32clang -march=native -O2 -fwrapv -Qunused-arguments -fPIC -fPIE -gdwarf-4 -Wall (Debian_Clang_11.0.1)
opt32clang -march=native -O3 -fwrapv -Qunused-arguments -fPIC -fPIE -gdwarf-4 -Wall (Debian_Clang_11.0.1)
opt32clang -march=native -O -fwrapv -Qunused-arguments -fPIC -fPIE -gdwarf-4 -Wall (Debian_Clang_11.0.1)
opt32clang -march=native -Os -fwrapv -Qunused-arguments -fPIC -fPIE -gdwarf-4 -Wall (Debian_Clang_11.0.1)
opt32clang -mcpu=native -O3 -fwrapv -Qunused-arguments -fPIC -fPIE -gdwarf-4 -Wall (Debian_Clang_11.0.1)
opt32gcc -march=native -mtune=native -O2 -fwrapv -fPIC -fPIE -gdwarf-4 -Wall (10.2.1_20210110)
opt32gcc -march=native -mtune=native -O3 -fwrapv -fPIC -fPIE -gdwarf-4 -Wall (10.2.1_20210110)
opt32gcc -march=native -mtune=native -O -fwrapv -fPIC -fPIE -gdwarf-4 -Wall (10.2.1_20210110)
opt32gcc -march=native -mtune=native -Os -fwrapv -fPIC -fPIE -gdwarf-4 -Wall (10.2.1_20210110)
opt32_lowsizeclang -march=native -O2 -fwrapv -Qunused-arguments -fPIC -fPIE -gdwarf-4 -Wall (Debian_Clang_11.0.1)
opt32_lowsizeclang -march=native -O3 -fwrapv -Qunused-arguments -fPIC -fPIE -gdwarf-4 -Wall (Debian_Clang_11.0.1)
opt32_lowsizeclang -march=native -O -fwrapv -Qunused-arguments -fPIC -fPIE -gdwarf-4 -Wall (Debian_Clang_11.0.1)
opt32_lowsizeclang -march=native -Os -fwrapv -Qunused-arguments -fPIC -fPIE -gdwarf-4 -Wall (Debian_Clang_11.0.1)
opt32_lowsizeclang -mcpu=native -O3 -fwrapv -Qunused-arguments -fPIC -fPIE -gdwarf-4 -Wall (Debian_Clang_11.0.1)
opt32_lowsizegcc -march=native -mtune=native -O2 -fwrapv -fPIC -fPIE -gdwarf-4 -Wall (10.2.1_20210110)
opt32_lowsizegcc -march=native -mtune=native -O3 -fwrapv -fPIC -fPIE -gdwarf-4 -Wall (10.2.1_20210110)
opt32_lowsizegcc -march=native -mtune=native -O -fwrapv -fPIC -fPIE -gdwarf-4 -Wall (10.2.1_20210110)
opt32_lowsizegcc -march=native -mtune=native -Os -fwrapv -fPIC -fPIE -gdwarf-4 -Wall (10.2.1_20210110)
opt64clang -march=native -O2 -fwrapv -Qunused-arguments -fPIC -fPIE -gdwarf-4 -Wall (Debian_Clang_11.0.1)
opt64clang -march=native -O3 -fwrapv -Qunused-arguments -fPIC -fPIE -gdwarf-4 -Wall (Debian_Clang_11.0.1)
opt64clang -march=native -O -fwrapv -Qunused-arguments -fPIC -fPIE -gdwarf-4 -Wall (Debian_Clang_11.0.1)
opt64clang -march=native -Os -fwrapv -Qunused-arguments -fPIC -fPIE -gdwarf-4 -Wall (Debian_Clang_11.0.1)
opt64clang -mcpu=native -O3 -fwrapv -Qunused-arguments -fPIC -fPIE -gdwarf-4 -Wall (Debian_Clang_11.0.1)
opt64gcc -march=native -mtune=native -O2 -fwrapv -fPIC -fPIE -gdwarf-4 -Wall (10.2.1_20210110)
opt64gcc -march=native -mtune=native -O3 -fwrapv -fPIC -fPIE -gdwarf-4 -Wall (10.2.1_20210110)
opt64gcc -march=native -mtune=native -O -fwrapv -fPIC -fPIE -gdwarf-4 -Wall (10.2.1_20210110)
opt64gcc -march=native -mtune=native -Os -fwrapv -fPIC -fPIE -gdwarf-4 -Wall (10.2.1_20210110)
opt64_lowsizeclang -march=native -O2 -fwrapv -Qunused-arguments -fPIC -fPIE -gdwarf-4 -Wall (Debian_Clang_11.0.1)
opt64_lowsizeclang -march=native -O3 -fwrapv -Qunused-arguments -fPIC -fPIE -gdwarf-4 -Wall (Debian_Clang_11.0.1)
opt64_lowsizeclang -march=native -O -fwrapv -Qunused-arguments -fPIC -fPIE -gdwarf-4 -Wall (Debian_Clang_11.0.1)
opt64_lowsizeclang -march=native -Os -fwrapv -Qunused-arguments -fPIC -fPIE -gdwarf-4 -Wall (Debian_Clang_11.0.1)
opt64_lowsizeclang -mcpu=native -O3 -fwrapv -Qunused-arguments -fPIC -fPIE -gdwarf-4 -Wall (Debian_Clang_11.0.1)
opt64_lowsizegcc -march=native -mtune=native -O2 -fwrapv -fPIC -fPIE -gdwarf-4 -Wall (10.2.1_20210110)
opt64_lowsizegcc -march=native -mtune=native -O3 -fwrapv -fPIC -fPIE -gdwarf-4 -Wall (10.2.1_20210110)
opt64_lowsizegcc -march=native -mtune=native -O -fwrapv -fPIC -fPIE -gdwarf-4 -Wall (10.2.1_20210110)
opt64_lowsizegcc -march=native -mtune=native -Os -fwrapv -fPIC -fPIE -gdwarf-4 -Wall (10.2.1_20210110)
opt8clang -march=native -O2 -fwrapv -Qunused-arguments -fPIC -fPIE -gdwarf-4 -Wall (Debian_Clang_11.0.1)
opt8clang -march=native -O3 -fwrapv -Qunused-arguments -fPIC -fPIE -gdwarf-4 -Wall (Debian_Clang_11.0.1)
opt8clang -march=native -O -fwrapv -Qunused-arguments -fPIC -fPIE -gdwarf-4 -Wall (Debian_Clang_11.0.1)
opt8clang -march=native -Os -fwrapv -Qunused-arguments -fPIC -fPIE -gdwarf-4 -Wall (Debian_Clang_11.0.1)
opt8clang -mcpu=native -O3 -fwrapv -Qunused-arguments -fPIC -fPIE -gdwarf-4 -Wall (Debian_Clang_11.0.1)
opt8gcc -march=native -mtune=native -O2 -fwrapv -fPIC -fPIE -gdwarf-4 -Wall (10.2.1_20210110)
opt8gcc -march=native -mtune=native -O3 -fwrapv -fPIC -fPIE -gdwarf-4 -Wall (10.2.1_20210110)
opt8gcc -march=native -mtune=native -O -fwrapv -fPIC -fPIE -gdwarf-4 -Wall (10.2.1_20210110)
opt8gcc -march=native -mtune=native -Os -fwrapv -fPIC -fPIE -gdwarf-4 -Wall (10.2.1_20210110)
opt8_lowsizeclang -march=native -O2 -fwrapv -Qunused-arguments -fPIC -fPIE -gdwarf-4 -Wall (Debian_Clang_11.0.1)
opt8_lowsizeclang -march=native -O3 -fwrapv -Qunused-arguments -fPIC -fPIE -gdwarf-4 -Wall (Debian_Clang_11.0.1)
opt8_lowsizeclang -march=native -O -fwrapv -Qunused-arguments -fPIC -fPIE -gdwarf-4 -Wall (Debian_Clang_11.0.1)
opt8_lowsizeclang -march=native -Os -fwrapv -Qunused-arguments -fPIC -fPIE -gdwarf-4 -Wall (Debian_Clang_11.0.1)
opt8_lowsizeclang -mcpu=native -O3 -fwrapv -Qunused-arguments -fPIC -fPIE -gdwarf-4 -Wall (Debian_Clang_11.0.1)
opt8_lowsizegcc -march=native -mtune=native -O2 -fwrapv -fPIC -fPIE -gdwarf-4 -Wall (10.2.1_20210110)
opt8_lowsizegcc -march=native -mtune=native -O3 -fwrapv -fPIC -fPIE -gdwarf-4 -Wall (10.2.1_20210110)
opt8_lowsizegcc -march=native -mtune=native -O -fwrapv -fPIC -fPIE -gdwarf-4 -Wall (10.2.1_20210110)
opt8_lowsizegcc -march=native -mtune=native -Os -fwrapv -fPIC -fPIE -gdwarf-4 -Wall (10.2.1_20210110)
refclang -march=native -O2 -fwrapv -Qunused-arguments -fPIC -fPIE -gdwarf-4 -Wall (Debian_Clang_11.0.1)
refclang -march=native -O3 -fwrapv -Qunused-arguments -fPIC -fPIE -gdwarf-4 -Wall (Debian_Clang_11.0.1)
refclang -march=native -O -fwrapv -Qunused-arguments -fPIC -fPIE -gdwarf-4 -Wall (Debian_Clang_11.0.1)
refclang -march=native -Os -fwrapv -Qunused-arguments -fPIC -fPIE -gdwarf-4 -Wall (Debian_Clang_11.0.1)
refclang -mcpu=native -O3 -fwrapv -Qunused-arguments -fPIC -fPIE -gdwarf-4 -Wall (Debian_Clang_11.0.1)
refgcc -march=native -mtune=native -O2 -fwrapv -fPIC -fPIE -gdwarf-4 -Wall (10.2.1_20210110)
refgcc -march=native -mtune=native -O3 -fwrapv -fPIC -fPIE -gdwarf-4 -Wall (10.2.1_20210110)
refgcc -march=native -mtune=native -O -fwrapv -fPIC -fPIE -gdwarf-4 -Wall (10.2.1_20210110)
refgcc -march=native -mtune=native -Os -fwrapv -fPIC -fPIE -gdwarf-4 -Wall (10.2.1_20210110)