Test results for amd64, tripwire, crypto_hash/lsh256

[Page version: 20261005 15:57:56]

Measurements for amd64, tripwire, crypto_hash Test results for amd64, tripwire, crypto_hash Test results for crypto_hash/lsh256
Computer: tripwire
Microarchitecture: amd64; Zen 5 (b00f21)
Architecture: amd64
CPU ID: AuthenticAMD-00b00f21-178bfbff
SUPERCOP version: 20261004
Operation: crypto_hash
Primitive: lsh256
TimeObject sizeTest sizeImplementationCompilerBenchmark dateSUPERCOP version
718912431 0 032439 1216 1656ssse3gcc -march=native -mtune=native -O3 -fwrapv -fPIC -fPIE -gdwarf-4 -Wall2026100420260831
732011357 0 025682 1192 1560ssse3gcc -march=native -mtune=native -Os -fwrapv -fPIC -fPIE -gdwarf-4 -Wall2026100420260831
740312545 0 027983 1216 1656ssse3gcc -march=native -mtune=native -O2 -fwrapv -fPIC -fPIE -gdwarf-4 -Wall2026100420260831
744212080 0 027350 1208 1592ssse3gcc -march=native -mtune=native -O -fwrapv -fPIC -fPIE -gdwarf-4 -Wall2026100420260831
78888895 0 026071 1216 1656avx2gcc -march=native -mtune=native -O2 -fwrapv -fPIC -fPIE -gdwarf-4 -Wall2026100420260831
78898743 0 030519 1216 1656avx2gcc -march=native -mtune=native -O3 -fwrapv -fPIC -fPIE -gdwarf-4 -Wall2026100420260831
79447841 0 023914 1192 1560avx2gcc -march=native -mtune=native -Os -fwrapv -fPIC -fPIE -gdwarf-4 -Wall2026100420260831
80098646 0 025718 1208 1592avx2gcc -march=native -mtune=native -O -fwrapv -fPIC -fPIE -gdwarf-4 -Wall2026100420260831
83962063 336 01834324 148160 10968cryptoppg++ -march=native -mtune=native -Os -fwrapv -fPIC -fPIE -gdwarf-4 -Wall2026100420260831
84782539 336 01837112 148152 11096cryptoppg++ -march=native -mtune=native -O2 -fwrapv -fPIC -fPIE -gdwarf-4 -Wall2026100420260831
84782539 336 01840488 148152 11096cryptoppg++ -march=native -mtune=native -O3 -fwrapv -fPIC -fPIE -gdwarf-4 -Wall2026100420260831
120372445 336 01836542 148152 11032cryptoppg++ -march=native -mtune=native -O -fwrapv -fPIC -fPIE -gdwarf-4 -Wall2026100420260831
1320224677 0 032338 1192 1560refgcc -march=native -mtune=native -Os -fwrapv -fPIC -fPIE -gdwarf-4 -Wall2026100420260831
1363333739 0 038527 1216 1656refgcc -march=native -mtune=native -O2 -fwrapv -fPIC -fPIE -gdwarf-4 -Wall2026100420260831
1364935689 0 044023 1216 1656refgcc -march=native -mtune=native -O3 -fwrapv -fPIC -fPIE -gdwarf-4 -Wall2026100420260831
1442717866 0 030294 1208 1592sse2gcc -march=native -mtune=native -O -fwrapv -fPIC -fPIE -gdwarf-4 -Wall2026100420260831
1455917745 0 035055 1216 1656sse2gcc -march=native -mtune=native -O3 -fwrapv -fPIC -fPIE -gdwarf-4 -Wall2026100420260831
1456417745 0 030567 1216 1656sse2gcc -march=native -mtune=native -O2 -fwrapv -fPIC -fPIE -gdwarf-4 -Wall2026100420260831
1470829232 0 035966 1208 1592refgcc -march=native -mtune=native -O -fwrapv -fPIC -fPIE -gdwarf-4 -Wall2026100420260831
1678816297 0 028114 1192 1560sse2gcc -march=native -mtune=native -Os -fwrapv -fPIC -fPIE -gdwarf-4 -Wall2026100420260831

Compiler output


try.c: In file included from try-anything-timecop.c:3:
try.c: try-anything.c:26:10: fatal error: valgrind/memcheck.h: No such file or directory
try.c:    26 | #include <valgrind/memcheck.h>
try.c:       |          ^~~~~~~~~~~~~~~~~~~~~
try.c: compilation terminated.

Number of similar (implementation,compiler) pairs: 16, namely:
ImplementationCompiler
avx2gcc -march=native -mtune=native -O2 -fwrapv -fPIC -fPIE -gdwarf-4 -Wall (14.2.0)
avx2gcc -march=native -mtune=native -O3 -fwrapv -fPIC -fPIE -gdwarf-4 -Wall (14.2.0)
avx2gcc -march=native -mtune=native -O -fwrapv -fPIC -fPIE -gdwarf-4 -Wall (14.2.0)
avx2gcc -march=native -mtune=native -Os -fwrapv -fPIC -fPIE -gdwarf-4 -Wall (14.2.0)
refgcc -march=native -mtune=native -O2 -fwrapv -fPIC -fPIE -gdwarf-4 -Wall (14.2.0)
refgcc -march=native -mtune=native -O3 -fwrapv -fPIC -fPIE -gdwarf-4 -Wall (14.2.0)
refgcc -march=native -mtune=native -O -fwrapv -fPIC -fPIE -gdwarf-4 -Wall (14.2.0)
refgcc -march=native -mtune=native -Os -fwrapv -fPIC -fPIE -gdwarf-4 -Wall (14.2.0)
sse2gcc -march=native -mtune=native -O2 -fwrapv -fPIC -fPIE -gdwarf-4 -Wall (14.2.0)
sse2gcc -march=native -mtune=native -O3 -fwrapv -fPIC -fPIE -gdwarf-4 -Wall (14.2.0)
sse2gcc -march=native -mtune=native -O -fwrapv -fPIC -fPIE -gdwarf-4 -Wall (14.2.0)
sse2gcc -march=native -mtune=native -Os -fwrapv -fPIC -fPIE -gdwarf-4 -Wall (14.2.0)
ssse3gcc -march=native -mtune=native -O2 -fwrapv -fPIC -fPIE -gdwarf-4 -Wall (14.2.0)
ssse3gcc -march=native -mtune=native -O3 -fwrapv -fPIC -fPIE -gdwarf-4 -Wall (14.2.0)
ssse3gcc -march=native -mtune=native -O -fwrapv -fPIC -fPIE -gdwarf-4 -Wall (14.2.0)
ssse3gcc -march=native -mtune=native -Os -fwrapv -fPIC -fPIE -gdwarf-4 -Wall (14.2.0)

Compiler output


try.cpp: In file included from try-anything-timecop.cpp:3:
try.cpp: try-anything.cpp:26:10: fatal error: valgrind/memcheck.h: No such file or directory
try.cpp:    26 | #include <valgrind/memcheck.h>
try.cpp:       |          ^~~~~~~~~~~~~~~~~~~~~
try.cpp: compilation terminated.

Number of similar (implementation,compiler) pairs: 4, namely:
ImplementationCompiler
cryptoppg++ -march=native -mtune=native -O2 -fwrapv -fPIC -fPIE -gdwarf-4 -Wall (14.2.0)
cryptoppg++ -march=native -mtune=native -O3 -fwrapv -fPIC -fPIE -gdwarf-4 -Wall (14.2.0)
cryptoppg++ -march=native -mtune=native -O -fwrapv -fPIC -fPIE -gdwarf-4 -Wall (14.2.0)
cryptoppg++ -march=native -mtune=native -Os -fwrapv -fPIC -fPIE -gdwarf-4 -Wall (14.2.0)

Compiler output


lsh-impl.c: lsh-impl.c:125:39: warning: 'g_MsgWordPermInfo' defined but not used [-Wunused-const-variable=]
lsh-impl.c:   125 | static const LSH_ALIGNED_(32) lsh_u32 g_MsgWordPermInfo[8] = {
lsh-impl.c:       |                                       ^~~~~~~~~~~~~~~~~
lsh-impl.c: In file included from /usr/lib/gcc/x86_64-linux-gnu/14/include/x86intrin.h:38,
lsh-impl.c:                  from lsh-impl.c:34:
lsh-impl.c: /usr/lib/gcc/x86_64-linux-gnu/14/include/xopintrin.h: In function 'rotate_blk_even_alpha':
lsh-impl.c: /usr/lib/gcc/x86_64-linux-gnu/14/include/xopintrin.h:266:1: error: inlining failed in call to 'always_inline' '_mm_roti_epi32': target specific option mismatch
lsh-impl.c:   266 | _mm_roti_epi32(__m128i __A, const int __B)
lsh-impl.c:       | ^~~~~~~~~~~~~~
lsh-impl.c: lsh-impl.c:204:17: note: called from here
lsh-impl.c:   204 |         cv[1] = _mm_roti_epi32(cv[1], ROT_EVEN_ALPHA);
lsh-impl.c:       |                 ^~~~~~~~~~~~~~~~~~~~~~~~~~~~~~~~~~~~~
lsh-impl.c: /usr/lib/gcc/x86_64-linux-gnu/14/include/xopintrin.h:266:1: error: inlining failed in call to 'always_inline' '_mm_roti_epi32': target specific option mismatch
lsh-impl.c:   266 | _mm_roti_epi32(__m128i __A, const int __B)
lsh-impl.c:       | ^~~~~~~~~~~~~~
lsh-impl.c: lsh-impl.c:203:17: note: called from here
lsh-impl.c:   203 |         cv[0] = _mm_roti_epi32(cv[0], ROT_EVEN_ALPHA);
lsh-impl.c:       |                 ^~~~~~~~~~~~~~~~~~~~~~~~~~~~~~~~~~~~~

Number of similar (implementation,compiler) pairs: 4, namely:
ImplementationCompiler
xopgcc -march=native -mtune=native -O2 -fwrapv -fPIC -fPIE -gdwarf-4 -Wall (14.2.0)
xopgcc -march=native -mtune=native -O3 -fwrapv -fPIC -fPIE -gdwarf-4 -Wall (14.2.0)
xopgcc -march=native -mtune=native -O -fwrapv -fPIC -fPIE -gdwarf-4 -Wall (14.2.0)
xopgcc -march=native -mtune=native -Os -fwrapv -fPIC -fPIE -gdwarf-4 -Wall (14.2.0)

Namespace violations


lsh-impl.o lsh256_digest T
lsh-impl.o lsh256_final T
lsh-impl.o lsh256_init T
lsh-impl.o lsh256_update T
lsh.o lsh256_digest T
lsh.o lsh256_final T
lsh.o lsh256_init T
lsh.o lsh256_update T

Number of similar (implementation,compiler) pairs: 16, namely:
ImplementationCompiler
avx2gcc -march=native -mtune=native -O2 -fwrapv -fPIC -fPIE -gdwarf-4 -Wall (14.2.0)
avx2gcc -march=native -mtune=native -O3 -fwrapv -fPIC -fPIE -gdwarf-4 -Wall (14.2.0)
avx2gcc -march=native -mtune=native -O -fwrapv -fPIC -fPIE -gdwarf-4 -Wall (14.2.0)
avx2gcc -march=native -mtune=native -Os -fwrapv -fPIC -fPIE -gdwarf-4 -Wall (14.2.0)
refgcc -march=native -mtune=native -O2 -fwrapv -fPIC -fPIE -gdwarf-4 -Wall (14.2.0)
refgcc -march=native -mtune=native -O3 -fwrapv -fPIC -fPIE -gdwarf-4 -Wall (14.2.0)
refgcc -march=native -mtune=native -O -fwrapv -fPIC -fPIE -gdwarf-4 -Wall (14.2.0)
refgcc -march=native -mtune=native -Os -fwrapv -fPIC -fPIE -gdwarf-4 -Wall (14.2.0)
sse2gcc -march=native -mtune=native -O2 -fwrapv -fPIC -fPIE -gdwarf-4 -Wall (14.2.0)
sse2gcc -march=native -mtune=native -O3 -fwrapv -fPIC -fPIE -gdwarf-4 -Wall (14.2.0)
sse2gcc -march=native -mtune=native -O -fwrapv -fPIC -fPIE -gdwarf-4 -Wall (14.2.0)
sse2gcc -march=native -mtune=native -Os -fwrapv -fPIC -fPIE -gdwarf-4 -Wall (14.2.0)
ssse3gcc -march=native -mtune=native -O2 -fwrapv -fPIC -fPIE -gdwarf-4 -Wall (14.2.0)
ssse3gcc -march=native -mtune=native -O3 -fwrapv -fPIC -fPIE -gdwarf-4 -Wall (14.2.0)
ssse3gcc -march=native -mtune=native -O -fwrapv -fPIC -fPIE -gdwarf-4 -Wall (14.2.0)
ssse3gcc -march=native -mtune=native -Os -fwrapv -fPIC -fPIE -gdwarf-4 -Wall (14.2.0)

TIMECOP error (can be valgrind bug)


error 127
timeout: failed to run command 'valgrind': No such file or directory

Number of similar (implementation,compiler) pairs: 20, namely:
ImplementationCompiler
avx2gcc -march=native -mtune=native -O2 -fwrapv -fPIC -fPIE -gdwarf-4 -Wall (14.2.0)
avx2gcc -march=native -mtune=native -O3 -fwrapv -fPIC -fPIE -gdwarf-4 -Wall (14.2.0)
avx2gcc -march=native -mtune=native -O -fwrapv -fPIC -fPIE -gdwarf-4 -Wall (14.2.0)
avx2gcc -march=native -mtune=native -Os -fwrapv -fPIC -fPIE -gdwarf-4 -Wall (14.2.0)
cryptoppg++ -march=native -mtune=native -O2 -fwrapv -fPIC -fPIE -gdwarf-4 -Wall (14.2.0)
cryptoppg++ -march=native -mtune=native -O3 -fwrapv -fPIC -fPIE -gdwarf-4 -Wall (14.2.0)
cryptoppg++ -march=native -mtune=native -O -fwrapv -fPIC -fPIE -gdwarf-4 -Wall (14.2.0)
cryptoppg++ -march=native -mtune=native -Os -fwrapv -fPIC -fPIE -gdwarf-4 -Wall (14.2.0)
refgcc -march=native -mtune=native -O2 -fwrapv -fPIC -fPIE -gdwarf-4 -Wall (14.2.0)
refgcc -march=native -mtune=native -O3 -fwrapv -fPIC -fPIE -gdwarf-4 -Wall (14.2.0)
refgcc -march=native -mtune=native -O -fwrapv -fPIC -fPIE -gdwarf-4 -Wall (14.2.0)
refgcc -march=native -mtune=native -Os -fwrapv -fPIC -fPIE -gdwarf-4 -Wall (14.2.0)
sse2gcc -march=native -mtune=native -O2 -fwrapv -fPIC -fPIE -gdwarf-4 -Wall (14.2.0)
sse2gcc -march=native -mtune=native -O3 -fwrapv -fPIC -fPIE -gdwarf-4 -Wall (14.2.0)
sse2gcc -march=native -mtune=native -O -fwrapv -fPIC -fPIE -gdwarf-4 -Wall (14.2.0)
sse2gcc -march=native -mtune=native -Os -fwrapv -fPIC -fPIE -gdwarf-4 -Wall (14.2.0)
ssse3gcc -march=native -mtune=native -O2 -fwrapv -fPIC -fPIE -gdwarf-4 -Wall (14.2.0)
ssse3gcc -march=native -mtune=native -O3 -fwrapv -fPIC -fPIE -gdwarf-4 -Wall (14.2.0)
ssse3gcc -march=native -mtune=native -O -fwrapv -fPIC -fPIE -gdwarf-4 -Wall (14.2.0)
ssse3gcc -march=native -mtune=native -Os -fwrapv -fPIC -fPIE -gdwarf-4 -Wall (14.2.0)