Test results for amd64, tripwire, crypto_hash/groestl256

[Page version: 20261004 16:18:08]

Measurements for amd64, tripwire, crypto_hash Test results for amd64, tripwire, crypto_hash Test results for crypto_hash/groestl256
Computer: tripwire
Microarchitecture: amd64; Zen 5 (b00f21)
Architecture: amd64
CPU ID: AuthenticAMD-00b00f21-178bfbff
SUPERCOP version: 20260831
Operation: crypto_hash
Primitive: groestl256
TimeObject sizeTest sizeImplementationCompilerBenchmark dateSUPERCOP version
1008918445 0 97644782 1224 2648T:aesni-intrgcc -march=native -mtune=native -O3 -fwrapv -fPIC -fPIE -gdwarf-4 -Wall2026093020260831
1012816586 0 97638382 1224 2648T:aesni-intrgcc -march=native -mtune=native -O2 -fwrapv -fPIC -fPIE -gdwarf-4 -Wall2026093020260831
1013319753 0 97646062 1224 2648T:avx-intrgcc -march=native -mtune=native -O3 -fwrapv -fPIC -fPIE -gdwarf-4 -Wall2026093020260831
1019417802 0 97639598 1224 2648T:avx-intrgcc -march=native -mtune=native -O2 -fwrapv -fPIC -fPIE -gdwarf-4 -Wall2026093020260831
1022616489 0 97637957 1216 2584T:aesni-intrgcc -march=native -mtune=native -O -fwrapv -fPIC -fPIE -gdwarf-4 -Wall2026093020260831
1024118025 0 97639493 1216 2584T:avx-intrgcc -march=native -mtune=native -O -fwrapv -fPIC -fPIE -gdwarf-4 -Wall2026093020260831
1027817016 0 97637097 1200 2552T:aesni-intrgcc -march=native -mtune=native -Os -fwrapv -fPIC -fPIE -gdwarf-4 -Wall2026093020260831
1052717796 0 97637865 1200 2552T:avx-intrgcc -march=native -mtune=native -Os -fwrapv -fPIC -fPIE -gdwarf-4 -Wall2026093020260831
1975438805 0 126465102 1224 2936T:vperm-intrgcc -march=native -mtune=native -O3 -fwrapv -fPIC -fPIE -gdwarf-4 -Wall2026093020260831
2004436237 0 126456313 1200 2840T:vperm-intrgcc -march=native -mtune=native -Os -fwrapv -fPIC -fPIE -gdwarf-4 -Wall2026093020260831
2013835945 0 126457413 1216 2872T:vperm-intrgcc -march=native -mtune=native -O -fwrapv -fPIC -fPIE -gdwarf-4 -Wall2026093020260831
2070336653 0 126458494 1224 2936T:vperm-intrgcc -march=native -mtune=native -O2 -fwrapv -fPIC -fPIE -gdwarf-4 -Wall2026093020260831
2243844188 0 064346 1192 1560T:sphlib-adaptedgcc -march=native -mtune=native -Os -fwrapv -fPIC -fPIE -gdwarf-4 -Wall2026093020260831
2251541323 0 061402 1192 1560T:sphlibgcc -march=native -mtune=native -Os -fwrapv -fPIC -fPIE -gdwarf-4 -Wall2026093020260831
2314047946 0 074207 1216 1656T:sphlibgcc -march=native -mtune=native -O3 -fwrapv -fPIC -fPIE -gdwarf-4 -Wall2026093020260831
2335750650 0 076959 1216 1656T:sphlib-adaptedgcc -march=native -mtune=native -O3 -fwrapv -fPIC -fPIE -gdwarf-4 -Wall2026093020260831
2470749834 0 071575 1216 1656T:sphlib-adaptedgcc -march=native -mtune=native -O2 -fwrapv -fPIC -fPIE -gdwarf-4 -Wall2026093020260831
2477247258 0 069015 1216 1656T:sphlibgcc -march=native -mtune=native -O2 -fwrapv -fPIC -fPIE -gdwarf-4 -Wall2026093020260831
2661617852 0 037978 1192 1560T:sphlib-smallgcc -march=native -mtune=native -Os -fwrapv -fPIC -fPIE -gdwarf-4 -Wall2026093020260831
2664822842 0 049183 1216 1656T:sphlib-smallgcc -march=native -mtune=native -O3 -fwrapv -fPIC -fPIE -gdwarf-4 -Wall2026093020260831
2665919738 0 041495 1216 1656T:sphlib-smallgcc -march=native -mtune=native -O2 -fwrapv -fPIC -fPIE -gdwarf-4 -Wall2026093020260831
2702966610 0 088166 1224 1592T:mmxgcc -march=native -mtune=native -O -fwrapv -fPIC -fPIE -gdwarf-4 -Wall2026093020260831
2726467541 0 089423 1232 1656T:mmxgcc -march=native -mtune=native -O2 -fwrapv -fPIC -fPIE -gdwarf-4 -Wall2026093020260831
3492549890 0 071399 1216 1592T:sphlibgcc -march=native -mtune=native -O -fwrapv -fPIC -fPIE -gdwarf-4 -Wall2026093020260831
3554854858 0 076391 1216 1592T:sphlib-adaptedgcc -march=native -mtune=native -O -fwrapv -fPIC -fPIE -gdwarf-4 -Wall2026093020260831
3728819946 0 041511 1216 1592T:sphlib-smallgcc -march=native -mtune=native -O -fwrapv -fPIC -fPIE -gdwarf-4 -Wall2026093020260831
4808722674 0 044230 1224 1592T:opt32gcc -march=native -mtune=native -O -fwrapv -fPIC -fPIE -gdwarf-4 -Wall2026093020260831
4875020972 0 041226 1208 1560T:opt32gcc -march=native -mtune=native -Os -fwrapv -fPIC -fPIE -gdwarf-4 -Wall2026093020260831
5195525298 0 051647 1232 1656T:opt32gcc -march=native -mtune=native -O3 -fwrapv -fPIC -fPIE -gdwarf-4 -Wall2026093020260831
5228123221 0 045095 1232 1656T:opt32gcc -march=native -mtune=native -O2 -fwrapv -fPIC -fPIE -gdwarf-4 -Wall2026093020260831
5372276885 0 0103231 1232 1656T:mmxgcc -march=native -mtune=native -O3 -fwrapv -fPIC -fPIE -gdwarf-4 -Wall2026093020260831
6917664779 0 084970 1208 1560T:mmxgcc -march=native -mtune=native -Os -fwrapv -fPIC -fPIE -gdwarf-4 -Wall2026093020260831
738149953 0 036231 1216 1656T:32bit-2ktablegcc -march=native -mtune=native -O3 -fwrapv -fPIC -fPIE -gdwarf-4 -Wall2026093020260831
739399537 0 031295 1216 1656T:32bit-2ktablegcc -march=native -mtune=native -O2 -fwrapv -fPIC -fPIE -gdwarf-4 -Wall2026093020260831
1111825614 0 031863 1216 1656T:32bit-bytesliced-c-fastgcc -march=native -mtune=native -O3 -fwrapv -fPIC -fPIE -gdwarf-4 -Wall2026093020260831
1113043812 0 025559 1216 1656T:32bit-bytesliced-c-fastgcc -march=native -mtune=native -O2 -fwrapv -fPIC -fPIE -gdwarf-4 -Wall2026093020260831
1141068970 0 029010 1192 1560T:32bit-2ktablegcc -march=native -mtune=native -Os -fwrapv -fPIC -fPIE -gdwarf-4 -Wall2026093020260831
1285529970 0 031350 1208 1592T:32bit-2ktablegcc -march=native -mtune=native -O -fwrapv -fPIC -fPIE -gdwarf-4 -Wall2026093020260831
1354264354 0 025678 1208 1592T:8bit_cgcc -march=native -mtune=native -O -fwrapv -fPIC -fPIE -gdwarf-4 -Wall2026093020260831
1362902630 0 022730 1192 1560T:32bit-bytesliced-c-fastgcc -march=native -mtune=native -Os -fwrapv -fPIC -fPIE -gdwarf-4 -Wall2026093020260831
1405173225 0 024694 1208 1592T:32bit-bytesliced-c-fastgcc -march=native -mtune=native -O -fwrapv -fPIC -fPIE -gdwarf-4 -Wall2026093020260831
1650404643 0 026247 1216 1656T:8bit_cgcc -march=native -mtune=native -O2 -fwrapv -fPIC -fPIE -gdwarf-4 -Wall2026093020260831
1686246591 0 032727 1216 1656T:8bit_cgcc -march=native -mtune=native -O3 -fwrapv -fPIC -fPIE -gdwarf-4 -Wall2026093020260831
1766513969 0 023954 1192 1560T:8bit_cgcc -march=native -mtune=native -Os -fwrapv -fPIC -fPIE -gdwarf-4 -Wall2026093020260831
1871452237 0 023975 1216 1656T:32bit-bytesliced-c-smallgcc -march=native -mtune=native -O2 -fwrapv -fPIC -fPIE -gdwarf-4 -Wall2026093020260831
1914825392 0 031631 1216 1656T:32bit-bytesliced-c-smallgcc -march=native -mtune=native -O3 -fwrapv -fPIC -fPIE -gdwarf-4 -Wall2026093020260831
1987831708 0 021674 1192 1560T:32bit-bytesliced-c-smallgcc -march=native -mtune=native -Os -fwrapv -fPIC -fPIE -gdwarf-4 -Wall2026093020260831
2897432714 0 024102 1208 1592T:32bit-bytesliced-c-smallgcc -march=native -mtune=native -O -fwrapv -fPIC -fPIE -gdwarf-4 -Wall2026093020260831

Test failure


error 139
Segmentation fault

Number of similar (implementation,compiler) pairs: 8, namely:
ImplementationCompiler
T:aesnigcc -march=native -mtune=native -O2 -fwrapv -fPIC -fPIE -gdwarf-4 -Wall (14.2.0)
T:aesnigcc -march=native -mtune=native -O3 -fwrapv -fPIC -fPIE -gdwarf-4 -Wall (14.2.0)
T:aesnigcc -march=native -mtune=native -O -fwrapv -fPIC -fPIE -gdwarf-4 -Wall (14.2.0)
T:aesnigcc -march=native -mtune=native -Os -fwrapv -fPIC -fPIE -gdwarf-4 -Wall (14.2.0)
T:avxgcc -march=native -mtune=native -O2 -fwrapv -fPIC -fPIE -gdwarf-4 -Wall (14.2.0)
T:avxgcc -march=native -mtune=native -O3 -fwrapv -fPIC -fPIE -gdwarf-4 -Wall (14.2.0)
T:avxgcc -march=native -mtune=native -O -fwrapv -fPIC -fPIE -gdwarf-4 -Wall (14.2.0)
T:avxgcc -march=native -mtune=native -Os -fwrapv -fPIC -fPIE -gdwarf-4 -Wall (14.2.0)

Compiler output


hash.c: hash.c: In function 'Init':
hash.c: hash.c:104:21: warning: the comparison will always evaluate as 'false' for the address of 'chaining' will never be NULL [-Waddress]
hash.c:   104 |   if (ctx->chaining == NULL || ctx->buffer == NULL)
hash.c:       |                     ^~
hash.c: In file included from groestl-asm-aes.h:10,
hash.c:                  from hash.c:13:
hash.c: hash.h:83:38: note: 'chaining' declared here
hash.c:    83 |   __attribute__ ((aligned (32))) u64 chaining[SIZE/8];      /* actual state */
hash.c:       |                                      ^~~~~~~~
hash.c: hash.c:104:44: warning: the comparison will always evaluate as 'false' for the address of 'buffer' will never be NULL [-Waddress]
hash.c:   104 |   if (ctx->chaining == NULL || ctx->buffer == NULL)
hash.c:       |                                            ^~
hash.c: hash.h:84:46: note: 'buffer' declared here
hash.c:    84 |   __attribute__ ((aligned (32))) BitSequence buffer[SIZE];  /* data buffer */
hash.c:       |                                              ^~~~~~

Number of similar (implementation,compiler) pairs: 4, namely:
ImplementationCompiler
T:aesnigcc -march=native -mtune=native -O2 -fwrapv -fPIC -fPIE -gdwarf-4 -Wall (14.2.0)
T:aesnigcc -march=native -mtune=native -O3 -fwrapv -fPIC -fPIE -gdwarf-4 -Wall (14.2.0)
T:aesnigcc -march=native -mtune=native -O -fwrapv -fPIC -fPIE -gdwarf-4 -Wall (14.2.0)
T:aesnigcc -march=native -mtune=native -Os -fwrapv -fPIC -fPIE -gdwarf-4 -Wall (14.2.0)

Compiler output


hash.c: hash.c: In function 'Init':
hash.c: hash.c:104:21: warning: the comparison will always evaluate as 'false' for the address of 'chaining' will never be NULL [-Waddress]
hash.c:   104 |   if (ctx->chaining == NULL || ctx->buffer == NULL)
hash.c:       |                     ^~
hash.c: In file included from groestl-intr-aes.h:12,
hash.c:                  from hash.c:28:
hash.c: hash.h:83:38: note: 'chaining' declared here
hash.c:    83 |   __attribute__ ((aligned (32))) u64 chaining[SIZE/8];      /* actual state */
hash.c:       |                                      ^~~~~~~~
hash.c: hash.c:104:44: warning: the comparison will always evaluate as 'false' for the address of 'buffer' will never be NULL [-Waddress]
hash.c:   104 |   if (ctx->chaining == NULL || ctx->buffer == NULL)
hash.c:       |                                            ^~
hash.c: hash.h:84:46: note: 'buffer' declared here
hash.c:    84 |   __attribute__ ((aligned (32))) BitSequence buffer[SIZE];  /* data buffer */
hash.c:       |                                              ^~~~~~

Number of similar (implementation,compiler) pairs: 4, namely:
ImplementationCompiler
T:aesni-intrgcc -march=native -mtune=native -O2 -fwrapv -fPIC -fPIE -gdwarf-4 -Wall (14.2.0)
T:aesni-intrgcc -march=native -mtune=native -O3 -fwrapv -fPIC -fPIE -gdwarf-4 -Wall (14.2.0)
T:aesni-intrgcc -march=native -mtune=native -O -fwrapv -fPIC -fPIE -gdwarf-4 -Wall (14.2.0)
T:aesni-intrgcc -march=native -mtune=native -Os -fwrapv -fPIC -fPIE -gdwarf-4 -Wall (14.2.0)

Compiler output


hash.c: hash.c: In function 'Init':
hash.c: hash.c:69:21: warning: the comparison will always evaluate as 'false' for the address of 'chaining' will never be NULL [-Waddress]
hash.c:    69 |   if (ctx->chaining == NULL || ctx->buffer == NULL)
hash.c:       |                     ^~
hash.c: In file included from groestl-asm-avx.h:10,
hash.c:                  from hash.c:9:
hash.c: hash.h:81:38: note: 'chaining' declared here
hash.c:    81 |   __attribute__ ((aligned (32))) u64 chaining[SIZE/8];      /* actual state */
hash.c:       |                                      ^~~~~~~~
hash.c: hash.c:69:44: warning: the comparison will always evaluate as 'false' for the address of 'buffer' will never be NULL [-Waddress]
hash.c:    69 |   if (ctx->chaining == NULL || ctx->buffer == NULL)
hash.c:       |                                            ^~
hash.c: hash.h:82:46: note: 'buffer' declared here
hash.c:    82 |   __attribute__ ((aligned (32))) BitSequence buffer[SIZE];  /* data buffer */
hash.c:       |                                              ^~~~~~

Number of similar (implementation,compiler) pairs: 4, namely:
ImplementationCompiler
T:avxgcc -march=native -mtune=native -O2 -fwrapv -fPIC -fPIE -gdwarf-4 -Wall (14.2.0)
T:avxgcc -march=native -mtune=native -O3 -fwrapv -fPIC -fPIE -gdwarf-4 -Wall (14.2.0)
T:avxgcc -march=native -mtune=native -O -fwrapv -fPIC -fPIE -gdwarf-4 -Wall (14.2.0)
T:avxgcc -march=native -mtune=native -Os -fwrapv -fPIC -fPIE -gdwarf-4 -Wall (14.2.0)

Compiler output


hash.c: hash.c: In function 'Init':
hash.c: hash.c:69:21: warning: the comparison will always evaluate as 'false' for the address of 'chaining' will never be NULL [-Waddress]
hash.c:    69 |   if (ctx->chaining == NULL || ctx->buffer == NULL)
hash.c:       |                     ^~
hash.c: In file included from groestl-intr-avx.h:13,
hash.c:                  from hash.c:9:
hash.c: hash.h:81:38: note: 'chaining' declared here
hash.c:    81 |   __attribute__ ((aligned (32))) u64 chaining[SIZE/8];      /* actual state */
hash.c:       |                                      ^~~~~~~~
hash.c: hash.c:69:44: warning: the comparison will always evaluate as 'false' for the address of 'buffer' will never be NULL [-Waddress]
hash.c:    69 |   if (ctx->chaining == NULL || ctx->buffer == NULL)
hash.c:       |                                            ^~
hash.c: hash.h:82:46: note: 'buffer' declared here
hash.c:    82 |   __attribute__ ((aligned (32))) BitSequence buffer[SIZE];  /* data buffer */
hash.c:       |                                              ^~~~~~

Number of similar (implementation,compiler) pairs: 4, namely:
ImplementationCompiler
T:avx-intrgcc -march=native -mtune=native -O2 -fwrapv -fPIC -fPIE -gdwarf-4 -Wall (14.2.0)
T:avx-intrgcc -march=native -mtune=native -O3 -fwrapv -fPIC -fPIE -gdwarf-4 -Wall (14.2.0)
T:avx-intrgcc -march=native -mtune=native -O -fwrapv -fPIC -fPIE -gdwarf-4 -Wall (14.2.0)
T:avx-intrgcc -march=native -mtune=native -Os -fwrapv -fPIC -fPIE -gdwarf-4 -Wall (14.2.0)

Compiler output


try.c: /usr/bin/ld: libcrypto_hash_groestl256.a(hash.o): in function `Transform':
try.c: .../supercop-data/tripwire/amd64/try/c/gcc_-march=native_-mtune=native_-O2_-fwrapv_-fPIC_-fPIE_-gdwarf-4_-Wall/timingleaks/crypto_hash/groestl256/core2duo/work/hash.c:37:(.text+0x...): undefined reference to `Q512ASM'
try.c: /usr/bin/ld: .../supercop-data/tripwire/amd64/try/c/gcc_-march=native_-mtune=native_-O2_-fwrapv_-fPIC_-fPIE_-gdwarf-4_-Wall/timingleaks/crypto_hash/groestl256/core2duo/work/hash.c:38:(.text+0x...): undefined reference to `P512ASM'
try.c: /usr/bin/ld: libcrypto_hash_groestl256.a(hash.o): in function `OutputTransformation':
try.c: .../supercop-data/tripwire/amd64/try/c/gcc_-march=native_-mtune=native_-O2_-fwrapv_-fPIC_-fPIE_-gdwarf-4_-Wall/timingleaks/crypto_hash/groestl256/core2duo/work/hash.c:62:(.text+0x...): undefined reference to `P512ASM'
try.c: collect2: error: ld returned 1 exit status

Number of similar (implementation,compiler) pairs: 1, namely:
ImplementationCompiler
T:core2duogcc -march=native -mtune=native -O2 -fwrapv -fPIC -fPIE -gdwarf-4 -Wall (14.2.0)

Compiler output


try.c: /usr/bin/ld: libcrypto_hash_groestl256.a(hash.o): in function `Transform':
try.c: .../supercop-data/tripwire/amd64/try/c/gcc_-march=native_-mtune=native_-O3_-fwrapv_-fPIC_-fPIE_-gdwarf-4_-Wall/timingleaks/crypto_hash/groestl256/core2duo/work/hash.c:37:(.text+0x...): undefined reference to `Q512ASM'
try.c: /usr/bin/ld: .../supercop-data/tripwire/amd64/try/c/gcc_-march=native_-mtune=native_-O3_-fwrapv_-fPIC_-fPIE_-gdwarf-4_-Wall/timingleaks/crypto_hash/groestl256/core2duo/work/hash.c:38:(.text+0x...): undefined reference to `P512ASM'
try.c: /usr/bin/ld: .../supercop-data/tripwire/amd64/try/c/gcc_-march=native_-mtune=native_-O3_-fwrapv_-fPIC_-fPIE_-gdwarf-4_-Wall/timingleaks/crypto_hash/groestl256/core2duo/work/hash.c:37:(.text+0x...): undefined reference to `Q512ASM'
try.c: /usr/bin/ld: .../supercop-data/tripwire/amd64/try/c/gcc_-march=native_-mtune=native_-O3_-fwrapv_-fPIC_-fPIE_-gdwarf-4_-Wall/timingleaks/crypto_hash/groestl256/core2duo/work/hash.c:38:(.text+0x...): undefined reference to `P512ASM'
try.c: /usr/bin/ld: libcrypto_hash_groestl256.a(hash.o): in function `OutputTransformation':
try.c: .../supercop-data/tripwire/amd64/try/c/gcc_-march=native_-mtune=native_-O3_-fwrapv_-fPIC_-fPIE_-gdwarf-4_-Wall/timingleaks/crypto_hash/groestl256/core2duo/work/hash.c:62:(.text+0x...): undefined reference to `P512ASM'
try.c: /usr/bin/ld: .../supercop-data/tripwire/amd64/try/c/gcc_-march=native_-mtune=native_-O3_-fwrapv_-fPIC_-fPIE_-gdwarf-4_-Wall/timingleaks/crypto_hash/groestl256/core2duo/work/hash.c:62:(.text+0x...): undefined reference to `P512ASM'
try.c: /usr/bin/ld: .../supercop-data/tripwire/amd64/try/c/gcc_-march=native_-mtune=native_-O3_-fwrapv_-fPIC_-fPIE_-gdwarf-4_-Wall/timingleaks/crypto_hash/groestl256/core2duo/work/hash.c:62:(.text+0x...): undefined reference to `P512ASM'
try.c: collect2: error: ld returned 1 exit status

Number of similar (implementation,compiler) pairs: 1, namely:
ImplementationCompiler
T:core2duogcc -march=native -mtune=native -O3 -fwrapv -fPIC -fPIE -gdwarf-4 -Wall (14.2.0)

Compiler output


try.c: /usr/bin/ld: libcrypto_hash_groestl256.a(hash.o): in function `Transform':
try.c: .../supercop-data/tripwire/amd64/try/c/gcc_-march=native_-mtune=native_-O_-fwrapv_-fPIC_-fPIE_-gdwarf-4_-Wall/timingleaks/crypto_hash/groestl256/core2duo/work/hash.c:37:(.text+0x...): undefined reference to `Q512ASM'
try.c: /usr/bin/ld: .../supercop-data/tripwire/amd64/try/c/gcc_-march=native_-mtune=native_-O_-fwrapv_-fPIC_-fPIE_-gdwarf-4_-Wall/timingleaks/crypto_hash/groestl256/core2duo/work/hash.c:38:(.text+0x...): undefined reference to `P512ASM'
try.c: /usr/bin/ld: libcrypto_hash_groestl256.a(hash.o): in function `OutputTransformation':
try.c: .../supercop-data/tripwire/amd64/try/c/gcc_-march=native_-mtune=native_-O_-fwrapv_-fPIC_-fPIE_-gdwarf-4_-Wall/timingleaks/crypto_hash/groestl256/core2duo/work/hash.c:62:(.text+0x...): undefined reference to `P512ASM'
try.c: collect2: error: ld returned 1 exit status

Number of similar (implementation,compiler) pairs: 1, namely:
ImplementationCompiler
T:core2duogcc -march=native -mtune=native -O -fwrapv -fPIC -fPIE -gdwarf-4 -Wall (14.2.0)

Compiler output


try.c: /usr/bin/ld: libcrypto_hash_groestl256.a(hash.o): in function `Transform':
try.c: .../supercop-data/tripwire/amd64/try/c/gcc_-march=native_-mtune=native_-Os_-fwrapv_-fPIC_-fPIE_-gdwarf-4_-Wall/timingleaks/crypto_hash/groestl256/core2duo/work/hash.c:37:(.text+0x...): undefined reference to `Q512ASM'
try.c: /usr/bin/ld: .../supercop-data/tripwire/amd64/try/c/gcc_-march=native_-mtune=native_-Os_-fwrapv_-fPIC_-fPIE_-gdwarf-4_-Wall/timingleaks/crypto_hash/groestl256/core2duo/work/hash.c:38:(.text+0x...): undefined reference to `P512ASM'
try.c: /usr/bin/ld: libcrypto_hash_groestl256.a(hash.o): in function `OutputTransformation':
try.c: .../supercop-data/tripwire/amd64/try/c/gcc_-march=native_-mtune=native_-Os_-fwrapv_-fPIC_-fPIE_-gdwarf-4_-Wall/timingleaks/crypto_hash/groestl256/core2duo/work/hash.c:62:(.text+0x...): undefined reference to `P512ASM'
try.c: collect2: error: ld returned 1 exit status

Number of similar (implementation,compiler) pairs: 1, namely:
ImplementationCompiler
T:core2duogcc -march=native -mtune=native -Os -fwrapv -fPIC -fPIE -gdwarf-4 -Wall (14.2.0)

Compiler output


hash.c: hash.c: In function 'Transform1024':
hash.c: hash.c:563:8: warning: unused variable 'mmm' [-Wunused-variable]
hash.c:   563 |   u64 *mmm = (u64*)tmp;
hash.c:       |        ^~~

Number of similar (implementation,compiler) pairs: 4, namely:
ImplementationCompiler
T:mmxgcc -march=native -mtune=native -O2 -fwrapv -fPIC -fPIE -gdwarf-4 -Wall (14.2.0)
T:mmxgcc -march=native -mtune=native -O3 -fwrapv -fPIC -fPIE -gdwarf-4 -Wall (14.2.0)
T:mmxgcc -march=native -mtune=native -O -fwrapv -fPIC -fPIE -gdwarf-4 -Wall (14.2.0)
T:mmxgcc -march=native -mtune=native -Os -fwrapv -fPIC -fPIE -gdwarf-4 -Wall (14.2.0)

Compiler output


hash.c: hash.c: In function 'F512':
hash.c: hash.c:182: warning: ignoring '#pragma vector aligned' [-Wunknown-pragmas]
hash.c:   182 | #pragma vector aligned
hash.c: hash.c: In function 'F1024':
hash.c: hash.c:219: warning: ignoring '#pragma vector aligned' [-Wunknown-pragmas]
hash.c:   219 | #pragma vector aligned
try.c: /usr/bin/ld: libcrypto_hash_groestl256.a(hash.o): in function `Transform':
try.c: .../supercop-data/tripwire/amd64/try/c/gcc_-march=native_-mtune=native_-O2_-fwrapv_-fPIC_-fPIE_-gdwarf-4_-Wall/timingleaks/crypto_hash/groestl256/opt64/work/hash.c:246:(.text+0x...): undefined reference to `F1024'
try.c: /usr/bin/ld: .../supercop-data/tripwire/amd64/try/c/gcc_-march=native_-mtune=native_-O2_-fwrapv_-fPIC_-fPIE_-gdwarf-4_-Wall/timingleaks/crypto_hash/groestl256/opt64/work/hash.c:237:(.text+0x...): undefined reference to `F512'
try.c: collect2: error: ld returned 1 exit status

Number of similar (implementation,compiler) pairs: 1, namely:
ImplementationCompiler
T:opt64gcc -march=native -mtune=native -O2 -fwrapv -fPIC -fPIE -gdwarf-4 -Wall (14.2.0)

Compiler output


hash.c: hash.c: In function 'F512':
hash.c: hash.c:182: warning: ignoring '#pragma vector aligned' [-Wunknown-pragmas]
hash.c:   182 | #pragma vector aligned
hash.c: hash.c: In function 'F1024':
hash.c: hash.c:219: warning: ignoring '#pragma vector aligned' [-Wunknown-pragmas]
hash.c:   219 | #pragma vector aligned
try.c: /usr/bin/ld: libcrypto_hash_groestl256.a(hash.o): in function `Transform':
try.c: .../supercop-data/tripwire/amd64/try/c/gcc_-march=native_-mtune=native_-O3_-fwrapv_-fPIC_-fPIE_-gdwarf-4_-Wall/timingleaks/crypto_hash/groestl256/opt64/work/hash.c:246:(.text+0x...): undefined reference to `F1024'
try.c: /usr/bin/ld: .../supercop-data/tripwire/amd64/try/c/gcc_-march=native_-mtune=native_-O3_-fwrapv_-fPIC_-fPIE_-gdwarf-4_-Wall/timingleaks/crypto_hash/groestl256/opt64/work/hash.c:237:(.text+0x...): undefined reference to `F512'
try.c: /usr/bin/ld: .../supercop-data/tripwire/amd64/try/c/gcc_-march=native_-mtune=native_-O3_-fwrapv_-fPIC_-fPIE_-gdwarf-4_-Wall/timingleaks/crypto_hash/groestl256/opt64/work/hash.c:246:(.text+0x...): undefined reference to `F1024'
try.c: /usr/bin/ld: .../supercop-data/tripwire/amd64/try/c/gcc_-march=native_-mtune=native_-O3_-fwrapv_-fPIC_-fPIE_-gdwarf-4_-Wall/timingleaks/crypto_hash/groestl256/opt64/work/hash.c:237:(.text+0x...): undefined reference to `F512'
try.c: /usr/bin/ld: .../supercop-data/tripwire/amd64/try/c/gcc_-march=native_-mtune=native_-O3_-fwrapv_-fPIC_-fPIE_-gdwarf-4_-Wall/timingleaks/crypto_hash/groestl256/opt64/work/hash.c:246:(.text+0x...): undefined reference to `F1024'
try.c: /usr/bin/ld: .../supercop-data/tripwire/amd64/try/c/gcc_-march=native_-mtune=native_-O3_-fwrapv_-fPIC_-fPIE_-gdwarf-4_-Wall/timingleaks/crypto_hash/groestl256/opt64/work/hash.c:237:(.text+0x...): undefined reference to `F512'
try.c: /usr/bin/ld: .../supercop-data/tripwire/amd64/try/c/gcc_-march=native_-mtune=native_-O3_-fwrapv_-fPIC_-fPIE_-gdwarf-4_-Wall/timingleaks/crypto_hash/groestl256/opt64/work/hash.c:246:(.text+0x...): undefined reference to `F1024'
try.c: /usr/bin/ld: .../supercop-data/tripwire/amd64/try/c/gcc_-march=native_-mtune=native_-O3_-fwrapv_-fPIC_-fPIE_-gdwarf-4_-Wall/timingleaks/crypto_hash/groestl256/opt64/work/hash.c:246:(.text+0x...): undefined reference to `F1024'
try.c: /usr/bin/ld: .../supercop-data/tripwire/amd64/try/c/gcc_-march=native_-mtune=native_-O3_-fwrapv_-fPIC_-fPIE_-gdwarf-4_-Wall/timingleaks/crypto_hash/groestl256/opt64/work/hash.c:237:(.text+0x...): undefined reference to `F512'
try.c: /usr/bin/ld: .../supercop-data/tripwire/amd64/try/c/gcc_-march=native_-mtune=native_-O3_-fwrapv_-fPIC_-fPIE_-gdwarf-4_-Wall/timingleaks/crypto_hash/groestl256/opt64/work/hash.c:237:(.text+0x...): undefined reference to `F512'
try.c: /usr/bin/ld: .../supercop-data/tripwire/amd64/try/c/gcc_-march=native_-mtune=native_-O3_-fwrapv_-fPIC_-fPIE_-gdwarf-4_-Wall/timingleaks/crypto_hash/groestl256/opt64/work/hash.c:237:(.text+0x...): undefined reference to `F512'
try.c: /usr/bin/ld: .../supercop-data/tripwire/amd64/try/c/gcc_-march=native_-mtune=native_-O3_-fwrapv_-fPIC_-fPIE_-gdwarf-4_-Wall/timingleaks/crypto_hash/groestl256/opt64/work/hash.c:246:(.text+0x...): undefined reference to `F1024'
try.c: /usr/bin/ld: .../supercop-data/tripwire/amd64/try/c/gcc_-march=native_-mtune=native_-O3_-fwrapv_-fPIC_-fPIE_-gdwarf-4_-Wall/timingleaks/crypto_hash/groestl256/opt64/work/hash.c:237:(.text+0x...): undefined reference to `F512'
try.c: /usr/bin/ld: .../supercop-data/tripwire/amd64/try/c/gcc_-march=native_-mtune=native_-O3_-fwrapv_-fPIC_-fPIE_-gdwarf-4_-Wall/timingleaks/crypto_hash/groestl256/opt64/work/hash.c:237:(.text+0x...): undefined reference to `F512'
try.c: /usr/bin/ld: .../supercop-data/tripwire/amd64/try/c/gcc_-march=native_-mtune=native_-O3_-fwrapv_-fPIC_-fPIE_-gdwarf-4_-Wall/timingleaks/crypto_hash/groestl256/opt64/work/hash.c:237:(.text+0x...): undefined reference to `F512'
try.c: collect2: error: ld returned 1 exit status

Number of similar (implementation,compiler) pairs: 1, namely:
ImplementationCompiler
T:opt64gcc -march=native -mtune=native -O3 -fwrapv -fPIC -fPIE -gdwarf-4 -Wall (14.2.0)

Compiler output


hash.c: hash.c: In function 'F512':
hash.c: hash.c:182: warning: ignoring '#pragma vector aligned' [-Wunknown-pragmas]
hash.c:   182 | #pragma vector aligned
hash.c: hash.c: In function 'F1024':
hash.c: hash.c:219: warning: ignoring '#pragma vector aligned' [-Wunknown-pragmas]
hash.c:   219 | #pragma vector aligned
try.c: /usr/bin/ld: libcrypto_hash_groestl256.a(hash.o): in function `Transform':
try.c: .../supercop-data/tripwire/amd64/try/c/gcc_-march=native_-mtune=native_-O_-fwrapv_-fPIC_-fPIE_-gdwarf-4_-Wall/timingleaks/crypto_hash/groestl256/opt64/work/hash.c:246:(.text+0x...): undefined reference to `F1024'
try.c: /usr/bin/ld: .../supercop-data/tripwire/amd64/try/c/gcc_-march=native_-mtune=native_-O_-fwrapv_-fPIC_-fPIE_-gdwarf-4_-Wall/timingleaks/crypto_hash/groestl256/opt64/work/hash.c:237:(.text+0x...): undefined reference to `F512'
try.c: collect2: error: ld returned 1 exit status

Number of similar (implementation,compiler) pairs: 1, namely:
ImplementationCompiler
T:opt64gcc -march=native -mtune=native -O -fwrapv -fPIC -fPIE -gdwarf-4 -Wall (14.2.0)

Compiler output


hash.c: hash.c: In function 'F512':
hash.c: hash.c:182: warning: ignoring '#pragma vector aligned' [-Wunknown-pragmas]
hash.c:   182 | #pragma vector aligned
hash.c: hash.c: In function 'F1024':
hash.c: hash.c:219: warning: ignoring '#pragma vector aligned' [-Wunknown-pragmas]
hash.c:   219 | #pragma vector aligned
try.c: /usr/bin/ld: libcrypto_hash_groestl256.a(hash.o): in function `Transform':
try.c: .../supercop-data/tripwire/amd64/try/c/gcc_-march=native_-mtune=native_-Os_-fwrapv_-fPIC_-fPIE_-gdwarf-4_-Wall/timingleaks/crypto_hash/groestl256/opt64/work/hash.c:237:(.text+0x...): undefined reference to `F512'
try.c: /usr/bin/ld: .../supercop-data/tripwire/amd64/try/c/gcc_-march=native_-mtune=native_-Os_-fwrapv_-fPIC_-fPIE_-gdwarf-4_-Wall/timingleaks/crypto_hash/groestl256/opt64/work/hash.c:246:(.text+0x...): undefined reference to `F1024'
try.c: collect2: error: ld returned 1 exit status

Number of similar (implementation,compiler) pairs: 1, namely:
ImplementationCompiler
T:opt64gcc -march=native -mtune=native -Os -fwrapv -fPIC -fPIE -gdwarf-4 -Wall (14.2.0)

Compiler output


try.c: /usr/bin/ld: libcrypto_hash_groestl256.a(hash.o): in function `Transform':
try.c: .../supercop-data/tripwire/amd64/try/c/gcc_-march=native_-mtune=native_-O2_-fwrapv_-fPIC_-fPIE_-gdwarf-4_-Wall/timingleaks/crypto_hash/groestl256/opteron/work/hash.c:36:(.text+0x...): undefined reference to `Q512ASM'
try.c: /usr/bin/ld: .../supercop-data/tripwire/amd64/try/c/gcc_-march=native_-mtune=native_-O2_-fwrapv_-fPIC_-fPIE_-gdwarf-4_-Wall/timingleaks/crypto_hash/groestl256/opteron/work/hash.c:37:(.text+0x...): undefined reference to `P512ASM'
try.c: /usr/bin/ld: libcrypto_hash_groestl256.a(hash.o): in function `OutputTransformation':
try.c: .../supercop-data/tripwire/amd64/try/c/gcc_-march=native_-mtune=native_-O2_-fwrapv_-fPIC_-fPIE_-gdwarf-4_-Wall/timingleaks/crypto_hash/groestl256/opteron/work/hash.c:56:(.text+0x...): undefined reference to `P512ASM'
try.c: collect2: error: ld returned 1 exit status

Number of similar (implementation,compiler) pairs: 1, namely:
ImplementationCompiler
T:opterongcc -march=native -mtune=native -O2 -fwrapv -fPIC -fPIE -gdwarf-4 -Wall (14.2.0)

Compiler output


try.c: /usr/bin/ld: libcrypto_hash_groestl256.a(hash.o): relocation R_X86_64_32S against symbol `T0' can not be used when making a PIE object; recompile with -fPIE
try.c: /usr/bin/ld: failed to set dynamic section sizes: bad value
try.c: collect2: error: ld returned 1 exit status

Number of similar (implementation,compiler) pairs: 1, namely:
ImplementationCompiler
T:opterongcc -march=native -mtune=native -O3 -fwrapv -fPIC -fPIE -gdwarf-4 -Wall (14.2.0)

Compiler output


try.c: /usr/bin/ld: libcrypto_hash_groestl256.a(hash.o): in function `Transform':
try.c: .../supercop-data/tripwire/amd64/try/c/gcc_-march=native_-mtune=native_-O_-fwrapv_-fPIC_-fPIE_-gdwarf-4_-Wall/timingleaks/crypto_hash/groestl256/opteron/work/hash.c:36:(.text+0x...): undefined reference to `Q512ASM'
try.c: /usr/bin/ld: .../supercop-data/tripwire/amd64/try/c/gcc_-march=native_-mtune=native_-O_-fwrapv_-fPIC_-fPIE_-gdwarf-4_-Wall/timingleaks/crypto_hash/groestl256/opteron/work/hash.c:37:(.text+0x...): undefined reference to `P512ASM'
try.c: /usr/bin/ld: libcrypto_hash_groestl256.a(hash.o): in function `OutputTransformation':
try.c: .../supercop-data/tripwire/amd64/try/c/gcc_-march=native_-mtune=native_-O_-fwrapv_-fPIC_-fPIE_-gdwarf-4_-Wall/timingleaks/crypto_hash/groestl256/opteron/work/hash.c:56:(.text+0x...): undefined reference to `P512ASM'
try.c: collect2: error: ld returned 1 exit status

Number of similar (implementation,compiler) pairs: 1, namely:
ImplementationCompiler
T:opterongcc -march=native -mtune=native -O -fwrapv -fPIC -fPIE -gdwarf-4 -Wall (14.2.0)

Compiler output


try.c: /usr/bin/ld: libcrypto_hash_groestl256.a(hash.o): in function `Transform':
try.c: .../supercop-data/tripwire/amd64/try/c/gcc_-march=native_-mtune=native_-Os_-fwrapv_-fPIC_-fPIE_-gdwarf-4_-Wall/timingleaks/crypto_hash/groestl256/opteron/work/hash.c:36:(.text+0x...): undefined reference to `Q512ASM'
try.c: /usr/bin/ld: .../supercop-data/tripwire/amd64/try/c/gcc_-march=native_-mtune=native_-Os_-fwrapv_-fPIC_-fPIE_-gdwarf-4_-Wall/timingleaks/crypto_hash/groestl256/opteron/work/hash.c:37:(.text+0x...): undefined reference to `P512ASM'
try.c: /usr/bin/ld: libcrypto_hash_groestl256.a(hash.o): in function `OutputTransformation':
try.c: .../supercop-data/tripwire/amd64/try/c/gcc_-march=native_-mtune=native_-Os_-fwrapv_-fPIC_-fPIE_-gdwarf-4_-Wall/timingleaks/crypto_hash/groestl256/opteron/work/hash.c:56:(.text+0x...): undefined reference to `P512ASM'
try.c: collect2: error: ld returned 1 exit status

Number of similar (implementation,compiler) pairs: 1, namely:
ImplementationCompiler
T:opterongcc -march=native -mtune=native -Os -fwrapv -fPIC -fPIE -gdwarf-4 -Wall (14.2.0)

Compiler output


try.c: /usr/bin/ld: libcrypto_hash_groestl256.a(hash.o): in function `Transform':
try.c: .../supercop-data/tripwire/amd64/try/c/gcc_-march=native_-mtune=native_-O2_-fwrapv_-fPIC_-fPIE_-gdwarf-4_-Wall/timingleaks/crypto_hash/groestl256/opteron-unrolled/work/hash.c:36:(.text+0x...): undefined reference to `Q512ASM'
try.c: /usr/bin/ld: .../supercop-data/tripwire/amd64/try/c/gcc_-march=native_-mtune=native_-O2_-fwrapv_-fPIC_-fPIE_-gdwarf-4_-Wall/timingleaks/crypto_hash/groestl256/opteron-unrolled/work/hash.c:37:(.text+0x...): undefined reference to `P512ASM'
try.c: /usr/bin/ld: libcrypto_hash_groestl256.a(hash.o): in function `OutputTransformation':
try.c: .../supercop-data/tripwire/amd64/try/c/gcc_-march=native_-mtune=native_-O2_-fwrapv_-fPIC_-fPIE_-gdwarf-4_-Wall/timingleaks/crypto_hash/groestl256/opteron-unrolled/work/hash.c:56:(.text+0x...): undefined reference to `P512ASM'
try.c: collect2: error: ld returned 1 exit status

Number of similar (implementation,compiler) pairs: 1, namely:
ImplementationCompiler
T:opteron-unrolledgcc -march=native -mtune=native -O2 -fwrapv -fPIC -fPIE -gdwarf-4 -Wall (14.2.0)

Compiler output


try.c: /usr/bin/ld: libcrypto_hash_groestl256.a(hash.o): in function `Transform':
try.c: .../supercop-data/tripwire/amd64/try/c/gcc_-march=native_-mtune=native_-O3_-fwrapv_-fPIC_-fPIE_-gdwarf-4_-Wall/timingleaks/crypto_hash/groestl256/opteron-unrolled/work/hash.c:36:(.text+0x...): undefined reference to `Q512ASM'
try.c: /usr/bin/ld: .../supercop-data/tripwire/amd64/try/c/gcc_-march=native_-mtune=native_-O3_-fwrapv_-fPIC_-fPIE_-gdwarf-4_-Wall/timingleaks/crypto_hash/groestl256/opteron-unrolled/work/hash.c:37:(.text+0x...): undefined reference to `P512ASM'
try.c: /usr/bin/ld: .../supercop-data/tripwire/amd64/try/c/gcc_-march=native_-mtune=native_-O3_-fwrapv_-fPIC_-fPIE_-gdwarf-4_-Wall/timingleaks/crypto_hash/groestl256/opteron-unrolled/work/hash.c:36:(.text+0x...): undefined reference to `Q512ASM'
try.c: /usr/bin/ld: .../supercop-data/tripwire/amd64/try/c/gcc_-march=native_-mtune=native_-O3_-fwrapv_-fPIC_-fPIE_-gdwarf-4_-Wall/timingleaks/crypto_hash/groestl256/opteron-unrolled/work/hash.c:37:(.text+0x...): undefined reference to `P512ASM'
try.c: /usr/bin/ld: libcrypto_hash_groestl256.a(hash.o): in function `OutputTransformation':
try.c: .../supercop-data/tripwire/amd64/try/c/gcc_-march=native_-mtune=native_-O3_-fwrapv_-fPIC_-fPIE_-gdwarf-4_-Wall/timingleaks/crypto_hash/groestl256/opteron-unrolled/work/hash.c:56:(.text+0x...): undefined reference to `P512ASM'
try.c: /usr/bin/ld: .../supercop-data/tripwire/amd64/try/c/gcc_-march=native_-mtune=native_-O3_-fwrapv_-fPIC_-fPIE_-gdwarf-4_-Wall/timingleaks/crypto_hash/groestl256/opteron-unrolled/work/hash.c:56:(.text+0x...): undefined reference to `P512ASM'
try.c: /usr/bin/ld: .../supercop-data/tripwire/amd64/try/c/gcc_-march=native_-mtune=native_-O3_-fwrapv_-fPIC_-fPIE_-gdwarf-4_-Wall/timingleaks/crypto_hash/groestl256/opteron-unrolled/work/hash.c:56:(.text+0x...): undefined reference to `P512ASM'
try.c: collect2: error: ld returned 1 exit status

Number of similar (implementation,compiler) pairs: 1, namely:
ImplementationCompiler
T:opteron-unrolledgcc -march=native -mtune=native -O3 -fwrapv -fPIC -fPIE -gdwarf-4 -Wall (14.2.0)

Compiler output


try.c: /usr/bin/ld: libcrypto_hash_groestl256.a(hash.o): in function `Transform':
try.c: .../supercop-data/tripwire/amd64/try/c/gcc_-march=native_-mtune=native_-O_-fwrapv_-fPIC_-fPIE_-gdwarf-4_-Wall/timingleaks/crypto_hash/groestl256/opteron-unrolled/work/hash.c:36:(.text+0x...): undefined reference to `Q512ASM'
try.c: /usr/bin/ld: .../supercop-data/tripwire/amd64/try/c/gcc_-march=native_-mtune=native_-O_-fwrapv_-fPIC_-fPIE_-gdwarf-4_-Wall/timingleaks/crypto_hash/groestl256/opteron-unrolled/work/hash.c:37:(.text+0x...): undefined reference to `P512ASM'
try.c: /usr/bin/ld: libcrypto_hash_groestl256.a(hash.o): in function `OutputTransformation':
try.c: .../supercop-data/tripwire/amd64/try/c/gcc_-march=native_-mtune=native_-O_-fwrapv_-fPIC_-fPIE_-gdwarf-4_-Wall/timingleaks/crypto_hash/groestl256/opteron-unrolled/work/hash.c:56:(.text+0x...): undefined reference to `P512ASM'
try.c: collect2: error: ld returned 1 exit status

Number of similar (implementation,compiler) pairs: 1, namely:
ImplementationCompiler
T:opteron-unrolledgcc -march=native -mtune=native -O -fwrapv -fPIC -fPIE -gdwarf-4 -Wall (14.2.0)

Compiler output


try.c: /usr/bin/ld: libcrypto_hash_groestl256.a(hash.o): in function `Transform':
try.c: .../supercop-data/tripwire/amd64/try/c/gcc_-march=native_-mtune=native_-Os_-fwrapv_-fPIC_-fPIE_-gdwarf-4_-Wall/timingleaks/crypto_hash/groestl256/opteron-unrolled/work/hash.c:36:(.text+0x...): undefined reference to `Q512ASM'
try.c: /usr/bin/ld: .../supercop-data/tripwire/amd64/try/c/gcc_-march=native_-mtune=native_-Os_-fwrapv_-fPIC_-fPIE_-gdwarf-4_-Wall/timingleaks/crypto_hash/groestl256/opteron-unrolled/work/hash.c:37:(.text+0x...): undefined reference to `P512ASM'
try.c: /usr/bin/ld: libcrypto_hash_groestl256.a(hash.o): in function `OutputTransformation':
try.c: .../supercop-data/tripwire/amd64/try/c/gcc_-march=native_-mtune=native_-Os_-fwrapv_-fPIC_-fPIE_-gdwarf-4_-Wall/timingleaks/crypto_hash/groestl256/opteron-unrolled/work/hash.c:56:(.text+0x...): undefined reference to `P512ASM'
try.c: collect2: error: ld returned 1 exit status

Number of similar (implementation,compiler) pairs: 1, namely:
ImplementationCompiler
T:opteron-unrolledgcc -march=native -mtune=native -Os -fwrapv -fPIC -fPIE -gdwarf-4 -Wall (14.2.0)

Compiler output


groestl.c: groestl.c: In function 'groestl_small_close':
groestl.c: groestl.c:2812:24: warning: variable 'buf' set but not used [-Wunused-but-set-variable]
groestl.c:  2812 |         unsigned char *buf;
groestl.c:       |                        ^~~
groestl.c: groestl.c: In function 'groestl_big_close':
groestl.c: groestl.c:2948:24: warning: variable 'buf' set but not used [-Wunused-but-set-variable]
groestl.c:  2948 |         unsigned char *buf;
groestl.c:       |                        ^~~

Number of similar (implementation,compiler) pairs: 8, namely:
ImplementationCompiler
T:sphlibgcc -march=native -mtune=native -O2 -fwrapv -fPIC -fPIE -gdwarf-4 -Wall (14.2.0)
T:sphlibgcc -march=native -mtune=native -O3 -fwrapv -fPIC -fPIE -gdwarf-4 -Wall (14.2.0)
T:sphlibgcc -march=native -mtune=native -O -fwrapv -fPIC -fPIE -gdwarf-4 -Wall (14.2.0)
T:sphlibgcc -march=native -mtune=native -Os -fwrapv -fPIC -fPIE -gdwarf-4 -Wall (14.2.0)
T:sphlib-smallgcc -march=native -mtune=native -O2 -fwrapv -fPIC -fPIE -gdwarf-4 -Wall (14.2.0)
T:sphlib-smallgcc -march=native -mtune=native -O3 -fwrapv -fPIC -fPIE -gdwarf-4 -Wall (14.2.0)
T:sphlib-smallgcc -march=native -mtune=native -O -fwrapv -fPIC -fPIE -gdwarf-4 -Wall (14.2.0)
T:sphlib-smallgcc -march=native -mtune=native -Os -fwrapv -fPIC -fPIE -gdwarf-4 -Wall (14.2.0)

Compiler output


groestl.c: groestl.c: In function 'groestl_small_close':
groestl.c: groestl.c:2742:18: warning: variable 'buf' set but not used [-Wunused-but-set-variable]
groestl.c:  2742 |   unsigned char *buf;
groestl.c:       |                  ^~~
groestl.c: groestl.c: In function 'groestl_big_close':
groestl.c: groestl.c:2878:18: warning: variable 'buf' set but not used [-Wunused-but-set-variable]
groestl.c:  2878 |   unsigned char *buf;
groestl.c:       |                  ^~~

Number of similar (implementation,compiler) pairs: 4, namely:
ImplementationCompiler
T:sphlib-adaptedgcc -march=native -mtune=native -O2 -fwrapv -fPIC -fPIE -gdwarf-4 -Wall (14.2.0)
T:sphlib-adaptedgcc -march=native -mtune=native -O3 -fwrapv -fPIC -fPIE -gdwarf-4 -Wall (14.2.0)
T:sphlib-adaptedgcc -march=native -mtune=native -O -fwrapv -fPIC -fPIE -gdwarf-4 -Wall (14.2.0)
T:sphlib-adaptedgcc -march=native -mtune=native -Os -fwrapv -fPIC -fPIE -gdwarf-4 -Wall (14.2.0)

Compiler output


hash.c: hash.c: In function 'Init':
hash.c: hash.c:104:21: warning: the comparison will always evaluate as 'false' for the address of 'chaining' will never be NULL [-Waddress]
hash.c:   104 |   if (ctx->chaining == NULL || ctx->buffer == NULL)
hash.c:       |                     ^~
hash.c: In file included from groestl-asm-vperm.h:13,
hash.c:                  from hash.c:19:
hash.c: hash.h:83:38: note: 'chaining' declared here
hash.c:    83 |   __attribute__ ((aligned (32))) u64 chaining[SIZE/8];      /* actual state */
hash.c:       |                                      ^~~~~~~~
hash.c: hash.c:104:44: warning: the comparison will always evaluate as 'false' for the address of 'buffer' will never be NULL [-Waddress]
hash.c:   104 |   if (ctx->chaining == NULL || ctx->buffer == NULL)
hash.c:       |                                            ^~
hash.c: hash.h:84:46: note: 'buffer' declared here
hash.c:    84 |   __attribute__ ((aligned (32))) BitSequence buffer[SIZE];  /* data buffer */
hash.c:       |                                              ^~~~~~
try.c: /usr/bin/ld: libcrypto_hash_groestl256.a(hash.o): relocation R_X86_64_32S against symbol `ROUND_CONST_Lx' can not be used when making a PIE object; recompile with -fPIE
try.c: /usr/bin/ld: failed to set dynamic section sizes: bad value
try.c: collect2: error: ld returned 1 exit status

Number of similar (implementation,compiler) pairs: 4, namely:
ImplementationCompiler
T:vpermgcc -march=native -mtune=native -O2 -fwrapv -fPIC -fPIE -gdwarf-4 -Wall (14.2.0)
T:vpermgcc -march=native -mtune=native -O3 -fwrapv -fPIC -fPIE -gdwarf-4 -Wall (14.2.0)
T:vpermgcc -march=native -mtune=native -O -fwrapv -fPIC -fPIE -gdwarf-4 -Wall (14.2.0)
T:vpermgcc -march=native -mtune=native -Os -fwrapv -fPIC -fPIE -gdwarf-4 -Wall (14.2.0)

Compiler output


hash.c: hash.c: In function 'Init':
hash.c: hash.c:104:21: warning: the comparison will always evaluate as 'false' for the address of 'chaining' will never be NULL [-Waddress]
hash.c:   104 |   if (ctx->chaining == NULL || ctx->buffer == NULL)
hash.c:       |                     ^~
hash.c: In file included from groestl-intr-vperm.h:14,
hash.c:                  from hash.c:34:
hash.c: hash.h:83:38: note: 'chaining' declared here
hash.c:    83 |   __attribute__ ((aligned (32))) u64 chaining[SIZE/8];      /* actual state */
hash.c:       |                                      ^~~~~~~~
hash.c: hash.c:104:44: warning: the comparison will always evaluate as 'false' for the address of 'buffer' will never be NULL [-Waddress]
hash.c:   104 |   if (ctx->chaining == NULL || ctx->buffer == NULL)
hash.c:       |                                            ^~
hash.c: hash.h:84:46: note: 'buffer' declared here
hash.c:    84 |   __attribute__ ((aligned (32))) BitSequence buffer[SIZE];  /* data buffer */
hash.c:       |                                              ^~~~~~

Number of similar (implementation,compiler) pairs: 4, namely:
ImplementationCompiler
T:vperm-intrgcc -march=native -mtune=native -O2 -fwrapv -fPIC -fPIE -gdwarf-4 -Wall (14.2.0)
T:vperm-intrgcc -march=native -mtune=native -O3 -fwrapv -fPIC -fPIE -gdwarf-4 -Wall (14.2.0)
T:vperm-intrgcc -march=native -mtune=native -O -fwrapv -fPIC -fPIE -gdwarf-4 -Wall (14.2.0)
T:vperm-intrgcc -march=native -mtune=native -Os -fwrapv -fPIC -fPIE -gdwarf-4 -Wall (14.2.0)

Namespace violations


hash.o F512 T
hash.o Final T
hash.o Hash T
hash.o Init T
hash.o OutputTransformation T
hash.o RND512P T
hash.o RND512Q T
hash.o T R
hash.o Transform T
hash.o Update T
hash.o indices_cyclic R
hash.o shift_Values R

Number of similar (implementation,compiler) pairs: 4, namely:
ImplementationCompiler
T:32bit-2ktablegcc -march=native -mtune=native -O2 -fwrapv -fPIC -fPIE -gdwarf-4 -Wall (14.2.0)
T:32bit-2ktablegcc -march=native -mtune=native -O3 -fwrapv -fPIC -fPIE -gdwarf-4 -Wall (14.2.0)
T:32bit-2ktablegcc -march=native -mtune=native -O -fwrapv -fPIC -fPIE -gdwarf-4 -Wall (14.2.0)
T:32bit-2ktablegcc -march=native -mtune=native -Os -fwrapv -fPIC -fPIE -gdwarf-4 -Wall (14.2.0)

Namespace violations


hash.o F512 T
hash.o MUL2_32Bit T
hash.o P T
hash.o Q T
hash.o RND512P T
hash.o RND512Q T
hash.o S R
hash.o mixBytes T
hash.o mix_bytes_half_state T
hash.o rotate_line_left T
hash.o subBytes T

Number of similar (implementation,compiler) pairs: 4, namely:
ImplementationCompiler
T:32bit-bytesliced-c-fastgcc -march=native -mtune=native -O2 -fwrapv -fPIC -fPIE -gdwarf-4 -Wall (14.2.0)
T:32bit-bytesliced-c-fastgcc -march=native -mtune=native -O3 -fwrapv -fPIC -fPIE -gdwarf-4 -Wall (14.2.0)
T:32bit-bytesliced-c-fastgcc -march=native -mtune=native -O -fwrapv -fPIC -fPIE -gdwarf-4 -Wall (14.2.0)
T:32bit-bytesliced-c-fastgcc -march=native -mtune=native -Os -fwrapv -fPIC -fPIE -gdwarf-4 -Wall (14.2.0)

Namespace violations


hash.o memxor T
hash.o mixbytes T
hash.o permutation T
hash.o setmessage T

Number of similar (implementation,compiler) pairs: 4, namely:
ImplementationCompiler
T:32bit-bytesliced-c-smallgcc -march=native -mtune=native -O2 -fwrapv -fPIC -fPIE -gdwarf-4 -Wall (14.2.0)
T:32bit-bytesliced-c-smallgcc -march=native -mtune=native -O3 -fwrapv -fPIC -fPIE -gdwarf-4 -Wall (14.2.0)
T:32bit-bytesliced-c-smallgcc -march=native -mtune=native -O -fwrapv -fPIC -fPIE -gdwarf-4 -Wall (14.2.0)
T:32bit-bytesliced-c-smallgcc -march=native -mtune=native -Os -fwrapv -fPIC -fPIE -gdwarf-4 -Wall (14.2.0)

Namespace violations


hash.o mix_bytes T
hash.o mul2 R
hash.o perm_P T
hash.o perm_Q T
hash.o sbox R

Number of similar (implementation,compiler) pairs: 4, namely:
ImplementationCompiler
T:8bit_cgcc -march=native -mtune=native -O2 -fwrapv -fPIC -fPIE -gdwarf-4 -Wall (14.2.0)
T:8bit_cgcc -march=native -mtune=native -O3 -fwrapv -fPIC -fPIE -gdwarf-4 -Wall (14.2.0)
T:8bit_cgcc -march=native -mtune=native -O -fwrapv -fPIC -fPIE -gdwarf-4 -Wall (14.2.0)
T:8bit_cgcc -march=native -mtune=native -Os -fwrapv -fPIC -fPIE -gdwarf-4 -Wall (14.2.0)

Namespace violations


hash.o ALL_1B B
hash.o ALL_FF B
hash.o Final T
hash.o Hash T
hash.o INIT T
hash.o Init T
hash.o OF512 T
hash.o OutputTransformation T
hash.o ROUND_CONST_L0 B
hash.o ROUND_CONST_L7 B
hash.o ROUND_CONST_Lx B
hash.o ROUND_CONST_P B
hash.o ROUND_CONST_Q B
hash.o SUBSH_MASK B
hash.o TF512 T
hash.o TRANSP_MASK B
hash.o Transform T
hash.o Update T

Number of similar (implementation,compiler) pairs: 8, namely:
ImplementationCompiler
T:aesni-intrgcc -march=native -mtune=native -O2 -fwrapv -fPIC -fPIE -gdwarf-4 -Wall (14.2.0)
T:aesni-intrgcc -march=native -mtune=native -O3 -fwrapv -fPIC -fPIE -gdwarf-4 -Wall (14.2.0)
T:aesni-intrgcc -march=native -mtune=native -O -fwrapv -fPIC -fPIE -gdwarf-4 -Wall (14.2.0)
T:aesni-intrgcc -march=native -mtune=native -Os -fwrapv -fPIC -fPIE -gdwarf-4 -Wall (14.2.0)
T:avx-intrgcc -march=native -mtune=native -O2 -fwrapv -fPIC -fPIE -gdwarf-4 -Wall (14.2.0)
T:avx-intrgcc -march=native -mtune=native -O3 -fwrapv -fPIC -fPIE -gdwarf-4 -Wall (14.2.0)
T:avx-intrgcc -march=native -mtune=native -O -fwrapv -fPIC -fPIE -gdwarf-4 -Wall (14.2.0)
T:avx-intrgcc -march=native -mtune=native -Os -fwrapv -fPIC -fPIE -gdwarf-4 -Wall (14.2.0)

Namespace violations


hash.o Final T
hash.o Hash T
hash.o Init T
hash.o OutputTransformation T
hash.o OutputTransformation1024 T
hash.o OutputTransformation512 T
hash.o PrintHash T
hash.o ROUNDP1024 T
hash.o ROUNDQ1024 T
hash.o T R
hash.o Transform T
hash.o Transform1024 T
hash.o Transform512 T
hash.o Update T

Number of similar (implementation,compiler) pairs: 4, namely:
ImplementationCompiler
T:mmxgcc -march=native -mtune=native -O2 -fwrapv -fPIC -fPIE -gdwarf-4 -Wall (14.2.0)
T:mmxgcc -march=native -mtune=native -O3 -fwrapv -fPIC -fPIE -gdwarf-4 -Wall (14.2.0)
T:mmxgcc -march=native -mtune=native -O -fwrapv -fPIC -fPIE -gdwarf-4 -Wall (14.2.0)
T:mmxgcc -march=native -mtune=native -Os -fwrapv -fPIC -fPIE -gdwarf-4 -Wall (14.2.0)

Namespace violations


hash.o F1024 T
hash.o F512 T
hash.o Final T
hash.o Hash T
hash.o Init T
hash.o OutputTransformation T
hash.o PrintHash T
hash.o RND1024P T
hash.o RND1024Q T
hash.o RND512P T
hash.o RND512Q T
hash.o T R
hash.o Transform T
hash.o Update T

Number of similar (implementation,compiler) pairs: 4, namely:
ImplementationCompiler
T:opt32gcc -march=native -mtune=native -O2 -fwrapv -fPIC -fPIE -gdwarf-4 -Wall (14.2.0)
T:opt32gcc -march=native -mtune=native -O3 -fwrapv -fPIC -fPIE -gdwarf-4 -Wall (14.2.0)
T:opt32gcc -march=native -mtune=native -O -fwrapv -fPIC -fPIE -gdwarf-4 -Wall (14.2.0)
T:opt32gcc -march=native -mtune=native -Os -fwrapv -fPIC -fPIE -gdwarf-4 -Wall (14.2.0)

Namespace violations


groestl.o sph_groestl224 T
groestl.o sph_groestl224_addbits_and_close T
groestl.o sph_groestl224_close T
groestl.o sph_groestl224_init T
groestl.o sph_groestl256 T
groestl.o sph_groestl256_addbits_and_close T
groestl.o sph_groestl256_close T
groestl.o sph_groestl256_init T
groestl.o sph_groestl384 T
groestl.o sph_groestl384_addbits_and_close T
groestl.o sph_groestl384_close T
groestl.o sph_groestl384_init T
groestl.o sph_groestl512 T
groestl.o sph_groestl512_addbits_and_close T
groestl.o sph_groestl512_close T
groestl.o sph_groestl512_init T

Number of similar (implementation,compiler) pairs: 12, namely:
ImplementationCompiler
T:sphlibgcc -march=native -mtune=native -O2 -fwrapv -fPIC -fPIE -gdwarf-4 -Wall (14.2.0)
T:sphlibgcc -march=native -mtune=native -O3 -fwrapv -fPIC -fPIE -gdwarf-4 -Wall (14.2.0)
T:sphlibgcc -march=native -mtune=native -O -fwrapv -fPIC -fPIE -gdwarf-4 -Wall (14.2.0)
T:sphlibgcc -march=native -mtune=native -Os -fwrapv -fPIC -fPIE -gdwarf-4 -Wall (14.2.0)
T:sphlib-adaptedgcc -march=native -mtune=native -O2 -fwrapv -fPIC -fPIE -gdwarf-4 -Wall (14.2.0)
T:sphlib-adaptedgcc -march=native -mtune=native -O3 -fwrapv -fPIC -fPIE -gdwarf-4 -Wall (14.2.0)
T:sphlib-adaptedgcc -march=native -mtune=native -O -fwrapv -fPIC -fPIE -gdwarf-4 -Wall (14.2.0)
T:sphlib-adaptedgcc -march=native -mtune=native -Os -fwrapv -fPIC -fPIE -gdwarf-4 -Wall (14.2.0)
T:sphlib-smallgcc -march=native -mtune=native -O2 -fwrapv -fPIC -fPIE -gdwarf-4 -Wall (14.2.0)
T:sphlib-smallgcc -march=native -mtune=native -O3 -fwrapv -fPIC -fPIE -gdwarf-4 -Wall (14.2.0)
T:sphlib-smallgcc -march=native -mtune=native -O -fwrapv -fPIC -fPIE -gdwarf-4 -Wall (14.2.0)
T:sphlib-smallgcc -march=native -mtune=native -Os -fwrapv -fPIC -fPIE -gdwarf-4 -Wall (14.2.0)

Namespace violations


hash.o ALL_0F B
hash.o ALL_15 B
hash.o ALL_1B B
hash.o ALL_63 B
hash.o ALL_FF B
hash.o Final T
hash.o Hash T
hash.o INIT T
hash.o Init T
hash.o OF512 T
hash.o OutputTransformation T
hash.o ROUND_CONST_L0 B
hash.o ROUND_CONST_L7 B
hash.o ROUND_CONST_Lx B
hash.o ROUND_CONST_P B
hash.o ROUND_CONST_Q B
hash.o SUBSH_MASK B
hash.o TF512 T
hash.o TRANSP_MASK B
hash.o Transform T
hash.o Update T
hash.o VPERM_INV B
hash.o VPERM_IPT B
hash.o VPERM_OPT B
hash.o VPERM_SB1 B
hash.o VPERM_SB2 B
hash.o VPERM_SB4 B
hash.o VPERM_SBO B

Number of similar (implementation,compiler) pairs: 4, namely:
ImplementationCompiler
T:vperm-intrgcc -march=native -mtune=native -O2 -fwrapv -fPIC -fPIE -gdwarf-4 -Wall (14.2.0)
T:vperm-intrgcc -march=native -mtune=native -O3 -fwrapv -fPIC -fPIE -gdwarf-4 -Wall (14.2.0)
T:vperm-intrgcc -march=native -mtune=native -O -fwrapv -fPIC -fPIE -gdwarf-4 -Wall (14.2.0)
T:vperm-intrgcc -march=native -mtune=native -Os -fwrapv -fPIC -fPIE -gdwarf-4 -Wall (14.2.0)