Test results for amd64, tripwire, crypto_hash/echosp256
[Page version: 20261004 16:18:08]
Measurements for amd64, tripwire, crypto_hash
Test results for amd64, tripwire, crypto_hash
Test results for crypto_hash/echosp256
Computer: tripwire
Microarchitecture: amd64; Zen 5 (b00f21)
Architecture: amd64
CPU ID: AuthenticAMD-00b00f21-178bfbff
SUPERCOP version: 20260831
Operation: crypto_hash
Primitive: echosp256
| Time | Object size | Test size | Implementation | Compiler | Benchmark date | SUPERCOP version |
| 25327 | 19988 0 1 | 40042 1192 1592 | T:generic/opt64 | gcc -march=native -mtune=native -Os -fwrapv -fPIC -fPIE -gdwarf-4 -Wall | 20260930 | 20260831 |
| 26229 | 22470 0 1 | 44167 1216 1688 | T:generic/opt64 | gcc -march=native -mtune=native -O2 -fwrapv -fPIC -fPIE -gdwarf-4 -Wall | 20260930 | 20260831 |
| 26279 | 23598 0 1 | 49815 1216 1688 | T:generic/opt64 | gcc -march=native -mtune=native -O3 -fwrapv -fPIC -fPIE -gdwarf-4 -Wall | 20260930 | 20260831 |
| 36135 | 22988 0 1 | 44455 1216 1624 | T:generic/opt64 | gcc -march=native -mtune=native -O -fwrapv -fPIC -fPIE -gdwarf-4 -Wall | 20260930 | 20260831 |
| 37141 | 26162 0 16 | 46250 1192 1592 | T:powerpc/pp32cv2 | gcc -march=native -mtune=native -Os -fwrapv -fPIC -fPIE -gdwarf-4 -Wall | 20260930 | 20260831 |
| 43292 | 36162 0 16 | 62447 1216 1688 | T:powerpc/pp32cv2 | gcc -march=native -mtune=native -O3 -fwrapv -fPIC -fPIE -gdwarf-4 -Wall | 20260930 | 20260831 |
| 46006 | 32826 0 16 | 54527 1216 1688 | T:powerpc/pp32cv2 | gcc -march=native -mtune=native -O2 -fwrapv -fPIC -fPIE -gdwarf-4 -Wall | 20260930 | 20260831 |
| 52233 | 22274 0 16 | 48559 1216 1688 | T:powerpc/pp32cv1 | gcc -march=native -mtune=native -O3 -fwrapv -fPIC -fPIE -gdwarf-4 -Wall | 20260930 | 20260831 |
| 52758 | 18042 0 16 | 39743 1216 1688 | T:powerpc/pp32cv1 | gcc -march=native -mtune=native -O2 -fwrapv -fPIC -fPIE -gdwarf-4 -Wall | 20260930 | 20260831 |
| 54655 | 16718 0 16 | 36778 1192 1592 | T:powerpc/pp32cv1 | gcc -march=native -mtune=native -Os -fwrapv -fPIC -fPIE -gdwarf-4 -Wall | 20260930 | 20260831 |
| 55650 | 30549 0 16 | 52063 1216 1624 | T:powerpc/pp32cv2 | gcc -march=native -mtune=native -O -fwrapv -fPIC -fPIE -gdwarf-4 -Wall | 20260930 | 20260831 |
| 69300 | 18197 0 16 | 39711 1216 1624 | T:powerpc/pp32cv1 | gcc -march=native -mtune=native -O -fwrapv -fPIC -fPIE -gdwarf-4 -Wall | 20260930 | 20260831 |
Compiler output
try.c: /usr/bin/ld: libcrypto_hash_echosp256.a(echo64.o): relocation R_X86_64_32S against symbol `OLDCV' can not be used when making a PIE object; recompile with -fPIE
try.c: /usr/bin/ld: failed to set dynamic section sizes: bad value
try.c: collect2: error: ld returned 1 exit status
Number of similar (implementation,compiler) pairs: 4, namely:
| Implementation | Compiler |
| T:aes/aes64 | gcc -march=native -mtune=native -O2 -fwrapv -fPIC -fPIE -gdwarf-4 -Wall (14.2.0) |
| T:aes/aes64 | gcc -march=native -mtune=native -O3 -fwrapv -fPIC -fPIE -gdwarf-4 -Wall (14.2.0) |
| T:aes/aes64 | gcc -march=native -mtune=native -O -fwrapv -fPIC -fPIE -gdwarf-4 -Wall (14.2.0) |
| T:aes/aes64 | gcc -march=native -mtune=native -Os -fwrapv -fPIC -fPIE -gdwarf-4 -Wall (14.2.0) |
Compiler output
echo64.S: echo64.c: Assembler messages:
echo64.S: echo64.c:729: Error: no such instruction: `movzbl ebp,ah'
echo64.S: echo64.c:729: Error: no such instruction: `movzbl esi,al'
echo64.S: echo64.c:729: Error: no such instruction: `movzbl ebp,bl'
echo64.S: echo64.c:729: Error: no such instruction: `movzbl esi,bh'
echo64.S: echo64.c:729: Error: no such instruction: `movzbl ebp,al'
echo64.S: echo64.c:729: Error: no such instruction: `movzbl esi,ah'
echo64.S: echo64.c:729: Error: no such instruction: `movzbl ebp,bh'
echo64.S: echo64.c:729: Error: no such instruction: `movzbl esi,bl'
echo64.S: echo64.c:729: Error: no such instruction: `movzbl ebp,ah'
echo64.S: echo64.c:729: Error: no such instruction: `movzbl esi,al'
echo64.S: echo64.c:729: Error: no such instruction: `movzbl ebp,bl'
echo64.S: echo64.c:729: Error: no such instruction: `movzbl esi,bh'
echo64.S: echo64.c:729: Error: no such instruction: `movzbl ebp,al'
echo64.S: echo64.c:729: Error: no such instruction: `movzbl esi,ah'
echo64.S: echo64.c:729: Error: no such instruction: `movzbl ebp,bl'
echo64.S: echo64.c:729: Error: no such instruction: `movzbl esi,bh'
echo64.S: echo64.c:729: Error: no such instruction: `movzbl ebp,dl'
echo64.S: echo64.c:729: Error: no such instruction: `movzbl esi,dh'
echo64.S: echo64.c:729: Error: no such instruction: `movzbl ebp,ch'
echo64.S: echo64.c:729: Error: no such instruction: `movzbl esi,cl'
echo64.S: echo64.c:729: Error: no such instruction: `movzbl ebp,cl'
echo64.S: echo64.c:729: Error: no such instruction: `movzbl esi,ch'
echo64.S: echo64.c:729: Error: no such instruction: `movzbl ebp,dh'
echo64.S: echo64.c:729: Error: no such instruction: `movzbl esi,dl'
echo64.S: ...
Number of similar (implementation,compiler) pairs: 4, namely:
| Implementation | Compiler |
| T:athlon/athlon64 | gcc -march=native -mtune=native -O2 -fwrapv -fPIC -fPIE -gdwarf-4 -Wall (14.2.0) |
| T:athlon/athlon64 | gcc -march=native -mtune=native -O3 -fwrapv -fPIC -fPIE -gdwarf-4 -Wall (14.2.0) |
| T:athlon/athlon64 | gcc -march=native -mtune=native -O -fwrapv -fPIC -fPIE -gdwarf-4 -Wall (14.2.0) |
| T:athlon/athlon64 | gcc -march=native -mtune=native -Os -fwrapv -fPIC -fPIE -gdwarf-4 -Wall (14.2.0) |
Compiler output
echo64.S: echo64.c: Assembler messages:
echo64.S: echo64.c:635: Error: no such instruction: `movzbl ebp,ah'
echo64.S: echo64.c:635: Error: no such instruction: `movzbl esi,al'
echo64.S: echo64.c:635: Error: no such instruction: `movzbl ebp,bl'
echo64.S: echo64.c:635: Error: no such instruction: `movzbl esi,bh'
echo64.S: echo64.c:635: Error: no such instruction: `movzbl ebp,al'
echo64.S: echo64.c:635: Error: no such instruction: `movzbl esi,ah'
echo64.S: echo64.c:635: Error: no such instruction: `movzbl ebp,bh'
echo64.S: echo64.c:635: Error: no such instruction: `movzbl esi,bl'
echo64.S: echo64.c:635: Error: no such instruction: `movzbl ebp,ah'
echo64.S: echo64.c:635: Error: no such instruction: `movzbl esi,al'
echo64.S: echo64.c:635: Error: no such instruction: `movzbl ebp,bl'
echo64.S: echo64.c:635: Error: no such instruction: `movzbl esi,bh'
echo64.S: echo64.c:635: Error: no such instruction: `movzbl ebp,al'
echo64.S: echo64.c:635: Error: no such instruction: `movzbl esi,ah'
echo64.S: echo64.c:635: Error: no such instruction: `movzbl ebp,bl'
echo64.S: echo64.c:635: Error: no such instruction: `movzbl esi,bh'
echo64.S: echo64.c:635: Error: no such instruction: `movzbl ebp,dl'
echo64.S: echo64.c:635: Error: no such instruction: `movzbl esi,dh'
echo64.S: echo64.c:635: Error: no such instruction: `movzbl ebp,ch'
echo64.S: echo64.c:635: Error: no such instruction: `movzbl esi,cl'
echo64.S: echo64.c:635: Error: no such instruction: `movzbl ebp,cl'
echo64.S: echo64.c:635: Error: no such instruction: `movzbl esi,ch'
echo64.S: echo64.c:635: Error: no such instruction: `movzbl ebp,dh'
echo64.S: echo64.c:635: Error: no such instruction: `movzbl esi,dl'
echo64.S: ...
Number of similar (implementation,compiler) pairs: 4, namely:
| Implementation | Compiler |
| T:core2/core2v64 | gcc -march=native -mtune=native -O2 -fwrapv -fPIC -fPIE -gdwarf-4 -Wall (14.2.0) |
| T:core2/core2v64 | gcc -march=native -mtune=native -O3 -fwrapv -fPIC -fPIE -gdwarf-4 -Wall (14.2.0) |
| T:core2/core2v64 | gcc -march=native -mtune=native -O -fwrapv -fPIC -fPIE -gdwarf-4 -Wall (14.2.0) |
| T:core2/core2v64 | gcc -march=native -mtune=native -Os -fwrapv -fPIC -fPIE -gdwarf-4 -Wall (14.2.0) |
Compiler output
echo32.c: echo32.c: In function 'PrintState':
echo32.c: echo32.c:37:25: error: implicit declaration of function 'printf' [-Wimplicit-function-declaration]
echo32.c: 37 | printf ("row %d,col %d :",i,j);
echo32.c: | ^~~~~~
echo32.c: echo32.c:12:1: note: include '<stdio.h>' or provide a declaration of 'printf'
echo32.c: 11 | #include "api.h"
echo32.c: +++ |+#include <stdio.h>
echo32.c: 12 |
echo32.c: echo32.c:37:25: warning: incompatible implicit declaration of built-in function 'printf' [-Wbuiltin-declaration-mismatch]
echo32.c: 37 | printf ("row %d,col %d :",i,j);
echo32.c: | ^~~~~~
echo32.c: echo32.c:37:25: note: include '<stdio.h>' or provide a declaration of 'printf'
echo32.c: echo32.c:47:9: warning: incompatible implicit declaration of built-in function 'printf' [-Wbuiltin-declaration-mismatch]
echo32.c: 47 | printf("-----------------------------------\n");
echo32.c: | ^~~~~~
echo32.c: echo32.c:47:9: note: include '<stdio.h>' or provide a declaration of 'printf'
echo32.c: echo32.c: In function 'Init':
echo32.c: echo32.c:126:23: warning: unused variable 'endianess' [-Wunused-variable]
echo32.c: 126 | unsigned char endianess;
echo32.c: | ^~~~~~~~~
echo32.c: echo32.c:125:25: warning: unused variable 'j' [-Wunused-variable]
echo32.c: 125 | unsigned int i, j;
echo32.c: | ^
echo32.c: echo32.c: In function 'Compress':
echo32.c: echo32.c:398:32: warning: unused variable 'c1' [-Wunused-variable]
echo32.c: ...
Number of similar (implementation,compiler) pairs: 4, namely:
| Implementation | Compiler |
| T:generic/opt32 | gcc -march=native -mtune=native -O2 -fwrapv -fPIC -fPIE -gdwarf-4 -Wall (14.2.0) |
| T:generic/opt32 | gcc -march=native -mtune=native -O3 -fwrapv -fPIC -fPIE -gdwarf-4 -Wall (14.2.0) |
| T:generic/opt32 | gcc -march=native -mtune=native -O -fwrapv -fPIC -fPIE -gdwarf-4 -Wall (14.2.0) |
| T:generic/opt32 | gcc -march=native -mtune=native -Os -fwrapv -fPIC -fPIE -gdwarf-4 -Wall (14.2.0) |
Compiler output
echo64.c: echo64.c: In function 'Compress':
echo64.c: echo64.c:318:30: warning: unused variable 'WT5' [-Wunused-variable]
echo64.c: 318 | WT0, WT1, WT2, WT3, WT4, WT5;
echo64.c: | ^~~
echo64.c: echo64.c: In function 'Final':
echo64.c: echo64.c:486:16: warning: unused variable 'i' [-Wunused-variable]
echo64.c: 486 | unsigned int i;
echo64.c: | ^
echo64.c: echo64.c: In function 'crypto_hash_echosp256_generic_opt64_timingleaks':
echo64.c: echo64.c:555:29: warning: passing argument 2 of 'Hash' discards 'const' qualifier from pointer target type [-Wdiscarded-qualifiers]
echo64.c: 555 | if (Hash(CRYPTO_BYTES * 8,in,inlen * 8,out) == SUCCESS) return 0;
echo64.c: | ^~
echo64.c: echo64.c:542:46: note: expected 'BitSequence *' {aka 'unsigned char *'} but argument is of type 'const unsigned char *'
echo64.c: 542 | HashReturn Hash(int hashbitlen, BitSequence *data, DataLength databitlen, BitSequence *hashval)
echo64.c: | ~~~~~~~~~~~~~^~~~
Number of similar (implementation,compiler) pairs: 4, namely:
| Implementation | Compiler |
| T:generic/opt64 | gcc -march=native -mtune=native -O2 -fwrapv -fPIC -fPIE -gdwarf-4 -Wall (14.2.0) |
| T:generic/opt64 | gcc -march=native -mtune=native -O3 -fwrapv -fPIC -fPIE -gdwarf-4 -Wall (14.2.0) |
| T:generic/opt64 | gcc -march=native -mtune=native -O -fwrapv -fPIC -fPIE -gdwarf-4 -Wall (14.2.0) |
| T:generic/opt64 | gcc -march=native -mtune=native -Os -fwrapv -fPIC -fPIE -gdwarf-4 -Wall (14.2.0) |
Compiler output
echo32.S: echo32.c: Assembler messages:
echo32.S: echo32.c:656: Warning: mnemonic suffix used with `add'
echo32.S: echo32.c:656: Warning: NOTE: Such forms are deprecated and will be rejected by a future version of the assembler
echo32.S: echo32.c:656: Warning: mnemonic suffix used with `add'
echo32.S: echo32.c:656: Warning: mnemonic suffix used with `add'
echo32.S: echo32.c:656: Warning: mnemonic suffix used with `add'
echo32.S: echo32.c:657: Warning: mnemonic suffix used with `add'
echo32.S: echo32.c:657: Warning: mnemonic suffix used with `add'
echo32.S: echo32.c:657: Warning: mnemonic suffix used with `add'
echo32.S: echo32.c:657: Warning: mnemonic suffix used with `add'
echo32.S: echo32.c:658: Warning: mnemonic suffix used with `add'
echo32.S: echo32.c:658: Warning: mnemonic suffix used with `add'
echo32.S: echo32.c:658: Warning: mnemonic suffix used with `add'
echo32.S: echo32.c:658: Warning: mnemonic suffix used with `add'
echo32.S: echo32.c:659: Warning: mnemonic suffix used with `add'
echo32.S: echo32.c:659: Warning: mnemonic suffix used with `add'
echo32.S: echo32.c:659: Warning: mnemonic suffix used with `add'
echo32.S: echo32.c:659: Warning: mnemonic suffix used with `add'
echo32.S: echo32.c:661: Warning: mnemonic suffix used with `sub'
echo32.S: echo32.c:688: Warning: mnemonic suffix used with `add'
echo32.S: echo32.c:688: Warning: mnemonic suffix used with `add'
echo32.S: echo32.c:688: Warning: mnemonic suffix used with `add'
echo32.S: echo32.c:688: Warning: mnemonic suffix used with `add'
echo32.S: echo32.c:688: Warning: mnemonic suffix used with `add'
echo32.S: echo32.c:688: Warning: mnemonic suffix used with `add'
echo32.S: ...
try.c: /usr/bin/ld: libcrypto_hash_echosp256.a(echo32.o): relocation R_X86_64_32S against symbol `SHA3_R' can not be used when making a PIE object; recompile with -fPIE
try.c: /usr/bin/ld: failed to set dynamic section sizes: bad value
try.c: collect2: error: ld returned 1 exit status
Number of similar (implementation,compiler) pairs: 4, namely:
| Implementation | Compiler |
| T:pentium/pentium4v64v1 | gcc -march=native -mtune=native -O2 -fwrapv -fPIC -fPIE -gdwarf-4 -Wall (14.2.0) |
| T:pentium/pentium4v64v1 | gcc -march=native -mtune=native -O3 -fwrapv -fPIC -fPIE -gdwarf-4 -Wall (14.2.0) |
| T:pentium/pentium4v64v1 | gcc -march=native -mtune=native -O -fwrapv -fPIC -fPIE -gdwarf-4 -Wall (14.2.0) |
| T:pentium/pentium4v64v1 | gcc -march=native -mtune=native -Os -fwrapv -fPIC -fPIE -gdwarf-4 -Wall (14.2.0) |
Compiler output
echo64.S: echo64.c: Assembler messages:
echo64.S: echo64.c:735: Warning: mnemonic suffix used with `add'
echo64.S: echo64.c:735: Warning: NOTE: Such forms are deprecated and will be rejected by a future version of the assembler
echo64.S: echo64.c:735: Warning: mnemonic suffix used with `add'
echo64.S: echo64.c:735: Warning: mnemonic suffix used with `add'
echo64.S: echo64.c:735: Warning: mnemonic suffix used with `add'
echo64.S: echo64.c:736: Warning: mnemonic suffix used with `add'
echo64.S: echo64.c:736: Warning: mnemonic suffix used with `add'
echo64.S: echo64.c:736: Warning: mnemonic suffix used with `add'
echo64.S: echo64.c:736: Warning: mnemonic suffix used with `add'
echo64.S: echo64.c:737: Warning: mnemonic suffix used with `add'
echo64.S: echo64.c:737: Warning: mnemonic suffix used with `add'
echo64.S: echo64.c:737: Warning: mnemonic suffix used with `add'
echo64.S: echo64.c:737: Warning: mnemonic suffix used with `add'
echo64.S: echo64.c:738: Warning: mnemonic suffix used with `add'
echo64.S: echo64.c:738: Warning: mnemonic suffix used with `add'
echo64.S: echo64.c:738: Warning: mnemonic suffix used with `add'
echo64.S: echo64.c:738: Warning: mnemonic suffix used with `add'
echo64.S: echo64.c:740: Warning: mnemonic suffix used with `sub'
echo64.S: echo64.c:768: Warning: mnemonic suffix used with `add'
echo64.S: echo64.c:768: Warning: mnemonic suffix used with `add'
echo64.S: echo64.c:768: Warning: mnemonic suffix used with `add'
echo64.S: echo64.c:768: Warning: mnemonic suffix used with `add'
echo64.S: echo64.c:768: Warning: mnemonic suffix used with `add'
echo64.S: echo64.c:768: Warning: mnemonic suffix used with `add'
echo64.S: ...
try.c: /usr/bin/ld: libcrypto_hash_echosp256.a(echo64.o): relocation R_X86_64_32S against symbol `SHA3_R' can not be used when making a PIE object; recompile with -fPIE
try.c: /usr/bin/ld: failed to set dynamic section sizes: bad value
try.c: collect2: error: ld returned 1 exit status
Number of similar (implementation,compiler) pairs: 4, namely:
| Implementation | Compiler |
| T:pentium/pentium4v64v2 | gcc -march=native -mtune=native -O2 -fwrapv -fPIC -fPIE -gdwarf-4 -Wall (14.2.0) |
| T:pentium/pentium4v64v2 | gcc -march=native -mtune=native -O3 -fwrapv -fPIC -fPIE -gdwarf-4 -Wall (14.2.0) |
| T:pentium/pentium4v64v2 | gcc -march=native -mtune=native -O -fwrapv -fPIC -fPIE -gdwarf-4 -Wall (14.2.0) |
| T:pentium/pentium4v64v2 | gcc -march=native -mtune=native -Os -fwrapv -fPIC -fPIE -gdwarf-4 -Wall (14.2.0) |
Compiler output
echo32.c: echo32.c: In function 'Init':
echo32.c: echo32.c:107:23: warning: unused variable 'endianess' [-Wunused-variable]
echo32.c: 107 | unsigned char endianess;
echo32.c: | ^~~~~~~~~
echo32.c: echo32.c:106:25: warning: unused variable 'j' [-Wunused-variable]
echo32.c: 106 | unsigned int i, j;
echo32.c: | ^
echo32.c: echo32.c: In function 'Compress':
echo32.c: echo32.c:512:32: warning: unused variable 'c1' [-Wunused-variable]
echo32.c: 512 | unsigned long long c0, c1;
echo32.c: | ^~
echo32.c: echo32.c:512:28: warning: unused variable 'c0' [-Wunused-variable]
echo32.c: 512 | unsigned long long c0, c1;
echo32.c: | ^~
echo32.c: echo32.c: In function 'Final':
echo32.c: echo32.c:641:28: warning: unused variable 'messlen_h' [-Wunused-variable]
echo32.c: 641 | unsigned long long messlen_h = 0;
echo32.c: | ^~~~~~~~~
echo32.c: echo32.c:640:28: warning: unused variable 'messlen_l' [-Wunused-variable]
echo32.c: 640 | unsigned long long messlen_l = 0;
echo32.c: | ^~~~~~~~~
echo32.c: echo32.c:639:28: warning: unused variable 'hashlen' [-Wunused-variable]
echo32.c: 639 | unsigned short int hashlen = 0;
echo32.c: | ^~~~~~~
Number of similar (implementation,compiler) pairs: 4, namely:
| Implementation | Compiler |
| T:powerpc/pp32cv1 | gcc -march=native -mtune=native -O2 -fwrapv -fPIC -fPIE -gdwarf-4 -Wall (14.2.0) |
| T:powerpc/pp32cv1 | gcc -march=native -mtune=native -O3 -fwrapv -fPIC -fPIE -gdwarf-4 -Wall (14.2.0) |
| T:powerpc/pp32cv1 | gcc -march=native -mtune=native -O -fwrapv -fPIC -fPIE -gdwarf-4 -Wall (14.2.0) |
| T:powerpc/pp32cv1 | gcc -march=native -mtune=native -Os -fwrapv -fPIC -fPIE -gdwarf-4 -Wall (14.2.0) |
Compiler output
echo32.c: echo32.c: In function 'Init':
echo32.c: echo32.c:107:23: warning: unused variable 'endianess' [-Wunused-variable]
echo32.c: 107 | unsigned char endianess;
echo32.c: | ^~~~~~~~~
echo32.c: echo32.c:106:25: warning: unused variable 'j' [-Wunused-variable]
echo32.c: 106 | unsigned int i, j;
echo32.c: | ^
echo32.c: echo32.c: In function 'Compress':
echo32.c: echo32.c:480:32: warning: unused variable 'c1' [-Wunused-variable]
echo32.c: 480 | unsigned long long c0, c1;
echo32.c: | ^~
echo32.c: echo32.c:480:28: warning: unused variable 'c0' [-Wunused-variable]
echo32.c: 480 | unsigned long long c0, c1;
echo32.c: | ^~
echo32.c: echo32.c: In function 'Final':
echo32.c: echo32.c:609:28: warning: unused variable 'messlen_h' [-Wunused-variable]
echo32.c: 609 | unsigned long long messlen_h = 0;
echo32.c: | ^~~~~~~~~
echo32.c: echo32.c:608:28: warning: unused variable 'messlen_l' [-Wunused-variable]
echo32.c: 608 | unsigned long long messlen_l = 0;
echo32.c: | ^~~~~~~~~
echo32.c: echo32.c:607:28: warning: unused variable 'hashlen' [-Wunused-variable]
echo32.c: 607 | unsigned short int hashlen = 0;
echo32.c: | ^~~~~~~
Number of similar (implementation,compiler) pairs: 4, namely:
| Implementation | Compiler |
| T:powerpc/pp32cv2 | gcc -march=native -mtune=native -O2 -fwrapv -fPIC -fPIE -gdwarf-4 -Wall (14.2.0) |
| T:powerpc/pp32cv2 | gcc -march=native -mtune=native -O3 -fwrapv -fPIC -fPIE -gdwarf-4 -Wall (14.2.0) |
| T:powerpc/pp32cv2 | gcc -march=native -mtune=native -O -fwrapv -fPIC -fPIE -gdwarf-4 -Wall (14.2.0) |
| T:powerpc/pp32cv2 | gcc -march=native -mtune=native -Os -fwrapv -fPIC -fPIE -gdwarf-4 -Wall (14.2.0) |
Namespace violations
echo64.o Compress T
echo64.o Endianess T
echo64.o Final T
echo64.o Hash T
echo64.o Init T
echo64.o PushString T
echo64.o Update T
echo64.o endian B
Number of similar (implementation,compiler) pairs: 4, namely:
| Implementation | Compiler |
| T:generic/opt64 | gcc -march=native -mtune=native -O2 -fwrapv -fPIC -fPIE -gdwarf-4 -Wall (14.2.0) |
| T:generic/opt64 | gcc -march=native -mtune=native -O3 -fwrapv -fPIC -fPIE -gdwarf-4 -Wall (14.2.0) |
| T:generic/opt64 | gcc -march=native -mtune=native -O -fwrapv -fPIC -fPIE -gdwarf-4 -Wall (14.2.0) |
| T:generic/opt64 | gcc -march=native -mtune=native -Os -fwrapv -fPIC -fPIE -gdwarf-4 -Wall (14.2.0) |
Namespace violations
echo32.o CNT_r B
echo32.o Compress T
echo32.o Endianess T
echo32.o Final T
echo32.o Hash T
echo32.o Init T
echo32.o PushString T
echo32.o Update T
echo32.o endian B
echo32.o flip_bits T
echo32.o r B
Number of similar (implementation,compiler) pairs: 8, namely:
| Implementation | Compiler |
| T:powerpc/pp32cv1 | gcc -march=native -mtune=native -O2 -fwrapv -fPIC -fPIE -gdwarf-4 -Wall (14.2.0) |
| T:powerpc/pp32cv1 | gcc -march=native -mtune=native -O3 -fwrapv -fPIC -fPIE -gdwarf-4 -Wall (14.2.0) |
| T:powerpc/pp32cv1 | gcc -march=native -mtune=native -O -fwrapv -fPIC -fPIE -gdwarf-4 -Wall (14.2.0) |
| T:powerpc/pp32cv1 | gcc -march=native -mtune=native -Os -fwrapv -fPIC -fPIE -gdwarf-4 -Wall (14.2.0) |
| T:powerpc/pp32cv2 | gcc -march=native -mtune=native -O2 -fwrapv -fPIC -fPIE -gdwarf-4 -Wall (14.2.0) |
| T:powerpc/pp32cv2 | gcc -march=native -mtune=native -O3 -fwrapv -fPIC -fPIE -gdwarf-4 -Wall (14.2.0) |
| T:powerpc/pp32cv2 | gcc -march=native -mtune=native -O -fwrapv -fPIC -fPIE -gdwarf-4 -Wall (14.2.0) |
| T:powerpc/pp32cv2 | gcc -march=native -mtune=native -Os -fwrapv -fPIC -fPIE -gdwarf-4 -Wall (14.2.0) |