Implementation notes: amd64, titan0, crypto_sign/mqqsig224

Computer: titan0
Microarchitecture: amd64; HW+AES (306c3)
Architecture: amd64
CPU ID: GenuineIntel-000306c3-bfebfbff
SUPERCOP version: 20221122
Operation: crypto_sign
Primitive: mqqsig224

Compiler output

Implementation: T:ref
Security model: timingleaks
Compiler: clang -march=native -O2 -fomit-frame-pointer -fwrapv -Qunused-arguments -fPIC -fPIE
try.c: /usr/bin/ld: libcrypto_sign_mqqsig224.a(keygen.o):(.bss+0x240): multiple definition of `lookup_table_private_key'; /tmp/try-small-a4e5b7.o:(.bss+0x2b0): first defined here
try.c: /usr/bin/ld: libcrypto_sign_mqqsig224.a(keygen.o):(.bss+0x0): multiple definition of `mqq_a'; /tmp/try-small-a4e5b7.o:(.bss+0x70): first defined here
try.c: /usr/bin/ld: libcrypto_sign_mqqsig224.a(keygen.o):(.bss+0x60): multiple definition of `cc1'; /tmp/try-small-a4e5b7.o:(.bss+0xd0): first defined here
try.c: /usr/bin/ld: libcrypto_sign_mqqsig224.a(keygen.o):(.bss+0x70): multiple definition of `cc2'; /tmp/try-small-a4e5b7.o:(.bss+0xe0): first defined here
try.c: /usr/bin/ld: libcrypto_sign_mqqsig224.a(keygen.o):(.bss+0x80): multiple definition of `mqq_sigma1'; /tmp/try-small-a4e5b7.o:(.bss+0xf0): first defined here
try.c: /usr/bin/ld: libcrypto_sign_mqqsig224.a(keygen.o):(.bss+0x160): multiple definition of `mqq_sigmaK'; /tmp/try-small-a4e5b7.o:(.bss+0x1d0): first defined here
try.c: /usr/bin/ld: libcrypto_sign_mqqsig224.a(mqq-sign.o):(.bss+0x0): multiple definition of `cc1'; /tmp/try-small-a4e5b7.o:(.bss+0xd0): first defined here
try.c: /usr/bin/ld: libcrypto_sign_mqqsig224.a(mqq-sign.o):(.bss+0x10): multiple definition of `cc2'; /tmp/try-small-a4e5b7.o:(.bss+0xe0): first defined here
try.c: /usr/bin/ld: libcrypto_sign_mqqsig224.a(mqq-sign.o):(.bss+0x20): multiple definition of `mqq_a'; /tmp/try-small-a4e5b7.o:(.bss+0x70): first defined here
try.c: /usr/bin/ld: libcrypto_sign_mqqsig224.a(mqq-sign.o):(.bss+0x80): multiple definition of `mqq_sigma1'; /tmp/try-small-a4e5b7.o:(.bss+0xf0): first defined here
try.c: /usr/bin/ld: libcrypto_sign_mqqsig224.a(mqq-sign.o):(.bss+0x160): multiple definition of `mqq_sigmaK'; /tmp/try-small-a4e5b7.o:(.bss+0x1d0): first defined here
try.c: /usr/bin/ld: libcrypto_sign_mqqsig224.a(mqq-sign.o):(.bss+0x240): multiple definition of `lookup_table_private_key'; /tmp/try-small-a4e5b7.o:(.bss+0x2b0): first defined here
try.c: /usr/bin/ld: libcrypto_sign_mqqsig224.a(mqq-verify.o):(.bss+0x0): multiple definition of `mqq_a'; /tmp/try-small-a4e5b7.o:(.bss+0x70): first defined here
try.c: /usr/bin/ld: libcrypto_sign_mqqsig224.a(mqq-verify.o):(.bss+0x60): multiple definition of `cc1'; /tmp/try-small-a4e5b7.o:(.bss+0xd0): first defined here
try.c: /usr/bin/ld: libcrypto_sign_mqqsig224.a(mqq-verify.o):(.bss+0x70): multiple definition of `cc2'; /tmp/try-small-a4e5b7.o:(.bss+0xe0): first defined here
try.c: /usr/bin/ld: libcrypto_sign_mqqsig224.a(mqq-verify.o):(.bss+0x80): multiple definition of `mqq_sigma1'; /tmp/try-small-a4e5b7.o:(.bss+0xf0): first defined here
try.c: /usr/bin/ld: libcrypto_sign_mqqsig224.a(mqq-verify.o):(.bss+0x160): multiple definition of `mqq_sigmaK'; /tmp/try-small-a4e5b7.o:(.bss+0x1d0): first defined here
try.c: /usr/bin/ld: libcrypto_sign_mqqsig224.a(mqq-verify.o):(.bss+0x240): multiple definition of `lookup_table_private_key'; /tmp/try-small-a4e5b7.o:(.bss+0x2b0): first defined here
try.c: clang: error: linker command failed with exit code 1 (use -v to see invocation)

Number of similar (compiler,implementation) pairs: 1, namely:
CompilerImplementations
clang -march=native -O2 -fomit-frame-pointer -fwrapv -Qunused-arguments -fPIC -fPIE T:ref

Compiler output

Implementation: T:ref
Security model: timingleaks
Compiler: clang -march=native -O3 -fomit-frame-pointer -fwrapv -Qunused-arguments -fPIC -fPIE
try.c: /usr/bin/ld: libcrypto_sign_mqqsig224.a(keygen.o):(.bss+0x240): multiple definition of `lookup_table_private_key'; /tmp/try-small-931691.o:(.bss+0x2b0): first defined here
try.c: /usr/bin/ld: libcrypto_sign_mqqsig224.a(keygen.o):(.bss+0x0): multiple definition of `mqq_a'; /tmp/try-small-931691.o:(.bss+0x70): first defined here
try.c: /usr/bin/ld: libcrypto_sign_mqqsig224.a(keygen.o):(.bss+0x60): multiple definition of `cc1'; /tmp/try-small-931691.o:(.bss+0xd0): first defined here
try.c: /usr/bin/ld: libcrypto_sign_mqqsig224.a(keygen.o):(.bss+0x70): multiple definition of `cc2'; /tmp/try-small-931691.o:(.bss+0xe0): first defined here
try.c: /usr/bin/ld: libcrypto_sign_mqqsig224.a(keygen.o):(.bss+0x80): multiple definition of `mqq_sigma1'; /tmp/try-small-931691.o:(.bss+0xf0): first defined here
try.c: /usr/bin/ld: libcrypto_sign_mqqsig224.a(keygen.o):(.bss+0x160): multiple definition of `mqq_sigmaK'; /tmp/try-small-931691.o:(.bss+0x1d0): first defined here
try.c: /usr/bin/ld: libcrypto_sign_mqqsig224.a(mqq-sign.o):(.bss+0x0): multiple definition of `cc1'; /tmp/try-small-931691.o:(.bss+0xd0): first defined here
try.c: /usr/bin/ld: libcrypto_sign_mqqsig224.a(mqq-sign.o):(.bss+0x10): multiple definition of `cc2'; /tmp/try-small-931691.o:(.bss+0xe0): first defined here
try.c: /usr/bin/ld: libcrypto_sign_mqqsig224.a(mqq-sign.o):(.bss+0x20): multiple definition of `mqq_a'; /tmp/try-small-931691.o:(.bss+0x70): first defined here
try.c: /usr/bin/ld: libcrypto_sign_mqqsig224.a(mqq-sign.o):(.bss+0x80): multiple definition of `mqq_sigma1'; /tmp/try-small-931691.o:(.bss+0xf0): first defined here
try.c: /usr/bin/ld: libcrypto_sign_mqqsig224.a(mqq-sign.o):(.bss+0x160): multiple definition of `mqq_sigmaK'; /tmp/try-small-931691.o:(.bss+0x1d0): first defined here
try.c: /usr/bin/ld: libcrypto_sign_mqqsig224.a(mqq-sign.o):(.bss+0x240): multiple definition of `lookup_table_private_key'; /tmp/try-small-931691.o:(.bss+0x2b0): first defined here
try.c: /usr/bin/ld: libcrypto_sign_mqqsig224.a(mqq-verify.o):(.bss+0x0): multiple definition of `mqq_a'; /tmp/try-small-931691.o:(.bss+0x70): first defined here
try.c: /usr/bin/ld: libcrypto_sign_mqqsig224.a(mqq-verify.o):(.bss+0x60): multiple definition of `cc1'; /tmp/try-small-931691.o:(.bss+0xd0): first defined here
try.c: /usr/bin/ld: libcrypto_sign_mqqsig224.a(mqq-verify.o):(.bss+0x70): multiple definition of `cc2'; /tmp/try-small-931691.o:(.bss+0xe0): first defined here
try.c: /usr/bin/ld: libcrypto_sign_mqqsig224.a(mqq-verify.o):(.bss+0x80): multiple definition of `mqq_sigma1'; /tmp/try-small-931691.o:(.bss+0xf0): first defined here
try.c: /usr/bin/ld: libcrypto_sign_mqqsig224.a(mqq-verify.o):(.bss+0x160): multiple definition of `mqq_sigmaK'; /tmp/try-small-931691.o:(.bss+0x1d0): first defined here
try.c: /usr/bin/ld: libcrypto_sign_mqqsig224.a(mqq-verify.o):(.bss+0x240): multiple definition of `lookup_table_private_key'; /tmp/try-small-931691.o:(.bss+0x2b0): first defined here
try.c: clang: error: linker command failed with exit code 1 (use -v to see invocation)

Number of similar (compiler,implementation) pairs: 1, namely:
CompilerImplementations
clang -march=native -O3 -fomit-frame-pointer -fwrapv -Qunused-arguments -fPIC -fPIE T:ref

Compiler output

Implementation: T:ref
Security model: timingleaks
Compiler: clang -march=native -O -fomit-frame-pointer -fwrapv -Qunused-arguments -fPIC -fPIE
try.c: /usr/bin/ld: libcrypto_sign_mqqsig224.a(keygen.o):(.bss+0x240): multiple definition of `lookup_table_private_key'; /tmp/try-small-5488ac.o:(.bss+0x2b0): first defined here
try.c: /usr/bin/ld: libcrypto_sign_mqqsig224.a(keygen.o):(.bss+0x0): multiple definition of `mqq_a'; /tmp/try-small-5488ac.o:(.bss+0x70): first defined here
try.c: /usr/bin/ld: libcrypto_sign_mqqsig224.a(keygen.o):(.bss+0x60): multiple definition of `cc1'; /tmp/try-small-5488ac.o:(.bss+0xd0): first defined here
try.c: /usr/bin/ld: libcrypto_sign_mqqsig224.a(keygen.o):(.bss+0x70): multiple definition of `cc2'; /tmp/try-small-5488ac.o:(.bss+0xe0): first defined here
try.c: /usr/bin/ld: libcrypto_sign_mqqsig224.a(keygen.o):(.bss+0x80): multiple definition of `mqq_sigma1'; /tmp/try-small-5488ac.o:(.bss+0xf0): first defined here
try.c: /usr/bin/ld: libcrypto_sign_mqqsig224.a(keygen.o):(.bss+0x160): multiple definition of `mqq_sigmaK'; /tmp/try-small-5488ac.o:(.bss+0x1d0): first defined here
try.c: /usr/bin/ld: libcrypto_sign_mqqsig224.a(mqq-sign.o):(.bss+0x0): multiple definition of `cc1'; /tmp/try-small-5488ac.o:(.bss+0xd0): first defined here
try.c: /usr/bin/ld: libcrypto_sign_mqqsig224.a(mqq-sign.o):(.bss+0x10): multiple definition of `cc2'; /tmp/try-small-5488ac.o:(.bss+0xe0): first defined here
try.c: /usr/bin/ld: libcrypto_sign_mqqsig224.a(mqq-sign.o):(.bss+0x20): multiple definition of `mqq_a'; /tmp/try-small-5488ac.o:(.bss+0x70): first defined here
try.c: /usr/bin/ld: libcrypto_sign_mqqsig224.a(mqq-sign.o):(.bss+0x80): multiple definition of `mqq_sigma1'; /tmp/try-small-5488ac.o:(.bss+0xf0): first defined here
try.c: /usr/bin/ld: libcrypto_sign_mqqsig224.a(mqq-sign.o):(.bss+0x160): multiple definition of `mqq_sigmaK'; /tmp/try-small-5488ac.o:(.bss+0x1d0): first defined here
try.c: /usr/bin/ld: libcrypto_sign_mqqsig224.a(mqq-sign.o):(.bss+0x240): multiple definition of `lookup_table_private_key'; /tmp/try-small-5488ac.o:(.bss+0x2b0): first defined here
try.c: /usr/bin/ld: libcrypto_sign_mqqsig224.a(mqq-verify.o):(.bss+0x0): multiple definition of `mqq_a'; /tmp/try-small-5488ac.o:(.bss+0x70): first defined here
try.c: /usr/bin/ld: libcrypto_sign_mqqsig224.a(mqq-verify.o):(.bss+0x60): multiple definition of `cc1'; /tmp/try-small-5488ac.o:(.bss+0xd0): first defined here
try.c: /usr/bin/ld: libcrypto_sign_mqqsig224.a(mqq-verify.o):(.bss+0x70): multiple definition of `cc2'; /tmp/try-small-5488ac.o:(.bss+0xe0): first defined here
try.c: /usr/bin/ld: libcrypto_sign_mqqsig224.a(mqq-verify.o):(.bss+0x80): multiple definition of `mqq_sigma1'; /tmp/try-small-5488ac.o:(.bss+0xf0): first defined here
try.c: /usr/bin/ld: libcrypto_sign_mqqsig224.a(mqq-verify.o):(.bss+0x160): multiple definition of `mqq_sigmaK'; /tmp/try-small-5488ac.o:(.bss+0x1d0): first defined here
try.c: /usr/bin/ld: libcrypto_sign_mqqsig224.a(mqq-verify.o):(.bss+0x240): multiple definition of `lookup_table_private_key'; /tmp/try-small-5488ac.o:(.bss+0x2b0): first defined here
try.c: clang: error: linker command failed with exit code 1 (use -v to see invocation)

Number of similar (compiler,implementation) pairs: 1, namely:
CompilerImplementations
clang -march=native -O -fomit-frame-pointer -fwrapv -Qunused-arguments -fPIC -fPIE T:ref

Compiler output

Implementation: T:ref
Security model: timingleaks
Compiler: clang -march=native -Os -fomit-frame-pointer -fwrapv -Qunused-arguments -fPIC -fPIE
try.c: /usr/bin/ld: libcrypto_sign_mqqsig224.a(keygen.o):(.bss+0x240): multiple definition of `lookup_table_private_key'; /tmp/try-small-85f687.o:(.bss+0x2b0): first defined here
try.c: /usr/bin/ld: libcrypto_sign_mqqsig224.a(keygen.o):(.bss+0x0): multiple definition of `mqq_a'; /tmp/try-small-85f687.o:(.bss+0x70): first defined here
try.c: /usr/bin/ld: libcrypto_sign_mqqsig224.a(keygen.o):(.bss+0x60): multiple definition of `cc1'; /tmp/try-small-85f687.o:(.bss+0xd0): first defined here
try.c: /usr/bin/ld: libcrypto_sign_mqqsig224.a(keygen.o):(.bss+0x70): multiple definition of `cc2'; /tmp/try-small-85f687.o:(.bss+0xe0): first defined here
try.c: /usr/bin/ld: libcrypto_sign_mqqsig224.a(keygen.o):(.bss+0x80): multiple definition of `mqq_sigma1'; /tmp/try-small-85f687.o:(.bss+0xf0): first defined here
try.c: /usr/bin/ld: libcrypto_sign_mqqsig224.a(keygen.o):(.bss+0x160): multiple definition of `mqq_sigmaK'; /tmp/try-small-85f687.o:(.bss+0x1d0): first defined here
try.c: /usr/bin/ld: libcrypto_sign_mqqsig224.a(mqq-sign.o):(.bss+0x0): multiple definition of `cc1'; /tmp/try-small-85f687.o:(.bss+0xd0): first defined here
try.c: /usr/bin/ld: libcrypto_sign_mqqsig224.a(mqq-sign.o):(.bss+0x10): multiple definition of `cc2'; /tmp/try-small-85f687.o:(.bss+0xe0): first defined here
try.c: /usr/bin/ld: libcrypto_sign_mqqsig224.a(mqq-sign.o):(.bss+0x20): multiple definition of `mqq_a'; /tmp/try-small-85f687.o:(.bss+0x70): first defined here
try.c: /usr/bin/ld: libcrypto_sign_mqqsig224.a(mqq-sign.o):(.bss+0x80): multiple definition of `mqq_sigma1'; /tmp/try-small-85f687.o:(.bss+0xf0): first defined here
try.c: /usr/bin/ld: libcrypto_sign_mqqsig224.a(mqq-sign.o):(.bss+0x160): multiple definition of `mqq_sigmaK'; /tmp/try-small-85f687.o:(.bss+0x1d0): first defined here
try.c: /usr/bin/ld: libcrypto_sign_mqqsig224.a(mqq-sign.o):(.bss+0x240): multiple definition of `lookup_table_private_key'; /tmp/try-small-85f687.o:(.bss+0x2b0): first defined here
try.c: /usr/bin/ld: libcrypto_sign_mqqsig224.a(mqq-verify.o):(.bss+0x0): multiple definition of `mqq_a'; /tmp/try-small-85f687.o:(.bss+0x70): first defined here
try.c: /usr/bin/ld: libcrypto_sign_mqqsig224.a(mqq-verify.o):(.bss+0x60): multiple definition of `cc1'; /tmp/try-small-85f687.o:(.bss+0xd0): first defined here
try.c: /usr/bin/ld: libcrypto_sign_mqqsig224.a(mqq-verify.o):(.bss+0x70): multiple definition of `cc2'; /tmp/try-small-85f687.o:(.bss+0xe0): first defined here
try.c: /usr/bin/ld: libcrypto_sign_mqqsig224.a(mqq-verify.o):(.bss+0x80): multiple definition of `mqq_sigma1'; /tmp/try-small-85f687.o:(.bss+0xf0): first defined here
try.c: /usr/bin/ld: libcrypto_sign_mqqsig224.a(mqq-verify.o):(.bss+0x160): multiple definition of `mqq_sigmaK'; /tmp/try-small-85f687.o:(.bss+0x1d0): first defined here
try.c: /usr/bin/ld: libcrypto_sign_mqqsig224.a(mqq-verify.o):(.bss+0x240): multiple definition of `lookup_table_private_key'; /tmp/try-small-85f687.o:(.bss+0x2b0): first defined here
try.c: clang: error: linker command failed with exit code 1 (use -v to see invocation)

Number of similar (compiler,implementation) pairs: 1, namely:
CompilerImplementations
clang -march=native -Os -fomit-frame-pointer -fwrapv -Qunused-arguments -fPIC -fPIE T:ref

Compiler output

Implementation: T:ref
Security model: timingleaks
Compiler: clang -mcpu=native -O3 -fomit-frame-pointer -fwrapv -Qunused-arguments -fPIC -fPIE
try.c: /usr/bin/ld: libcrypto_sign_mqqsig224.a(keygen.o):(.bss+0x240): multiple definition of `lookup_table_private_key'; /tmp/try-small-be08df.o:(.bss+0x2b0): first defined here
try.c: /usr/bin/ld: libcrypto_sign_mqqsig224.a(keygen.o):(.bss+0x0): multiple definition of `mqq_a'; /tmp/try-small-be08df.o:(.bss+0x70): first defined here
try.c: /usr/bin/ld: libcrypto_sign_mqqsig224.a(keygen.o):(.bss+0x60): multiple definition of `cc1'; /tmp/try-small-be08df.o:(.bss+0xd0): first defined here
try.c: /usr/bin/ld: libcrypto_sign_mqqsig224.a(keygen.o):(.bss+0x70): multiple definition of `cc2'; /tmp/try-small-be08df.o:(.bss+0xe0): first defined here
try.c: /usr/bin/ld: libcrypto_sign_mqqsig224.a(keygen.o):(.bss+0x80): multiple definition of `mqq_sigma1'; /tmp/try-small-be08df.o:(.bss+0xf0): first defined here
try.c: /usr/bin/ld: libcrypto_sign_mqqsig224.a(keygen.o):(.bss+0x160): multiple definition of `mqq_sigmaK'; /tmp/try-small-be08df.o:(.bss+0x1d0): first defined here
try.c: /usr/bin/ld: libcrypto_sign_mqqsig224.a(mqq-sign.o):(.bss+0x0): multiple definition of `cc1'; /tmp/try-small-be08df.o:(.bss+0xd0): first defined here
try.c: /usr/bin/ld: libcrypto_sign_mqqsig224.a(mqq-sign.o):(.bss+0x10): multiple definition of `cc2'; /tmp/try-small-be08df.o:(.bss+0xe0): first defined here
try.c: /usr/bin/ld: libcrypto_sign_mqqsig224.a(mqq-sign.o):(.bss+0x20): multiple definition of `mqq_a'; /tmp/try-small-be08df.o:(.bss+0x70): first defined here
try.c: /usr/bin/ld: libcrypto_sign_mqqsig224.a(mqq-sign.o):(.bss+0x80): multiple definition of `mqq_sigma1'; /tmp/try-small-be08df.o:(.bss+0xf0): first defined here
try.c: /usr/bin/ld: libcrypto_sign_mqqsig224.a(mqq-sign.o):(.bss+0x160): multiple definition of `mqq_sigmaK'; /tmp/try-small-be08df.o:(.bss+0x1d0): first defined here
try.c: /usr/bin/ld: libcrypto_sign_mqqsig224.a(mqq-sign.o):(.bss+0x240): multiple definition of `lookup_table_private_key'; /tmp/try-small-be08df.o:(.bss+0x2b0): first defined here
try.c: /usr/bin/ld: libcrypto_sign_mqqsig224.a(mqq-verify.o):(.bss+0x0): multiple definition of `mqq_a'; /tmp/try-small-be08df.o:(.bss+0x70): first defined here
try.c: /usr/bin/ld: libcrypto_sign_mqqsig224.a(mqq-verify.o):(.bss+0x60): multiple definition of `cc1'; /tmp/try-small-be08df.o:(.bss+0xd0): first defined here
try.c: /usr/bin/ld: libcrypto_sign_mqqsig224.a(mqq-verify.o):(.bss+0x70): multiple definition of `cc2'; /tmp/try-small-be08df.o:(.bss+0xe0): first defined here
try.c: /usr/bin/ld: libcrypto_sign_mqqsig224.a(mqq-verify.o):(.bss+0x80): multiple definition of `mqq_sigma1'; /tmp/try-small-be08df.o:(.bss+0xf0): first defined here
try.c: /usr/bin/ld: libcrypto_sign_mqqsig224.a(mqq-verify.o):(.bss+0x160): multiple definition of `mqq_sigmaK'; /tmp/try-small-be08df.o:(.bss+0x1d0): first defined here
try.c: /usr/bin/ld: libcrypto_sign_mqqsig224.a(mqq-verify.o):(.bss+0x240): multiple definition of `lookup_table_private_key'; /tmp/try-small-be08df.o:(.bss+0x2b0): first defined here
try.c: clang: error: linker command failed with exit code 1 (use -v to see invocation)

Number of similar (compiler,implementation) pairs: 1, namely:
CompilerImplementations
clang -mcpu=native -O3 -fomit-frame-pointer -fwrapv -Qunused-arguments -fPIC -fPIE T:ref

Compiler output

Implementation: T:ref
Security model: timingleaks
Compiler: gcc -march=native -mtune=native -O2 -fomit-frame-pointer -fwrapv -fPIC -fPIE
try.c: /usr/bin/ld: libcrypto_sign_mqqsig224.a(keygen.o):(.bss+0x0): multiple definition of `lookup_table_private_key'; /tmp/ccgnbFzU.o:(.bss+0x20): first defined here
try.c: /usr/bin/ld: libcrypto_sign_mqqsig224.a(keygen.o):(.bss+0x20000): multiple definition of `mqq_sigmaK'; /tmp/ccgnbFzU.o:(.bss+0x20020): first defined here
try.c: /usr/bin/ld: libcrypto_sign_mqqsig224.a(keygen.o):(.bss+0x200e0): multiple definition of `mqq_sigma1'; /tmp/ccgnbFzU.o:(.bss+0x20100): first defined here
try.c: /usr/bin/ld: libcrypto_sign_mqqsig224.a(keygen.o):(.bss+0x201c0): multiple definition of `cc2'; /tmp/ccgnbFzU.o:(.bss+0x201e0): first defined here
try.c: /usr/bin/ld: libcrypto_sign_mqqsig224.a(keygen.o):(.bss+0x201d0): multiple definition of `cc1'; /tmp/ccgnbFzU.o:(.bss+0x201f0): first defined here
try.c: /usr/bin/ld: libcrypto_sign_mqqsig224.a(keygen.o):(.bss+0x201e0): multiple definition of `mqq_a'; /tmp/ccgnbFzU.o:(.bss+0x20200): first defined here
try.c: /usr/bin/ld: libcrypto_sign_mqqsig224.a(mqq-sign.o):(.bss+0x201d0): multiple definition of `cc1'; /tmp/ccgnbFzU.o:(.bss+0x201f0): first defined here
try.c: /usr/bin/ld: libcrypto_sign_mqqsig224.a(mqq-sign.o):(.bss+0x201e0): multiple definition of `mqq_a'; /tmp/ccgnbFzU.o:(.bss+0x20200): first defined here
try.c: /usr/bin/ld: libcrypto_sign_mqqsig224.a(mqq-sign.o):(.bss+0x201c0): multiple definition of `cc2'; /tmp/ccgnbFzU.o:(.bss+0x201e0): first defined here
try.c: /usr/bin/ld: libcrypto_sign_mqqsig224.a(mqq-sign.o):(.bss+0x20000): multiple definition of `mqq_sigmaK'; /tmp/ccgnbFzU.o:(.bss+0x20020): first defined here
try.c: /usr/bin/ld: libcrypto_sign_mqqsig224.a(mqq-sign.o):(.bss+0x200e0): multiple definition of `mqq_sigma1'; /tmp/ccgnbFzU.o:(.bss+0x20100): first defined here
try.c: /usr/bin/ld: libcrypto_sign_mqqsig224.a(mqq-sign.o):(.bss+0x0): multiple definition of `lookup_table_private_key'; /tmp/ccgnbFzU.o:(.bss+0x20): first defined here
try.c: /usr/bin/ld: libcrypto_sign_mqqsig224.a(mqq-verify.o):(.bss+0x0): multiple definition of `lookup_table_private_key'; /tmp/ccgnbFzU.o:(.bss+0x20): first defined here
try.c: /usr/bin/ld: libcrypto_sign_mqqsig224.a(mqq-verify.o):(.bss+0x20000): multiple definition of `mqq_sigmaK'; /tmp/ccgnbFzU.o:(.bss+0x20020): first defined here
try.c: /usr/bin/ld: libcrypto_sign_mqqsig224.a(mqq-verify.o):(.bss+0x200e0): multiple definition of `mqq_sigma1'; /tmp/ccgnbFzU.o:(.bss+0x20100): first defined here
try.c: /usr/bin/ld: libcrypto_sign_mqqsig224.a(mqq-verify.o):(.bss+0x201c0): multiple definition of `cc2'; /tmp/ccgnbFzU.o:(.bss+0x201e0): first defined here
try.c: /usr/bin/ld: libcrypto_sign_mqqsig224.a(mqq-verify.o):(.bss+0x201d0): multiple definition of `cc1'; /tmp/ccgnbFzU.o:(.bss+0x201f0): first defined here
try.c: /usr/bin/ld: libcrypto_sign_mqqsig224.a(mqq-verify.o):(.bss+0x201e0): multiple definition of `mqq_a'; /tmp/ccgnbFzU.o:(.bss+0x20200): first defined here
try.c: collect2: error: ld returned 1 exit status

Number of similar (compiler,implementation) pairs: 1, namely:
CompilerImplementations
gcc -march=native -mtune=native -O2 -fomit-frame-pointer -fwrapv -fPIC -fPIE T:ref

Compiler output

Implementation: T:ref
Security model: timingleaks
Compiler: gcc -march=native -mtune=native -O3 -fomit-frame-pointer -fwrapv -fPIC -fPIE
try.c: /usr/bin/ld: libcrypto_sign_mqqsig224.a(keygen.o):(.bss+0x0): multiple definition of `lookup_table_private_key'; /tmp/ccnQAOvJ.o:(.bss+0x20): first defined here
try.c: /usr/bin/ld: libcrypto_sign_mqqsig224.a(keygen.o):(.bss+0x20000): multiple definition of `mqq_sigmaK'; /tmp/ccnQAOvJ.o:(.bss+0x20020): first defined here
try.c: /usr/bin/ld: libcrypto_sign_mqqsig224.a(keygen.o):(.bss+0x200e0): multiple definition of `mqq_sigma1'; /tmp/ccnQAOvJ.o:(.bss+0x20100): first defined here
try.c: /usr/bin/ld: libcrypto_sign_mqqsig224.a(keygen.o):(.bss+0x201c0): multiple definition of `cc2'; /tmp/ccnQAOvJ.o:(.bss+0x201e0): first defined here
try.c: /usr/bin/ld: libcrypto_sign_mqqsig224.a(keygen.o):(.bss+0x201d0): multiple definition of `cc1'; /tmp/ccnQAOvJ.o:(.bss+0x201f0): first defined here
try.c: /usr/bin/ld: libcrypto_sign_mqqsig224.a(keygen.o):(.bss+0x201e0): multiple definition of `mqq_a'; /tmp/ccnQAOvJ.o:(.bss+0x20200): first defined here
try.c: /usr/bin/ld: libcrypto_sign_mqqsig224.a(mqq-sign.o):(.bss+0x20000): multiple definition of `mqq_sigmaK'; /tmp/ccnQAOvJ.o:(.bss+0x20020): first defined here
try.c: /usr/bin/ld: libcrypto_sign_mqqsig224.a(mqq-sign.o):(.bss+0x200e0): multiple definition of `mqq_sigma1'; /tmp/ccnQAOvJ.o:(.bss+0x20100): first defined here
try.c: /usr/bin/ld: libcrypto_sign_mqqsig224.a(mqq-sign.o):(.bss+0x201d0): multiple definition of `cc1'; /tmp/ccnQAOvJ.o:(.bss+0x201f0): first defined here
try.c: /usr/bin/ld: libcrypto_sign_mqqsig224.a(mqq-sign.o):(.bss+0x201c0): multiple definition of `cc2'; /tmp/ccnQAOvJ.o:(.bss+0x201e0): first defined here
try.c: /usr/bin/ld: libcrypto_sign_mqqsig224.a(mqq-sign.o):(.bss+0x201e0): multiple definition of `mqq_a'; /tmp/ccnQAOvJ.o:(.bss+0x20200): first defined here
try.c: /usr/bin/ld: libcrypto_sign_mqqsig224.a(mqq-sign.o):(.bss+0x0): multiple definition of `lookup_table_private_key'; /tmp/ccnQAOvJ.o:(.bss+0x20): first defined here
try.c: /usr/bin/ld: libcrypto_sign_mqqsig224.a(mqq-verify.o):(.bss+0x0): multiple definition of `lookup_table_private_key'; /tmp/ccnQAOvJ.o:(.bss+0x20): first defined here
try.c: /usr/bin/ld: libcrypto_sign_mqqsig224.a(mqq-verify.o):(.bss+0x20000): multiple definition of `mqq_sigmaK'; /tmp/ccnQAOvJ.o:(.bss+0x20020): first defined here
try.c: /usr/bin/ld: libcrypto_sign_mqqsig224.a(mqq-verify.o):(.bss+0x200e0): multiple definition of `mqq_sigma1'; /tmp/ccnQAOvJ.o:(.bss+0x20100): first defined here
try.c: /usr/bin/ld: libcrypto_sign_mqqsig224.a(mqq-verify.o):(.bss+0x201c0): multiple definition of `cc2'; /tmp/ccnQAOvJ.o:(.bss+0x201e0): first defined here
try.c: /usr/bin/ld: libcrypto_sign_mqqsig224.a(mqq-verify.o):(.bss+0x201d0): multiple definition of `cc1'; /tmp/ccnQAOvJ.o:(.bss+0x201f0): first defined here
try.c: /usr/bin/ld: libcrypto_sign_mqqsig224.a(mqq-verify.o):(.bss+0x201e0): multiple definition of `mqq_a'; /tmp/ccnQAOvJ.o:(.bss+0x20200): first defined here
try.c: collect2: error: ld returned 1 exit status

Number of similar (compiler,implementation) pairs: 1, namely:
CompilerImplementations
gcc -march=native -mtune=native -O3 -fomit-frame-pointer -fwrapv -fPIC -fPIE T:ref

Compiler output

Implementation: T:ref
Security model: timingleaks
Compiler: gcc -march=native -mtune=native -O -fomit-frame-pointer -fwrapv -fPIC -fPIE
try.c: /usr/bin/ld: libcrypto_sign_mqqsig224.a(keygen.o):(.bss+0x0): multiple definition of `lookup_table_private_key'; /tmp/ccB7vN5Y.o:(.bss+0x20): first defined here
try.c: /usr/bin/ld: libcrypto_sign_mqqsig224.a(keygen.o):(.bss+0x20000): multiple definition of `mqq_sigmaK'; /tmp/ccB7vN5Y.o:(.bss+0x20020): first defined here
try.c: /usr/bin/ld: libcrypto_sign_mqqsig224.a(keygen.o):(.bss+0x200e0): multiple definition of `mqq_sigma1'; /tmp/ccB7vN5Y.o:(.bss+0x20100): first defined here
try.c: /usr/bin/ld: libcrypto_sign_mqqsig224.a(keygen.o):(.bss+0x201c0): multiple definition of `cc2'; /tmp/ccB7vN5Y.o:(.bss+0x201e0): first defined here
try.c: /usr/bin/ld: libcrypto_sign_mqqsig224.a(keygen.o):(.bss+0x201d0): multiple definition of `cc1'; /tmp/ccB7vN5Y.o:(.bss+0x201f0): first defined here
try.c: /usr/bin/ld: libcrypto_sign_mqqsig224.a(keygen.o):(.bss+0x201e0): multiple definition of `mqq_a'; /tmp/ccB7vN5Y.o:(.bss+0x20200): first defined here
try.c: /usr/bin/ld: libcrypto_sign_mqqsig224.a(mqq-sign.o):(.bss+0x20000): multiple definition of `mqq_sigmaK'; /tmp/ccB7vN5Y.o:(.bss+0x20020): first defined here
try.c: /usr/bin/ld: libcrypto_sign_mqqsig224.a(mqq-sign.o):(.bss+0x200e0): multiple definition of `mqq_sigma1'; /tmp/ccB7vN5Y.o:(.bss+0x20100): first defined here
try.c: /usr/bin/ld: libcrypto_sign_mqqsig224.a(mqq-sign.o):(.bss+0x201d0): multiple definition of `cc1'; /tmp/ccB7vN5Y.o:(.bss+0x201f0): first defined here
try.c: /usr/bin/ld: libcrypto_sign_mqqsig224.a(mqq-sign.o):(.bss+0x201e0): multiple definition of `mqq_a'; /tmp/ccB7vN5Y.o:(.bss+0x20200): first defined here
try.c: /usr/bin/ld: libcrypto_sign_mqqsig224.a(mqq-sign.o):(.bss+0x201c0): multiple definition of `cc2'; /tmp/ccB7vN5Y.o:(.bss+0x201e0): first defined here
try.c: /usr/bin/ld: libcrypto_sign_mqqsig224.a(mqq-sign.o):(.bss+0x0): multiple definition of `lookup_table_private_key'; /tmp/ccB7vN5Y.o:(.bss+0x20): first defined here
try.c: /usr/bin/ld: libcrypto_sign_mqqsig224.a(mqq-verify.o):(.bss+0x0): multiple definition of `lookup_table_private_key'; /tmp/ccB7vN5Y.o:(.bss+0x20): first defined here
try.c: /usr/bin/ld: libcrypto_sign_mqqsig224.a(mqq-verify.o):(.bss+0x20000): multiple definition of `mqq_sigmaK'; /tmp/ccB7vN5Y.o:(.bss+0x20020): first defined here
try.c: /usr/bin/ld: libcrypto_sign_mqqsig224.a(mqq-verify.o):(.bss+0x200e0): multiple definition of `mqq_sigma1'; /tmp/ccB7vN5Y.o:(.bss+0x20100): first defined here
try.c: /usr/bin/ld: libcrypto_sign_mqqsig224.a(mqq-verify.o):(.bss+0x201c0): multiple definition of `cc2'; /tmp/ccB7vN5Y.o:(.bss+0x201e0): first defined here
try.c: /usr/bin/ld: libcrypto_sign_mqqsig224.a(mqq-verify.o):(.bss+0x201d0): multiple definition of `cc1'; /tmp/ccB7vN5Y.o:(.bss+0x201f0): first defined here
try.c: /usr/bin/ld: libcrypto_sign_mqqsig224.a(mqq-verify.o):(.bss+0x201e0): multiple definition of `mqq_a'; /tmp/ccB7vN5Y.o:(.bss+0x20200): first defined here
try.c: collect2: error: ld returned 1 exit status

Number of similar (compiler,implementation) pairs: 1, namely:
CompilerImplementations
gcc -march=native -mtune=native -O -fomit-frame-pointer -fwrapv -fPIC -fPIE T:ref

Compiler output

Implementation: T:ref
Security model: timingleaks
Compiler: gcc -march=native -mtune=native -Os -fomit-frame-pointer -fwrapv -fPIC -fPIE
try.c: /usr/bin/ld: libcrypto_sign_mqqsig224.a(keygen.o):(.bss+0x0): multiple definition of `lookup_table_private_key'; /tmp/ccZuKXRc.o:(.bss+0x20): first defined here
try.c: /usr/bin/ld: libcrypto_sign_mqqsig224.a(keygen.o):(.bss+0x20000): multiple definition of `mqq_sigmaK'; /tmp/ccZuKXRc.o:(.bss+0x20020): first defined here
try.c: /usr/bin/ld: libcrypto_sign_mqqsig224.a(keygen.o):(.bss+0x200e0): multiple definition of `mqq_sigma1'; /tmp/ccZuKXRc.o:(.bss+0x20100): first defined here
try.c: /usr/bin/ld: libcrypto_sign_mqqsig224.a(keygen.o):(.bss+0x201c0): multiple definition of `cc2'; /tmp/ccZuKXRc.o:(.bss+0x201e0): first defined here
try.c: /usr/bin/ld: libcrypto_sign_mqqsig224.a(keygen.o):(.bss+0x201d0): multiple definition of `cc1'; /tmp/ccZuKXRc.o:(.bss+0x201f0): first defined here
try.c: /usr/bin/ld: libcrypto_sign_mqqsig224.a(keygen.o):(.bss+0x201e0): multiple definition of `mqq_a'; /tmp/ccZuKXRc.o:(.bss+0x20200): first defined here
try.c: /usr/bin/ld: libcrypto_sign_mqqsig224.a(mqq-sign.o):(.bss+0x20000): multiple definition of `mqq_sigmaK'; /tmp/ccZuKXRc.o:(.bss+0x20020): first defined here
try.c: /usr/bin/ld: libcrypto_sign_mqqsig224.a(mqq-sign.o):(.bss+0x200e0): multiple definition of `mqq_sigma1'; /tmp/ccZuKXRc.o:(.bss+0x20100): first defined here
try.c: /usr/bin/ld: libcrypto_sign_mqqsig224.a(mqq-sign.o):(.bss+0x201d0): multiple definition of `cc1'; /tmp/ccZuKXRc.o:(.bss+0x201f0): first defined here
try.c: /usr/bin/ld: libcrypto_sign_mqqsig224.a(mqq-sign.o):(.bss+0x201e0): multiple definition of `mqq_a'; /tmp/ccZuKXRc.o:(.bss+0x20200): first defined here
try.c: /usr/bin/ld: libcrypto_sign_mqqsig224.a(mqq-sign.o):(.bss+0x201c0): multiple definition of `cc2'; /tmp/ccZuKXRc.o:(.bss+0x201e0): first defined here
try.c: /usr/bin/ld: libcrypto_sign_mqqsig224.a(mqq-sign.o):(.bss+0x0): multiple definition of `lookup_table_private_key'; /tmp/ccZuKXRc.o:(.bss+0x20): first defined here
try.c: /usr/bin/ld: libcrypto_sign_mqqsig224.a(mqq-verify.o):(.bss+0x0): multiple definition of `lookup_table_private_key'; /tmp/ccZuKXRc.o:(.bss+0x20): first defined here
try.c: /usr/bin/ld: libcrypto_sign_mqqsig224.a(mqq-verify.o):(.bss+0x20000): multiple definition of `mqq_sigmaK'; /tmp/ccZuKXRc.o:(.bss+0x20020): first defined here
try.c: /usr/bin/ld: libcrypto_sign_mqqsig224.a(mqq-verify.o):(.bss+0x200e0): multiple definition of `mqq_sigma1'; /tmp/ccZuKXRc.o:(.bss+0x20100): first defined here
try.c: /usr/bin/ld: libcrypto_sign_mqqsig224.a(mqq-verify.o):(.bss+0x201c0): multiple definition of `cc2'; /tmp/ccZuKXRc.o:(.bss+0x201e0): first defined here
try.c: /usr/bin/ld: libcrypto_sign_mqqsig224.a(mqq-verify.o):(.bss+0x201d0): multiple definition of `cc1'; /tmp/ccZuKXRc.o:(.bss+0x201f0): first defined here
try.c: /usr/bin/ld: libcrypto_sign_mqqsig224.a(mqq-verify.o):(.bss+0x201e0): multiple definition of `mqq_a'; /tmp/ccZuKXRc.o:(.bss+0x20200): first defined here
try.c: collect2: error: ld returned 1 exit status

Number of similar (compiler,implementation) pairs: 1, namely:
CompilerImplementations
gcc -march=native -mtune=native -Os -fomit-frame-pointer -fwrapv -fPIC -fPIE T:ref