Implementation notes: amd64, titan0, crypto_sign/mqqsig192

Computer: titan0
Microarchitecture: amd64; HW+AES (306c3)
Architecture: amd64
CPU ID: GenuineIntel-000306c3-bfebfbff
SUPERCOP version: 20221122
Operation: crypto_sign
Primitive: mqqsig192

Compiler output

Implementation: T:ref
Security model: timingleaks
Compiler: clang -march=native -O2 -fomit-frame-pointer -fwrapv -Qunused-arguments -fPIC -fPIE
try.c: /usr/bin/ld: libcrypto_sign_mqqsig192.a(keygen.o):(.bss+0x200): multiple definition of `lookup_table_private_key'; /tmp/try-small-e3a65f.o:(.bss+0x270): first defined here
try.c: /usr/bin/ld: libcrypto_sign_mqqsig192.a(keygen.o):(.bss+0x0): multiple definition of `mqq_a'; /tmp/try-small-e3a65f.o:(.bss+0x70): first defined here
try.c: /usr/bin/ld: libcrypto_sign_mqqsig192.a(keygen.o):(.bss+0x60): multiple definition of `cc1'; /tmp/try-small-e3a65f.o:(.bss+0xd0): first defined here
try.c: /usr/bin/ld: libcrypto_sign_mqqsig192.a(keygen.o):(.bss+0x70): multiple definition of `cc2'; /tmp/try-small-e3a65f.o:(.bss+0xe0): first defined here
try.c: /usr/bin/ld: libcrypto_sign_mqqsig192.a(keygen.o):(.bss+0x80): multiple definition of `mqq_sigma1'; /tmp/try-small-e3a65f.o:(.bss+0xf0): first defined here
try.c: /usr/bin/ld: libcrypto_sign_mqqsig192.a(keygen.o):(.bss+0x140): multiple definition of `mqq_sigmaK'; /tmp/try-small-e3a65f.o:(.bss+0x1b0): first defined here
try.c: /usr/bin/ld: libcrypto_sign_mqqsig192.a(mqq-sign.o):(.bss+0x0): multiple definition of `cc1'; /tmp/try-small-e3a65f.o:(.bss+0xd0): first defined here
try.c: /usr/bin/ld: libcrypto_sign_mqqsig192.a(mqq-sign.o):(.bss+0x10): multiple definition of `cc2'; /tmp/try-small-e3a65f.o:(.bss+0xe0): first defined here
try.c: /usr/bin/ld: libcrypto_sign_mqqsig192.a(mqq-sign.o):(.bss+0x20): multiple definition of `mqq_a'; /tmp/try-small-e3a65f.o:(.bss+0x70): first defined here
try.c: /usr/bin/ld: libcrypto_sign_mqqsig192.a(mqq-sign.o):(.bss+0x80): multiple definition of `mqq_sigma1'; /tmp/try-small-e3a65f.o:(.bss+0xf0): first defined here
try.c: /usr/bin/ld: libcrypto_sign_mqqsig192.a(mqq-sign.o):(.bss+0x140): multiple definition of `mqq_sigmaK'; /tmp/try-small-e3a65f.o:(.bss+0x1b0): first defined here
try.c: /usr/bin/ld: libcrypto_sign_mqqsig192.a(mqq-sign.o):(.bss+0x200): multiple definition of `lookup_table_private_key'; /tmp/try-small-e3a65f.o:(.bss+0x270): first defined here
try.c: /usr/bin/ld: libcrypto_sign_mqqsig192.a(mqq-verify.o):(.bss+0x0): multiple definition of `mqq_a'; /tmp/try-small-e3a65f.o:(.bss+0x70): first defined here
try.c: /usr/bin/ld: libcrypto_sign_mqqsig192.a(mqq-verify.o):(.bss+0x60): multiple definition of `cc1'; /tmp/try-small-e3a65f.o:(.bss+0xd0): first defined here
try.c: /usr/bin/ld: libcrypto_sign_mqqsig192.a(mqq-verify.o):(.bss+0x70): multiple definition of `cc2'; /tmp/try-small-e3a65f.o:(.bss+0xe0): first defined here
try.c: /usr/bin/ld: libcrypto_sign_mqqsig192.a(mqq-verify.o):(.bss+0x80): multiple definition of `mqq_sigma1'; /tmp/try-small-e3a65f.o:(.bss+0xf0): first defined here
try.c: /usr/bin/ld: libcrypto_sign_mqqsig192.a(mqq-verify.o):(.bss+0x140): multiple definition of `mqq_sigmaK'; /tmp/try-small-e3a65f.o:(.bss+0x1b0): first defined here
try.c: /usr/bin/ld: libcrypto_sign_mqqsig192.a(mqq-verify.o):(.bss+0x200): multiple definition of `lookup_table_private_key'; /tmp/try-small-e3a65f.o:(.bss+0x270): first defined here
try.c: clang: error: linker command failed with exit code 1 (use -v to see invocation)

Number of similar (compiler,implementation) pairs: 1, namely:
CompilerImplementations
clang -march=native -O2 -fomit-frame-pointer -fwrapv -Qunused-arguments -fPIC -fPIE T:ref

Compiler output

Implementation: T:ref
Security model: timingleaks
Compiler: clang -march=native -O3 -fomit-frame-pointer -fwrapv -Qunused-arguments -fPIC -fPIE
try.c: /usr/bin/ld: libcrypto_sign_mqqsig192.a(keygen.o):(.bss+0x200): multiple definition of `lookup_table_private_key'; /tmp/try-small-a7da37.o:(.bss+0x270): first defined here
try.c: /usr/bin/ld: libcrypto_sign_mqqsig192.a(keygen.o):(.bss+0x0): multiple definition of `mqq_a'; /tmp/try-small-a7da37.o:(.bss+0x70): first defined here
try.c: /usr/bin/ld: libcrypto_sign_mqqsig192.a(keygen.o):(.bss+0x60): multiple definition of `cc1'; /tmp/try-small-a7da37.o:(.bss+0xd0): first defined here
try.c: /usr/bin/ld: libcrypto_sign_mqqsig192.a(keygen.o):(.bss+0x70): multiple definition of `cc2'; /tmp/try-small-a7da37.o:(.bss+0xe0): first defined here
try.c: /usr/bin/ld: libcrypto_sign_mqqsig192.a(keygen.o):(.bss+0x80): multiple definition of `mqq_sigma1'; /tmp/try-small-a7da37.o:(.bss+0xf0): first defined here
try.c: /usr/bin/ld: libcrypto_sign_mqqsig192.a(keygen.o):(.bss+0x140): multiple definition of `mqq_sigmaK'; /tmp/try-small-a7da37.o:(.bss+0x1b0): first defined here
try.c: /usr/bin/ld: libcrypto_sign_mqqsig192.a(mqq-sign.o):(.bss+0x0): multiple definition of `cc1'; /tmp/try-small-a7da37.o:(.bss+0xd0): first defined here
try.c: /usr/bin/ld: libcrypto_sign_mqqsig192.a(mqq-sign.o):(.bss+0x10): multiple definition of `cc2'; /tmp/try-small-a7da37.o:(.bss+0xe0): first defined here
try.c: /usr/bin/ld: libcrypto_sign_mqqsig192.a(mqq-sign.o):(.bss+0x20): multiple definition of `mqq_a'; /tmp/try-small-a7da37.o:(.bss+0x70): first defined here
try.c: /usr/bin/ld: libcrypto_sign_mqqsig192.a(mqq-sign.o):(.bss+0x80): multiple definition of `mqq_sigma1'; /tmp/try-small-a7da37.o:(.bss+0xf0): first defined here
try.c: /usr/bin/ld: libcrypto_sign_mqqsig192.a(mqq-sign.o):(.bss+0x140): multiple definition of `mqq_sigmaK'; /tmp/try-small-a7da37.o:(.bss+0x1b0): first defined here
try.c: /usr/bin/ld: libcrypto_sign_mqqsig192.a(mqq-sign.o):(.bss+0x200): multiple definition of `lookup_table_private_key'; /tmp/try-small-a7da37.o:(.bss+0x270): first defined here
try.c: /usr/bin/ld: libcrypto_sign_mqqsig192.a(mqq-verify.o):(.bss+0x0): multiple definition of `mqq_a'; /tmp/try-small-a7da37.o:(.bss+0x70): first defined here
try.c: /usr/bin/ld: libcrypto_sign_mqqsig192.a(mqq-verify.o):(.bss+0x60): multiple definition of `cc1'; /tmp/try-small-a7da37.o:(.bss+0xd0): first defined here
try.c: /usr/bin/ld: libcrypto_sign_mqqsig192.a(mqq-verify.o):(.bss+0x70): multiple definition of `cc2'; /tmp/try-small-a7da37.o:(.bss+0xe0): first defined here
try.c: /usr/bin/ld: libcrypto_sign_mqqsig192.a(mqq-verify.o):(.bss+0x80): multiple definition of `mqq_sigma1'; /tmp/try-small-a7da37.o:(.bss+0xf0): first defined here
try.c: /usr/bin/ld: libcrypto_sign_mqqsig192.a(mqq-verify.o):(.bss+0x140): multiple definition of `mqq_sigmaK'; /tmp/try-small-a7da37.o:(.bss+0x1b0): first defined here
try.c: /usr/bin/ld: libcrypto_sign_mqqsig192.a(mqq-verify.o):(.bss+0x200): multiple definition of `lookup_table_private_key'; /tmp/try-small-a7da37.o:(.bss+0x270): first defined here
try.c: clang: error: linker command failed with exit code 1 (use -v to see invocation)

Number of similar (compiler,implementation) pairs: 1, namely:
CompilerImplementations
clang -march=native -O3 -fomit-frame-pointer -fwrapv -Qunused-arguments -fPIC -fPIE T:ref

Compiler output

Implementation: T:ref
Security model: timingleaks
Compiler: clang -march=native -O -fomit-frame-pointer -fwrapv -Qunused-arguments -fPIC -fPIE
try.c: /usr/bin/ld: libcrypto_sign_mqqsig192.a(keygen.o):(.bss+0x200): multiple definition of `lookup_table_private_key'; /tmp/try-small-3caff6.o:(.bss+0x270): first defined here
try.c: /usr/bin/ld: libcrypto_sign_mqqsig192.a(keygen.o):(.bss+0x0): multiple definition of `mqq_a'; /tmp/try-small-3caff6.o:(.bss+0x70): first defined here
try.c: /usr/bin/ld: libcrypto_sign_mqqsig192.a(keygen.o):(.bss+0x60): multiple definition of `cc1'; /tmp/try-small-3caff6.o:(.bss+0xd0): first defined here
try.c: /usr/bin/ld: libcrypto_sign_mqqsig192.a(keygen.o):(.bss+0x70): multiple definition of `cc2'; /tmp/try-small-3caff6.o:(.bss+0xe0): first defined here
try.c: /usr/bin/ld: libcrypto_sign_mqqsig192.a(keygen.o):(.bss+0x80): multiple definition of `mqq_sigma1'; /tmp/try-small-3caff6.o:(.bss+0xf0): first defined here
try.c: /usr/bin/ld: libcrypto_sign_mqqsig192.a(keygen.o):(.bss+0x140): multiple definition of `mqq_sigmaK'; /tmp/try-small-3caff6.o:(.bss+0x1b0): first defined here
try.c: /usr/bin/ld: libcrypto_sign_mqqsig192.a(mqq-sign.o):(.bss+0x0): multiple definition of `cc1'; /tmp/try-small-3caff6.o:(.bss+0xd0): first defined here
try.c: /usr/bin/ld: libcrypto_sign_mqqsig192.a(mqq-sign.o):(.bss+0x10): multiple definition of `cc2'; /tmp/try-small-3caff6.o:(.bss+0xe0): first defined here
try.c: /usr/bin/ld: libcrypto_sign_mqqsig192.a(mqq-sign.o):(.bss+0x20): multiple definition of `mqq_a'; /tmp/try-small-3caff6.o:(.bss+0x70): first defined here
try.c: /usr/bin/ld: libcrypto_sign_mqqsig192.a(mqq-sign.o):(.bss+0x80): multiple definition of `mqq_sigma1'; /tmp/try-small-3caff6.o:(.bss+0xf0): first defined here
try.c: /usr/bin/ld: libcrypto_sign_mqqsig192.a(mqq-sign.o):(.bss+0x140): multiple definition of `mqq_sigmaK'; /tmp/try-small-3caff6.o:(.bss+0x1b0): first defined here
try.c: /usr/bin/ld: libcrypto_sign_mqqsig192.a(mqq-sign.o):(.bss+0x200): multiple definition of `lookup_table_private_key'; /tmp/try-small-3caff6.o:(.bss+0x270): first defined here
try.c: /usr/bin/ld: libcrypto_sign_mqqsig192.a(mqq-verify.o):(.bss+0x0): multiple definition of `mqq_a'; /tmp/try-small-3caff6.o:(.bss+0x70): first defined here
try.c: /usr/bin/ld: libcrypto_sign_mqqsig192.a(mqq-verify.o):(.bss+0x60): multiple definition of `cc1'; /tmp/try-small-3caff6.o:(.bss+0xd0): first defined here
try.c: /usr/bin/ld: libcrypto_sign_mqqsig192.a(mqq-verify.o):(.bss+0x70): multiple definition of `cc2'; /tmp/try-small-3caff6.o:(.bss+0xe0): first defined here
try.c: /usr/bin/ld: libcrypto_sign_mqqsig192.a(mqq-verify.o):(.bss+0x80): multiple definition of `mqq_sigma1'; /tmp/try-small-3caff6.o:(.bss+0xf0): first defined here
try.c: /usr/bin/ld: libcrypto_sign_mqqsig192.a(mqq-verify.o):(.bss+0x140): multiple definition of `mqq_sigmaK'; /tmp/try-small-3caff6.o:(.bss+0x1b0): first defined here
try.c: /usr/bin/ld: libcrypto_sign_mqqsig192.a(mqq-verify.o):(.bss+0x200): multiple definition of `lookup_table_private_key'; /tmp/try-small-3caff6.o:(.bss+0x270): first defined here
try.c: clang: error: linker command failed with exit code 1 (use -v to see invocation)

Number of similar (compiler,implementation) pairs: 1, namely:
CompilerImplementations
clang -march=native -O -fomit-frame-pointer -fwrapv -Qunused-arguments -fPIC -fPIE T:ref

Compiler output

Implementation: T:ref
Security model: timingleaks
Compiler: clang -march=native -Os -fomit-frame-pointer -fwrapv -Qunused-arguments -fPIC -fPIE
try.c: /usr/bin/ld: libcrypto_sign_mqqsig192.a(keygen.o):(.bss+0x200): multiple definition of `lookup_table_private_key'; /tmp/try-small-044ac4.o:(.bss+0x270): first defined here
try.c: /usr/bin/ld: libcrypto_sign_mqqsig192.a(keygen.o):(.bss+0x0): multiple definition of `mqq_a'; /tmp/try-small-044ac4.o:(.bss+0x70): first defined here
try.c: /usr/bin/ld: libcrypto_sign_mqqsig192.a(keygen.o):(.bss+0x60): multiple definition of `cc1'; /tmp/try-small-044ac4.o:(.bss+0xd0): first defined here
try.c: /usr/bin/ld: libcrypto_sign_mqqsig192.a(keygen.o):(.bss+0x70): multiple definition of `cc2'; /tmp/try-small-044ac4.o:(.bss+0xe0): first defined here
try.c: /usr/bin/ld: libcrypto_sign_mqqsig192.a(keygen.o):(.bss+0x80): multiple definition of `mqq_sigma1'; /tmp/try-small-044ac4.o:(.bss+0xf0): first defined here
try.c: /usr/bin/ld: libcrypto_sign_mqqsig192.a(keygen.o):(.bss+0x140): multiple definition of `mqq_sigmaK'; /tmp/try-small-044ac4.o:(.bss+0x1b0): first defined here
try.c: /usr/bin/ld: libcrypto_sign_mqqsig192.a(mqq-sign.o):(.bss+0x0): multiple definition of `cc1'; /tmp/try-small-044ac4.o:(.bss+0xd0): first defined here
try.c: /usr/bin/ld: libcrypto_sign_mqqsig192.a(mqq-sign.o):(.bss+0x10): multiple definition of `cc2'; /tmp/try-small-044ac4.o:(.bss+0xe0): first defined here
try.c: /usr/bin/ld: libcrypto_sign_mqqsig192.a(mqq-sign.o):(.bss+0x20): multiple definition of `mqq_a'; /tmp/try-small-044ac4.o:(.bss+0x70): first defined here
try.c: /usr/bin/ld: libcrypto_sign_mqqsig192.a(mqq-sign.o):(.bss+0x80): multiple definition of `mqq_sigma1'; /tmp/try-small-044ac4.o:(.bss+0xf0): first defined here
try.c: /usr/bin/ld: libcrypto_sign_mqqsig192.a(mqq-sign.o):(.bss+0x140): multiple definition of `mqq_sigmaK'; /tmp/try-small-044ac4.o:(.bss+0x1b0): first defined here
try.c: /usr/bin/ld: libcrypto_sign_mqqsig192.a(mqq-sign.o):(.bss+0x200): multiple definition of `lookup_table_private_key'; /tmp/try-small-044ac4.o:(.bss+0x270): first defined here
try.c: /usr/bin/ld: libcrypto_sign_mqqsig192.a(mqq-verify.o):(.bss+0x0): multiple definition of `mqq_a'; /tmp/try-small-044ac4.o:(.bss+0x70): first defined here
try.c: /usr/bin/ld: libcrypto_sign_mqqsig192.a(mqq-verify.o):(.bss+0x60): multiple definition of `cc1'; /tmp/try-small-044ac4.o:(.bss+0xd0): first defined here
try.c: /usr/bin/ld: libcrypto_sign_mqqsig192.a(mqq-verify.o):(.bss+0x70): multiple definition of `cc2'; /tmp/try-small-044ac4.o:(.bss+0xe0): first defined here
try.c: /usr/bin/ld: libcrypto_sign_mqqsig192.a(mqq-verify.o):(.bss+0x80): multiple definition of `mqq_sigma1'; /tmp/try-small-044ac4.o:(.bss+0xf0): first defined here
try.c: /usr/bin/ld: libcrypto_sign_mqqsig192.a(mqq-verify.o):(.bss+0x140): multiple definition of `mqq_sigmaK'; /tmp/try-small-044ac4.o:(.bss+0x1b0): first defined here
try.c: /usr/bin/ld: libcrypto_sign_mqqsig192.a(mqq-verify.o):(.bss+0x200): multiple definition of `lookup_table_private_key'; /tmp/try-small-044ac4.o:(.bss+0x270): first defined here
try.c: clang: error: linker command failed with exit code 1 (use -v to see invocation)

Number of similar (compiler,implementation) pairs: 1, namely:
CompilerImplementations
clang -march=native -Os -fomit-frame-pointer -fwrapv -Qunused-arguments -fPIC -fPIE T:ref

Compiler output

Implementation: T:ref
Security model: timingleaks
Compiler: clang -mcpu=native -O3 -fomit-frame-pointer -fwrapv -Qunused-arguments -fPIC -fPIE
try.c: /usr/bin/ld: libcrypto_sign_mqqsig192.a(keygen.o):(.bss+0x200): multiple definition of `lookup_table_private_key'; /tmp/try-small-bf68f1.o:(.bss+0x270): first defined here
try.c: /usr/bin/ld: libcrypto_sign_mqqsig192.a(keygen.o):(.bss+0x0): multiple definition of `mqq_a'; /tmp/try-small-bf68f1.o:(.bss+0x70): first defined here
try.c: /usr/bin/ld: libcrypto_sign_mqqsig192.a(keygen.o):(.bss+0x60): multiple definition of `cc1'; /tmp/try-small-bf68f1.o:(.bss+0xd0): first defined here
try.c: /usr/bin/ld: libcrypto_sign_mqqsig192.a(keygen.o):(.bss+0x70): multiple definition of `cc2'; /tmp/try-small-bf68f1.o:(.bss+0xe0): first defined here
try.c: /usr/bin/ld: libcrypto_sign_mqqsig192.a(keygen.o):(.bss+0x80): multiple definition of `mqq_sigma1'; /tmp/try-small-bf68f1.o:(.bss+0xf0): first defined here
try.c: /usr/bin/ld: libcrypto_sign_mqqsig192.a(keygen.o):(.bss+0x140): multiple definition of `mqq_sigmaK'; /tmp/try-small-bf68f1.o:(.bss+0x1b0): first defined here
try.c: /usr/bin/ld: libcrypto_sign_mqqsig192.a(mqq-sign.o):(.bss+0x0): multiple definition of `cc1'; /tmp/try-small-bf68f1.o:(.bss+0xd0): first defined here
try.c: /usr/bin/ld: libcrypto_sign_mqqsig192.a(mqq-sign.o):(.bss+0x10): multiple definition of `cc2'; /tmp/try-small-bf68f1.o:(.bss+0xe0): first defined here
try.c: /usr/bin/ld: libcrypto_sign_mqqsig192.a(mqq-sign.o):(.bss+0x20): multiple definition of `mqq_a'; /tmp/try-small-bf68f1.o:(.bss+0x70): first defined here
try.c: /usr/bin/ld: libcrypto_sign_mqqsig192.a(mqq-sign.o):(.bss+0x80): multiple definition of `mqq_sigma1'; /tmp/try-small-bf68f1.o:(.bss+0xf0): first defined here
try.c: /usr/bin/ld: libcrypto_sign_mqqsig192.a(mqq-sign.o):(.bss+0x140): multiple definition of `mqq_sigmaK'; /tmp/try-small-bf68f1.o:(.bss+0x1b0): first defined here
try.c: /usr/bin/ld: libcrypto_sign_mqqsig192.a(mqq-sign.o):(.bss+0x200): multiple definition of `lookup_table_private_key'; /tmp/try-small-bf68f1.o:(.bss+0x270): first defined here
try.c: /usr/bin/ld: libcrypto_sign_mqqsig192.a(mqq-verify.o):(.bss+0x0): multiple definition of `mqq_a'; /tmp/try-small-bf68f1.o:(.bss+0x70): first defined here
try.c: /usr/bin/ld: libcrypto_sign_mqqsig192.a(mqq-verify.o):(.bss+0x60): multiple definition of `cc1'; /tmp/try-small-bf68f1.o:(.bss+0xd0): first defined here
try.c: /usr/bin/ld: libcrypto_sign_mqqsig192.a(mqq-verify.o):(.bss+0x70): multiple definition of `cc2'; /tmp/try-small-bf68f1.o:(.bss+0xe0): first defined here
try.c: /usr/bin/ld: libcrypto_sign_mqqsig192.a(mqq-verify.o):(.bss+0x80): multiple definition of `mqq_sigma1'; /tmp/try-small-bf68f1.o:(.bss+0xf0): first defined here
try.c: /usr/bin/ld: libcrypto_sign_mqqsig192.a(mqq-verify.o):(.bss+0x140): multiple definition of `mqq_sigmaK'; /tmp/try-small-bf68f1.o:(.bss+0x1b0): first defined here
try.c: /usr/bin/ld: libcrypto_sign_mqqsig192.a(mqq-verify.o):(.bss+0x200): multiple definition of `lookup_table_private_key'; /tmp/try-small-bf68f1.o:(.bss+0x270): first defined here
try.c: clang: error: linker command failed with exit code 1 (use -v to see invocation)

Number of similar (compiler,implementation) pairs: 1, namely:
CompilerImplementations
clang -mcpu=native -O3 -fomit-frame-pointer -fwrapv -Qunused-arguments -fPIC -fPIE T:ref

Compiler output

Implementation: T:ref
Security model: timingleaks
Compiler: gcc -march=native -mtune=native -O2 -fomit-frame-pointer -fwrapv -fPIC -fPIE
try.c: /usr/bin/ld: libcrypto_sign_mqqsig192.a(keygen.o):(.bss+0x0): multiple definition of `lookup_table_private_key'; /tmp/ccURWdNT.o:(.bss+0x20): first defined here
try.c: /usr/bin/ld: libcrypto_sign_mqqsig192.a(keygen.o):(.bss+0x20000): multiple definition of `mqq_sigmaK'; /tmp/ccURWdNT.o:(.bss+0x20020): first defined here
try.c: /usr/bin/ld: libcrypto_sign_mqqsig192.a(keygen.o):(.bss+0x200c0): multiple definition of `mqq_sigma1'; /tmp/ccURWdNT.o:(.bss+0x200e0): first defined here
try.c: /usr/bin/ld: libcrypto_sign_mqqsig192.a(keygen.o):(.bss+0x20180): multiple definition of `cc2'; /tmp/ccURWdNT.o:(.bss+0x201a0): first defined here
try.c: /usr/bin/ld: libcrypto_sign_mqqsig192.a(keygen.o):(.bss+0x20190): multiple definition of `cc1'; /tmp/ccURWdNT.o:(.bss+0x201b0): first defined here
try.c: /usr/bin/ld: libcrypto_sign_mqqsig192.a(keygen.o):(.bss+0x201a0): multiple definition of `mqq_a'; /tmp/ccURWdNT.o:(.bss+0x201c0): first defined here
try.c: /usr/bin/ld: libcrypto_sign_mqqsig192.a(mqq-sign.o):(.bss+0x20190): multiple definition of `cc1'; /tmp/ccURWdNT.o:(.bss+0x201b0): first defined here
try.c: /usr/bin/ld: libcrypto_sign_mqqsig192.a(mqq-sign.o):(.bss+0x201a0): multiple definition of `mqq_a'; /tmp/ccURWdNT.o:(.bss+0x201c0): first defined here
try.c: /usr/bin/ld: libcrypto_sign_mqqsig192.a(mqq-sign.o):(.bss+0x20180): multiple definition of `cc2'; /tmp/ccURWdNT.o:(.bss+0x201a0): first defined here
try.c: /usr/bin/ld: libcrypto_sign_mqqsig192.a(mqq-sign.o):(.bss+0x20000): multiple definition of `mqq_sigmaK'; /tmp/ccURWdNT.o:(.bss+0x20020): first defined here
try.c: /usr/bin/ld: libcrypto_sign_mqqsig192.a(mqq-sign.o):(.bss+0x200c0): multiple definition of `mqq_sigma1'; /tmp/ccURWdNT.o:(.bss+0x200e0): first defined here
try.c: /usr/bin/ld: libcrypto_sign_mqqsig192.a(mqq-sign.o):(.bss+0x0): multiple definition of `lookup_table_private_key'; /tmp/ccURWdNT.o:(.bss+0x20): first defined here
try.c: /usr/bin/ld: libcrypto_sign_mqqsig192.a(mqq-verify.o):(.bss+0x0): multiple definition of `lookup_table_private_key'; /tmp/ccURWdNT.o:(.bss+0x20): first defined here
try.c: /usr/bin/ld: libcrypto_sign_mqqsig192.a(mqq-verify.o):(.bss+0x20000): multiple definition of `mqq_sigmaK'; /tmp/ccURWdNT.o:(.bss+0x20020): first defined here
try.c: /usr/bin/ld: libcrypto_sign_mqqsig192.a(mqq-verify.o):(.bss+0x200c0): multiple definition of `mqq_sigma1'; /tmp/ccURWdNT.o:(.bss+0x200e0): first defined here
try.c: /usr/bin/ld: libcrypto_sign_mqqsig192.a(mqq-verify.o):(.bss+0x20180): multiple definition of `cc2'; /tmp/ccURWdNT.o:(.bss+0x201a0): first defined here
try.c: /usr/bin/ld: libcrypto_sign_mqqsig192.a(mqq-verify.o):(.bss+0x20190): multiple definition of `cc1'; /tmp/ccURWdNT.o:(.bss+0x201b0): first defined here
try.c: /usr/bin/ld: libcrypto_sign_mqqsig192.a(mqq-verify.o):(.bss+0x201a0): multiple definition of `mqq_a'; /tmp/ccURWdNT.o:(.bss+0x201c0): first defined here
try.c: collect2: error: ld returned 1 exit status

Number of similar (compiler,implementation) pairs: 1, namely:
CompilerImplementations
gcc -march=native -mtune=native -O2 -fomit-frame-pointer -fwrapv -fPIC -fPIE T:ref

Compiler output

Implementation: T:ref
Security model: timingleaks
Compiler: gcc -march=native -mtune=native -O3 -fomit-frame-pointer -fwrapv -fPIC -fPIE
try.c: /usr/bin/ld: libcrypto_sign_mqqsig192.a(keygen.o):(.bss+0x0): multiple definition of `lookup_table_private_key'; /tmp/ccufK7ba.o:(.bss+0x20): first defined here
try.c: /usr/bin/ld: libcrypto_sign_mqqsig192.a(keygen.o):(.bss+0x20000): multiple definition of `mqq_sigmaK'; /tmp/ccufK7ba.o:(.bss+0x20020): first defined here
try.c: /usr/bin/ld: libcrypto_sign_mqqsig192.a(keygen.o):(.bss+0x200c0): multiple definition of `mqq_sigma1'; /tmp/ccufK7ba.o:(.bss+0x200e0): first defined here
try.c: /usr/bin/ld: libcrypto_sign_mqqsig192.a(keygen.o):(.bss+0x20180): multiple definition of `cc2'; /tmp/ccufK7ba.o:(.bss+0x201a0): first defined here
try.c: /usr/bin/ld: libcrypto_sign_mqqsig192.a(keygen.o):(.bss+0x20190): multiple definition of `cc1'; /tmp/ccufK7ba.o:(.bss+0x201b0): first defined here
try.c: /usr/bin/ld: libcrypto_sign_mqqsig192.a(keygen.o):(.bss+0x201a0): multiple definition of `mqq_a'; /tmp/ccufK7ba.o:(.bss+0x201c0): first defined here
try.c: /usr/bin/ld: libcrypto_sign_mqqsig192.a(mqq-sign.o):(.bss+0x20000): multiple definition of `mqq_sigmaK'; /tmp/ccufK7ba.o:(.bss+0x20020): first defined here
try.c: /usr/bin/ld: libcrypto_sign_mqqsig192.a(mqq-sign.o):(.bss+0x200c0): multiple definition of `mqq_sigma1'; /tmp/ccufK7ba.o:(.bss+0x200e0): first defined here
try.c: /usr/bin/ld: libcrypto_sign_mqqsig192.a(mqq-sign.o):(.bss+0x20190): multiple definition of `cc1'; /tmp/ccufK7ba.o:(.bss+0x201b0): first defined here
try.c: /usr/bin/ld: libcrypto_sign_mqqsig192.a(mqq-sign.o):(.bss+0x20180): multiple definition of `cc2'; /tmp/ccufK7ba.o:(.bss+0x201a0): first defined here
try.c: /usr/bin/ld: libcrypto_sign_mqqsig192.a(mqq-sign.o):(.bss+0x201a0): multiple definition of `mqq_a'; /tmp/ccufK7ba.o:(.bss+0x201c0): first defined here
try.c: /usr/bin/ld: libcrypto_sign_mqqsig192.a(mqq-sign.o):(.bss+0x0): multiple definition of `lookup_table_private_key'; /tmp/ccufK7ba.o:(.bss+0x20): first defined here
try.c: /usr/bin/ld: libcrypto_sign_mqqsig192.a(mqq-verify.o):(.bss+0x0): multiple definition of `lookup_table_private_key'; /tmp/ccufK7ba.o:(.bss+0x20): first defined here
try.c: /usr/bin/ld: libcrypto_sign_mqqsig192.a(mqq-verify.o):(.bss+0x20000): multiple definition of `mqq_sigmaK'; /tmp/ccufK7ba.o:(.bss+0x20020): first defined here
try.c: /usr/bin/ld: libcrypto_sign_mqqsig192.a(mqq-verify.o):(.bss+0x200c0): multiple definition of `mqq_sigma1'; /tmp/ccufK7ba.o:(.bss+0x200e0): first defined here
try.c: /usr/bin/ld: libcrypto_sign_mqqsig192.a(mqq-verify.o):(.bss+0x20180): multiple definition of `cc2'; /tmp/ccufK7ba.o:(.bss+0x201a0): first defined here
try.c: /usr/bin/ld: libcrypto_sign_mqqsig192.a(mqq-verify.o):(.bss+0x20190): multiple definition of `cc1'; /tmp/ccufK7ba.o:(.bss+0x201b0): first defined here
try.c: /usr/bin/ld: libcrypto_sign_mqqsig192.a(mqq-verify.o):(.bss+0x201a0): multiple definition of `mqq_a'; /tmp/ccufK7ba.o:(.bss+0x201c0): first defined here
try.c: collect2: error: ld returned 1 exit status

Number of similar (compiler,implementation) pairs: 1, namely:
CompilerImplementations
gcc -march=native -mtune=native -O3 -fomit-frame-pointer -fwrapv -fPIC -fPIE T:ref

Compiler output

Implementation: T:ref
Security model: timingleaks
Compiler: gcc -march=native -mtune=native -O -fomit-frame-pointer -fwrapv -fPIC -fPIE
try.c: /usr/bin/ld: libcrypto_sign_mqqsig192.a(keygen.o):(.bss+0x0): multiple definition of `lookup_table_private_key'; /tmp/ccH5vHkC.o:(.bss+0x20): first defined here
try.c: /usr/bin/ld: libcrypto_sign_mqqsig192.a(keygen.o):(.bss+0x20000): multiple definition of `mqq_sigmaK'; /tmp/ccH5vHkC.o:(.bss+0x20020): first defined here
try.c: /usr/bin/ld: libcrypto_sign_mqqsig192.a(keygen.o):(.bss+0x200c0): multiple definition of `mqq_sigma1'; /tmp/ccH5vHkC.o:(.bss+0x200e0): first defined here
try.c: /usr/bin/ld: libcrypto_sign_mqqsig192.a(keygen.o):(.bss+0x20180): multiple definition of `cc2'; /tmp/ccH5vHkC.o:(.bss+0x201a0): first defined here
try.c: /usr/bin/ld: libcrypto_sign_mqqsig192.a(keygen.o):(.bss+0x20190): multiple definition of `cc1'; /tmp/ccH5vHkC.o:(.bss+0x201b0): first defined here
try.c: /usr/bin/ld: libcrypto_sign_mqqsig192.a(keygen.o):(.bss+0x201a0): multiple definition of `mqq_a'; /tmp/ccH5vHkC.o:(.bss+0x201c0): first defined here
try.c: /usr/bin/ld: libcrypto_sign_mqqsig192.a(mqq-sign.o):(.bss+0x20000): multiple definition of `mqq_sigmaK'; /tmp/ccH5vHkC.o:(.bss+0x20020): first defined here
try.c: /usr/bin/ld: libcrypto_sign_mqqsig192.a(mqq-sign.o):(.bss+0x200c0): multiple definition of `mqq_sigma1'; /tmp/ccH5vHkC.o:(.bss+0x200e0): first defined here
try.c: /usr/bin/ld: libcrypto_sign_mqqsig192.a(mqq-sign.o):(.bss+0x20190): multiple definition of `cc1'; /tmp/ccH5vHkC.o:(.bss+0x201b0): first defined here
try.c: /usr/bin/ld: libcrypto_sign_mqqsig192.a(mqq-sign.o):(.bss+0x201a0): multiple definition of `mqq_a'; /tmp/ccH5vHkC.o:(.bss+0x201c0): first defined here
try.c: /usr/bin/ld: libcrypto_sign_mqqsig192.a(mqq-sign.o):(.bss+0x20180): multiple definition of `cc2'; /tmp/ccH5vHkC.o:(.bss+0x201a0): first defined here
try.c: /usr/bin/ld: libcrypto_sign_mqqsig192.a(mqq-sign.o):(.bss+0x0): multiple definition of `lookup_table_private_key'; /tmp/ccH5vHkC.o:(.bss+0x20): first defined here
try.c: /usr/bin/ld: libcrypto_sign_mqqsig192.a(mqq-verify.o):(.bss+0x0): multiple definition of `lookup_table_private_key'; /tmp/ccH5vHkC.o:(.bss+0x20): first defined here
try.c: /usr/bin/ld: libcrypto_sign_mqqsig192.a(mqq-verify.o):(.bss+0x20000): multiple definition of `mqq_sigmaK'; /tmp/ccH5vHkC.o:(.bss+0x20020): first defined here
try.c: /usr/bin/ld: libcrypto_sign_mqqsig192.a(mqq-verify.o):(.bss+0x200c0): multiple definition of `mqq_sigma1'; /tmp/ccH5vHkC.o:(.bss+0x200e0): first defined here
try.c: /usr/bin/ld: libcrypto_sign_mqqsig192.a(mqq-verify.o):(.bss+0x20180): multiple definition of `cc2'; /tmp/ccH5vHkC.o:(.bss+0x201a0): first defined here
try.c: /usr/bin/ld: libcrypto_sign_mqqsig192.a(mqq-verify.o):(.bss+0x20190): multiple definition of `cc1'; /tmp/ccH5vHkC.o:(.bss+0x201b0): first defined here
try.c: /usr/bin/ld: libcrypto_sign_mqqsig192.a(mqq-verify.o):(.bss+0x201a0): multiple definition of `mqq_a'; /tmp/ccH5vHkC.o:(.bss+0x201c0): first defined here
try.c: collect2: error: ld returned 1 exit status

Number of similar (compiler,implementation) pairs: 1, namely:
CompilerImplementations
gcc -march=native -mtune=native -O -fomit-frame-pointer -fwrapv -fPIC -fPIE T:ref

Compiler output

Implementation: T:ref
Security model: timingleaks
Compiler: gcc -march=native -mtune=native -Os -fomit-frame-pointer -fwrapv -fPIC -fPIE
try.c: /usr/bin/ld: libcrypto_sign_mqqsig192.a(keygen.o):(.bss+0x0): multiple definition of `lookup_table_private_key'; /tmp/ccy2EMD5.o:(.bss+0x20): first defined here
try.c: /usr/bin/ld: libcrypto_sign_mqqsig192.a(keygen.o):(.bss+0x20000): multiple definition of `mqq_sigmaK'; /tmp/ccy2EMD5.o:(.bss+0x20020): first defined here
try.c: /usr/bin/ld: libcrypto_sign_mqqsig192.a(keygen.o):(.bss+0x200c0): multiple definition of `mqq_sigma1'; /tmp/ccy2EMD5.o:(.bss+0x200e0): first defined here
try.c: /usr/bin/ld: libcrypto_sign_mqqsig192.a(keygen.o):(.bss+0x20180): multiple definition of `cc2'; /tmp/ccy2EMD5.o:(.bss+0x201a0): first defined here
try.c: /usr/bin/ld: libcrypto_sign_mqqsig192.a(keygen.o):(.bss+0x20190): multiple definition of `cc1'; /tmp/ccy2EMD5.o:(.bss+0x201b0): first defined here
try.c: /usr/bin/ld: libcrypto_sign_mqqsig192.a(keygen.o):(.bss+0x201a0): multiple definition of `mqq_a'; /tmp/ccy2EMD5.o:(.bss+0x201c0): first defined here
try.c: /usr/bin/ld: libcrypto_sign_mqqsig192.a(mqq-sign.o):(.bss+0x20000): multiple definition of `mqq_sigmaK'; /tmp/ccy2EMD5.o:(.bss+0x20020): first defined here
try.c: /usr/bin/ld: libcrypto_sign_mqqsig192.a(mqq-sign.o):(.bss+0x200c0): multiple definition of `mqq_sigma1'; /tmp/ccy2EMD5.o:(.bss+0x200e0): first defined here
try.c: /usr/bin/ld: libcrypto_sign_mqqsig192.a(mqq-sign.o):(.bss+0x20190): multiple definition of `cc1'; /tmp/ccy2EMD5.o:(.bss+0x201b0): first defined here
try.c: /usr/bin/ld: libcrypto_sign_mqqsig192.a(mqq-sign.o):(.bss+0x201a0): multiple definition of `mqq_a'; /tmp/ccy2EMD5.o:(.bss+0x201c0): first defined here
try.c: /usr/bin/ld: libcrypto_sign_mqqsig192.a(mqq-sign.o):(.bss+0x20180): multiple definition of `cc2'; /tmp/ccy2EMD5.o:(.bss+0x201a0): first defined here
try.c: /usr/bin/ld: libcrypto_sign_mqqsig192.a(mqq-sign.o):(.bss+0x0): multiple definition of `lookup_table_private_key'; /tmp/ccy2EMD5.o:(.bss+0x20): first defined here
try.c: /usr/bin/ld: libcrypto_sign_mqqsig192.a(mqq-verify.o):(.bss+0x0): multiple definition of `lookup_table_private_key'; /tmp/ccy2EMD5.o:(.bss+0x20): first defined here
try.c: /usr/bin/ld: libcrypto_sign_mqqsig192.a(mqq-verify.o):(.bss+0x20000): multiple definition of `mqq_sigmaK'; /tmp/ccy2EMD5.o:(.bss+0x20020): first defined here
try.c: /usr/bin/ld: libcrypto_sign_mqqsig192.a(mqq-verify.o):(.bss+0x200c0): multiple definition of `mqq_sigma1'; /tmp/ccy2EMD5.o:(.bss+0x200e0): first defined here
try.c: /usr/bin/ld: libcrypto_sign_mqqsig192.a(mqq-verify.o):(.bss+0x20180): multiple definition of `cc2'; /tmp/ccy2EMD5.o:(.bss+0x201a0): first defined here
try.c: /usr/bin/ld: libcrypto_sign_mqqsig192.a(mqq-verify.o):(.bss+0x20190): multiple definition of `cc1'; /tmp/ccy2EMD5.o:(.bss+0x201b0): first defined here
try.c: /usr/bin/ld: libcrypto_sign_mqqsig192.a(mqq-verify.o):(.bss+0x201a0): multiple definition of `mqq_a'; /tmp/ccy2EMD5.o:(.bss+0x201c0): first defined here
try.c: collect2: error: ld returned 1 exit status

Number of similar (compiler,implementation) pairs: 1, namely:
CompilerImplementations
gcc -march=native -mtune=native -Os -fomit-frame-pointer -fwrapv -fPIC -fPIE T:ref