Implementation notes: amd64, titan0, crypto_aead/omdsha256k256n248tau256v1

Computer: titan0
Microarchitecture: amd64; Haswell+AES (306c3)
Architecture: amd64
CPU ID: GenuineIntel-000306c3-bfebfbff
SUPERCOP version: 20240625
Operation: crypto_aead
Primitive: omdsha256k256n248tau256v1
TimeObject sizeTest sizeImplementationCompilerBenchmark dateSUPERCOP version
16484214914 0 038820 812 1088T:refgcc_-march=native_-mtune=native_-O3_-fwrapv_-fPIC_-fPIE_-gdwarf-4_-Wall2024062720240625
17717711735 0 035416 860 1056T:refclang_-march=native_-O2_-fwrapv_-Qunused-arguments_-fPIC_-fPIE_-gdwarf-4_-Wall2024062720240625
18075610535 0 034424 860 1056T:refclang_-march=native_-O3_-fwrapv_-Qunused-arguments_-fPIC_-fPIE_-gdwarf-4_-Wall2024062720240625
1944244548 0 025282 852 1088T:refclang_-march=native_-Os_-fwrapv_-Qunused-arguments_-fPIC_-fPIE_-gdwarf-4_-Wall2024062720240625
2037706541 0 028412 812 1088T:refgcc_-march=native_-mtune=native_-O2_-fwrapv_-fPIC_-fPIE_-gdwarf-4_-Wall2024062720240625
2067385649 0 025568 860 1024T:refclang_-march=native_-O_-fwrapv_-Qunused-arguments_-fPIC_-fPIE_-gdwarf-4_-Wall2024062720240625
2084616070 0 027355 804 1088T:refgcc_-march=native_-mtune=native_-O_-fwrapv_-fPIC_-fPIE_-gdwarf-4_-Wall2024062720240625
21225811906 0 034224 860 1024T:refclang_-mcpu=native_-O3_-fwrapv_-Qunused-arguments_-fPIC_-fPIE_-gdwarf-4_-Wall2024062720240625
2173144607 0 024159 788 1056T:refgcc_-march=native_-mtune=native_-Os_-fwrapv_-fPIC_-fPIE_-gdwarf-4_-Wall2024062720240625

Compiler output


try.c: /usr/bin/ld: libcrypto_aead_omdsha256k256n248tau256v1.a(omdsha256.o):.../supercop-data/titan0/amd64/try/c/clang_-march=native_-O2_-fwrapv_-Qunused-arguments_-fPIC_-fPIE_-gdwarf-4_-Wall/timingleaks/crypto_aead/omdsha256k256n248tau256v1/avx1/work/./omdsha256.h:137: multiple definition of `Hash'; libcrypto_aead_omdsha256k256n248tau256v1.a(encrypt.o):.../supercop-data/titan0/amd64/try/c/clang_-march=native_-O2_-fwrapv_-Qunused-arguments_-fPIC_-fPIE_-gdwarf-4_-Wall/timingleaks/crypto_aead/omdsha256k256n248tau256v1/avx1/work/./omdsha256.h:137: first defined here
try.c: clang: error: linker command failed with exit code 1 (use -v to see invocation)

Number of similar (implementation,compiler) pairs: 1, namely:
ImplementationCompiler
T:avx1clang -march=native -O2 -fwrapv -Qunused-arguments -fPIC -fPIE -gdwarf-4 -Wall (Ubuntu_Clang_14.0.0)

Compiler output


try.c: /usr/bin/ld: libcrypto_aead_omdsha256k256n248tau256v1.a(omdsha256.o):.../supercop-data/titan0/amd64/try/c/clang_-march=native_-O3_-fwrapv_-Qunused-arguments_-fPIC_-fPIE_-gdwarf-4_-Wall/timingleaks/crypto_aead/omdsha256k256n248tau256v1/avx1/work/./omdsha256.h:137: multiple definition of `Hash'; libcrypto_aead_omdsha256k256n248tau256v1.a(encrypt.o):.../supercop-data/titan0/amd64/try/c/clang_-march=native_-O3_-fwrapv_-Qunused-arguments_-fPIC_-fPIE_-gdwarf-4_-Wall/timingleaks/crypto_aead/omdsha256k256n248tau256v1/avx1/work/./omdsha256.h:137: first defined here
try.c: clang: error: linker command failed with exit code 1 (use -v to see invocation)

Number of similar (implementation,compiler) pairs: 1, namely:
ImplementationCompiler
T:avx1clang -march=native -O3 -fwrapv -Qunused-arguments -fPIC -fPIE -gdwarf-4 -Wall (Ubuntu_Clang_14.0.0)

Compiler output


try.c: /usr/bin/ld: libcrypto_aead_omdsha256k256n248tau256v1.a(omdsha256.o):.../supercop-data/titan0/amd64/try/c/clang_-march=native_-O_-fwrapv_-Qunused-arguments_-fPIC_-fPIE_-gdwarf-4_-Wall/timingleaks/crypto_aead/omdsha256k256n248tau256v1/avx1/work/./omdsha256.h:137: multiple definition of `Hash'; libcrypto_aead_omdsha256k256n248tau256v1.a(encrypt.o):.../supercop-data/titan0/amd64/try/c/clang_-march=native_-O_-fwrapv_-Qunused-arguments_-fPIC_-fPIE_-gdwarf-4_-Wall/timingleaks/crypto_aead/omdsha256k256n248tau256v1/avx1/work/./omdsha256.h:137: first defined here
try.c: clang: error: linker command failed with exit code 1 (use -v to see invocation)

Number of similar (implementation,compiler) pairs: 1, namely:
ImplementationCompiler
T:avx1clang -march=native -O -fwrapv -Qunused-arguments -fPIC -fPIE -gdwarf-4 -Wall (Ubuntu_Clang_14.0.0)

Compiler output


try.c: /usr/bin/ld: libcrypto_aead_omdsha256k256n248tau256v1.a(omdsha256.o):.../supercop-data/titan0/amd64/try/c/clang_-march=native_-Os_-fwrapv_-Qunused-arguments_-fPIC_-fPIE_-gdwarf-4_-Wall/timingleaks/crypto_aead/omdsha256k256n248tau256v1/avx1/work/./omdsha256.h:137: multiple definition of `Hash'; libcrypto_aead_omdsha256k256n248tau256v1.a(encrypt.o):.../supercop-data/titan0/amd64/try/c/clang_-march=native_-Os_-fwrapv_-Qunused-arguments_-fPIC_-fPIE_-gdwarf-4_-Wall/timingleaks/crypto_aead/omdsha256k256n248tau256v1/avx1/work/./omdsha256.h:137: first defined here
try.c: clang: error: linker command failed with exit code 1 (use -v to see invocation)

Number of similar (implementation,compiler) pairs: 1, namely:
ImplementationCompiler
T:avx1clang -march=native -Os -fwrapv -Qunused-arguments -fPIC -fPIE -gdwarf-4 -Wall (Ubuntu_Clang_14.0.0)

Compiler output


try.c: /usr/bin/ld: libcrypto_aead_omdsha256k256n248tau256v1.a(omdsha256.o):.../supercop-data/titan0/amd64/try/c/clang_-mcpu=native_-O3_-fwrapv_-Qunused-arguments_-fPIC_-fPIE_-gdwarf-4_-Wall/timingleaks/crypto_aead/omdsha256k256n248tau256v1/avx1/work/./omdsha256.h:137: multiple definition of `Hash'; libcrypto_aead_omdsha256k256n248tau256v1.a(encrypt.o):.../supercop-data/titan0/amd64/try/c/clang_-mcpu=native_-O3_-fwrapv_-Qunused-arguments_-fPIC_-fPIE_-gdwarf-4_-Wall/timingleaks/crypto_aead/omdsha256k256n248tau256v1/avx1/work/./omdsha256.h:137: first defined here
try.c: clang: error: linker command failed with exit code 1 (use -v to see invocation)

Number of similar (implementation,compiler) pairs: 1, namely:
ImplementationCompiler
T:avx1clang -mcpu=native -O3 -fwrapv -Qunused-arguments -fPIC -fPIE -gdwarf-4 -Wall (Ubuntu_Clang_14.0.0)

Compiler output


encrypt.c: /tmp/ccQn3ukv.s: Assembler messages:
encrypt.c: /tmp/ccQn3ukv.s:922: Warning: dwarf line number information for .data ignored
encrypt.c: /tmp/ccQn3ukv.s:924: Warning: dwarf line number information for .data ignored
encrypt.c: /tmp/ccQn3ukv.s:926: Warning: dwarf line number information for .data ignored
encrypt.c: /tmp/ccQn3ukv.s:927: Warning: dwarf line number information for .data ignored
encrypt.c: /tmp/ccQn3ukv.s:928: Warning: dwarf line number information for .data ignored
encrypt.c: /tmp/ccQn3ukv.s:939: Warning: dwarf line number information for .data ignored
encrypt.c: /tmp/ccQn3ukv.s:946: Warning: dwarf line number information for .data ignored
encrypt.c: /tmp/ccQn3ukv.s:949: Warning: dwarf line number information for .data ignored
encrypt.c: /tmp/ccQn3ukv.s:950: Warning: dwarf line number information for .data ignored
encrypt.c: /tmp/ccQn3ukv.s:957: Warning: dwarf line number information for .data ignored
encrypt.c: /tmp/ccQn3ukv.s:958: Warning: dwarf line number information for .data ignored
encrypt.c: /tmp/ccQn3ukv.s:961: Warning: dwarf line number information for .data ignored
encrypt.c: /tmp/ccQn3ukv.s:963: Warning: dwarf line number information for .data ignored
encrypt.c: /tmp/ccQn3ukv.s:966: Warning: dwarf line number information for .data ignored
encrypt.c: /tmp/ccQn3ukv.s:974: Warning: dwarf line number information for .data ignored
encrypt.c: /tmp/ccQn3ukv.s:985: Warning: dwarf line number information for .data ignored
encrypt.c: /tmp/ccQn3ukv.s:987: Warning: dwarf line number information for .data ignored
encrypt.c: /tmp/ccQn3ukv.s:989: Warning: dwarf line number information for .data ignored
encrypt.c: /tmp/ccQn3ukv.s:990: Warning: dwarf line number information for .data ignored
encrypt.c: /tmp/ccQn3ukv.s:991: Warning: dwarf line number information for .data ignored
encrypt.c: /tmp/ccQn3ukv.s:998: Warning: dwarf line number information for .data ignored
encrypt.c: /tmp/ccQn3ukv.s:1005: Warning: dwarf line number information for .data ignored
encrypt.c: /tmp/ccQn3ukv.s:1008: Warning: dwarf line number information for .data ignored
encrypt.c: /tmp/ccQn3ukv.s:1011: Warning: dwarf line number information for .data ignored
encrypt.c: ...

Number of similar (implementation,compiler) pairs: 1, namely:
ImplementationCompiler
T:avx1gcc -march=native -mtune=native -O2 -fwrapv -fPIC -fPIE -gdwarf-4 -Wall (11.4.0)

Compiler output


encrypt.c: /tmp/ccn0wMlL.s: Assembler messages:
encrypt.c: /tmp/ccn0wMlL.s:922: Warning: dwarf line number information for .data ignored
encrypt.c: /tmp/ccn0wMlL.s:924: Warning: dwarf line number information for .data ignored
encrypt.c: /tmp/ccn0wMlL.s:926: Warning: dwarf line number information for .data ignored
encrypt.c: /tmp/ccn0wMlL.s:927: Warning: dwarf line number information for .data ignored
encrypt.c: /tmp/ccn0wMlL.s:928: Warning: dwarf line number information for .data ignored
encrypt.c: /tmp/ccn0wMlL.s:939: Warning: dwarf line number information for .data ignored
encrypt.c: /tmp/ccn0wMlL.s:946: Warning: dwarf line number information for .data ignored
encrypt.c: /tmp/ccn0wMlL.s:949: Warning: dwarf line number information for .data ignored
encrypt.c: /tmp/ccn0wMlL.s:950: Warning: dwarf line number information for .data ignored
encrypt.c: /tmp/ccn0wMlL.s:957: Warning: dwarf line number information for .data ignored
encrypt.c: /tmp/ccn0wMlL.s:958: Warning: dwarf line number information for .data ignored
encrypt.c: /tmp/ccn0wMlL.s:961: Warning: dwarf line number information for .data ignored
encrypt.c: /tmp/ccn0wMlL.s:963: Warning: dwarf line number information for .data ignored
encrypt.c: /tmp/ccn0wMlL.s:966: Warning: dwarf line number information for .data ignored
encrypt.c: /tmp/ccn0wMlL.s:974: Warning: dwarf line number information for .data ignored
encrypt.c: /tmp/ccn0wMlL.s:985: Warning: dwarf line number information for .data ignored
encrypt.c: /tmp/ccn0wMlL.s:987: Warning: dwarf line number information for .data ignored
encrypt.c: /tmp/ccn0wMlL.s:989: Warning: dwarf line number information for .data ignored
encrypt.c: /tmp/ccn0wMlL.s:990: Warning: dwarf line number information for .data ignored
encrypt.c: /tmp/ccn0wMlL.s:991: Warning: dwarf line number information for .data ignored
encrypt.c: /tmp/ccn0wMlL.s:998: Warning: dwarf line number information for .data ignored
encrypt.c: /tmp/ccn0wMlL.s:1005: Warning: dwarf line number information for .data ignored
encrypt.c: /tmp/ccn0wMlL.s:1008: Warning: dwarf line number information for .data ignored
encrypt.c: /tmp/ccn0wMlL.s:1011: Warning: dwarf line number information for .data ignored
encrypt.c: ...

Number of similar (implementation,compiler) pairs: 1, namely:
ImplementationCompiler
T:avx1gcc -march=native -mtune=native -O3 -fwrapv -fPIC -fPIE -gdwarf-4 -Wall (11.4.0)

Compiler output


encrypt.c: /tmp/ccbghVv0.s: Assembler messages:
encrypt.c: /tmp/ccbghVv0.s:921: Warning: dwarf line number information for .data ignored
encrypt.c: /tmp/ccbghVv0.s:923: Warning: dwarf line number information for .data ignored
encrypt.c: /tmp/ccbghVv0.s:935: Warning: dwarf line number information for .data ignored
encrypt.c: /tmp/ccbghVv0.s:936: Warning: dwarf line number information for .data ignored
encrypt.c: /tmp/ccbghVv0.s:937: Warning: dwarf line number information for .data ignored
encrypt.c: /tmp/ccbghVv0.s:944: Warning: dwarf line number information for .data ignored
encrypt.c: /tmp/ccbghVv0.s:947: Warning: dwarf line number information for .data ignored
encrypt.c: /tmp/ccbghVv0.s:948: Warning: dwarf line number information for .data ignored
encrypt.c: /tmp/ccbghVv0.s:953: Warning: dwarf line number information for .data ignored
encrypt.c: /tmp/ccbghVv0.s:954: Warning: dwarf line number information for .data ignored
encrypt.c: /tmp/ccbghVv0.s:957: Warning: dwarf line number information for .data ignored
encrypt.c: /tmp/ccbghVv0.s:959: Warning: dwarf line number information for .data ignored
encrypt.c: /tmp/ccbghVv0.s:962: Warning: dwarf line number information for .data ignored
encrypt.c: /tmp/ccbghVv0.s:970: Warning: dwarf line number information for .data ignored
encrypt.c: /tmp/ccbghVv0.s:980: Warning: dwarf line number information for .data ignored
encrypt.c: /tmp/ccbghVv0.s:982: Warning: dwarf line number information for .data ignored
encrypt.c: /tmp/ccbghVv0.s:995: Warning: dwarf line number information for .data ignored
encrypt.c: /tmp/ccbghVv0.s:999: Warning: dwarf line number information for .data ignored
encrypt.c: /tmp/ccbghVv0.s:1000: Warning: dwarf line number information for .data ignored
encrypt.c: /tmp/ccbghVv0.s:1001: Warning: dwarf line number information for .data ignored
encrypt.c: /tmp/ccbghVv0.s:1008: Warning: dwarf line number information for .data ignored
encrypt.c: /tmp/ccbghVv0.s:1011: Warning: dwarf line number information for .data ignored
encrypt.c: /tmp/ccbghVv0.s:1014: Warning: dwarf line number information for .data ignored
encrypt.c: /tmp/ccbghVv0.s:1017: Warning: dwarf line number information for .data ignored
encrypt.c: ...

Number of similar (implementation,compiler) pairs: 1, namely:
ImplementationCompiler
T:avx1gcc -march=native -mtune=native -O -fwrapv -fPIC -fPIE -gdwarf-4 -Wall (11.4.0)

Compiler output


encrypt.c: /tmp/ccvuAJeq.s: Assembler messages:
encrypt.c: /tmp/ccvuAJeq.s:921: Warning: dwarf line number information for .data ignored
encrypt.c: /tmp/ccvuAJeq.s:923: Warning: dwarf line number information for .data ignored
encrypt.c: /tmp/ccvuAJeq.s:925: Warning: dwarf line number information for .data ignored
encrypt.c: /tmp/ccvuAJeq.s:926: Warning: dwarf line number information for .data ignored
encrypt.c: /tmp/ccvuAJeq.s:927: Warning: dwarf line number information for .data ignored
encrypt.c: /tmp/ccvuAJeq.s:938: Warning: dwarf line number information for .data ignored
encrypt.c: /tmp/ccvuAJeq.s:945: Warning: dwarf line number information for .data ignored
encrypt.c: /tmp/ccvuAJeq.s:948: Warning: dwarf line number information for .data ignored
encrypt.c: /tmp/ccvuAJeq.s:949: Warning: dwarf line number information for .data ignored
encrypt.c: /tmp/ccvuAJeq.s:956: Warning: dwarf line number information for .data ignored
encrypt.c: /tmp/ccvuAJeq.s:957: Warning: dwarf line number information for .data ignored
encrypt.c: /tmp/ccvuAJeq.s:960: Warning: dwarf line number information for .data ignored
encrypt.c: /tmp/ccvuAJeq.s:962: Warning: dwarf line number information for .data ignored
encrypt.c: /tmp/ccvuAJeq.s:965: Warning: dwarf line number information for .data ignored
encrypt.c: /tmp/ccvuAJeq.s:973: Warning: dwarf line number information for .data ignored
encrypt.c: /tmp/ccvuAJeq.s:983: Warning: dwarf line number information for .data ignored
encrypt.c: /tmp/ccvuAJeq.s:985: Warning: dwarf line number information for .data ignored
encrypt.c: /tmp/ccvuAJeq.s:987: Warning: dwarf line number information for .data ignored
encrypt.c: /tmp/ccvuAJeq.s:988: Warning: dwarf line number information for .data ignored
encrypt.c: /tmp/ccvuAJeq.s:989: Warning: dwarf line number information for .data ignored
encrypt.c: /tmp/ccvuAJeq.s:996: Warning: dwarf line number information for .data ignored
encrypt.c: /tmp/ccvuAJeq.s:1003: Warning: dwarf line number information for .data ignored
encrypt.c: /tmp/ccvuAJeq.s:1006: Warning: dwarf line number information for .data ignored
encrypt.c: /tmp/ccvuAJeq.s:1009: Warning: dwarf line number information for .data ignored
encrypt.c: ...

Number of similar (implementation,compiler) pairs: 1, namely:
ImplementationCompiler
T:avx1gcc -march=native -mtune=native -Os -fwrapv -fPIC -fPIE -gdwarf-4 -Wall (11.4.0)

Compiler output


try.c: /usr/bin/ld: libcrypto_aead_omdsha256k256n248tau256v1.a(omdsha256.o):.../supercop-data/titan0/amd64/try/c/clang_-march=native_-O2_-fwrapv_-Qunused-arguments_-fPIC_-fPIE_-gdwarf-4_-Wall/timingleaks/crypto_aead/omdsha256k256n248tau256v1/sse4/work/./omdsha256.h:137: multiple definition of `Hash'; libcrypto_aead_omdsha256k256n248tau256v1.a(encrypt.o):.../supercop-data/titan0/amd64/try/c/clang_-march=native_-O2_-fwrapv_-Qunused-arguments_-fPIC_-fPIE_-gdwarf-4_-Wall/timingleaks/crypto_aead/omdsha256k256n248tau256v1/sse4/work/./omdsha256.h:137: first defined here
try.c: clang: error: linker command failed with exit code 1 (use -v to see invocation)

Number of similar (implementation,compiler) pairs: 1, namely:
ImplementationCompiler
T:sse4clang -march=native -O2 -fwrapv -Qunused-arguments -fPIC -fPIE -gdwarf-4 -Wall (Ubuntu_Clang_14.0.0)

Compiler output


try.c: /usr/bin/ld: libcrypto_aead_omdsha256k256n248tau256v1.a(omdsha256.o):.../supercop-data/titan0/amd64/try/c/clang_-march=native_-O3_-fwrapv_-Qunused-arguments_-fPIC_-fPIE_-gdwarf-4_-Wall/timingleaks/crypto_aead/omdsha256k256n248tau256v1/sse4/work/./omdsha256.h:137: multiple definition of `Hash'; libcrypto_aead_omdsha256k256n248tau256v1.a(encrypt.o):.../supercop-data/titan0/amd64/try/c/clang_-march=native_-O3_-fwrapv_-Qunused-arguments_-fPIC_-fPIE_-gdwarf-4_-Wall/timingleaks/crypto_aead/omdsha256k256n248tau256v1/sse4/work/./omdsha256.h:137: first defined here
try.c: clang: error: linker command failed with exit code 1 (use -v to see invocation)

Number of similar (implementation,compiler) pairs: 1, namely:
ImplementationCompiler
T:sse4clang -march=native -O3 -fwrapv -Qunused-arguments -fPIC -fPIE -gdwarf-4 -Wall (Ubuntu_Clang_14.0.0)

Compiler output


try.c: /usr/bin/ld: libcrypto_aead_omdsha256k256n248tau256v1.a(omdsha256.o):.../supercop-data/titan0/amd64/try/c/clang_-march=native_-O_-fwrapv_-Qunused-arguments_-fPIC_-fPIE_-gdwarf-4_-Wall/timingleaks/crypto_aead/omdsha256k256n248tau256v1/sse4/work/./omdsha256.h:137: multiple definition of `Hash'; libcrypto_aead_omdsha256k256n248tau256v1.a(encrypt.o):.../supercop-data/titan0/amd64/try/c/clang_-march=native_-O_-fwrapv_-Qunused-arguments_-fPIC_-fPIE_-gdwarf-4_-Wall/timingleaks/crypto_aead/omdsha256k256n248tau256v1/sse4/work/./omdsha256.h:137: first defined here
try.c: clang: error: linker command failed with exit code 1 (use -v to see invocation)

Number of similar (implementation,compiler) pairs: 1, namely:
ImplementationCompiler
T:sse4clang -march=native -O -fwrapv -Qunused-arguments -fPIC -fPIE -gdwarf-4 -Wall (Ubuntu_Clang_14.0.0)

Compiler output


try.c: /usr/bin/ld: libcrypto_aead_omdsha256k256n248tau256v1.a(omdsha256.o):.../supercop-data/titan0/amd64/try/c/clang_-march=native_-Os_-fwrapv_-Qunused-arguments_-fPIC_-fPIE_-gdwarf-4_-Wall/timingleaks/crypto_aead/omdsha256k256n248tau256v1/sse4/work/./omdsha256.h:137: multiple definition of `Hash'; libcrypto_aead_omdsha256k256n248tau256v1.a(encrypt.o):.../supercop-data/titan0/amd64/try/c/clang_-march=native_-Os_-fwrapv_-Qunused-arguments_-fPIC_-fPIE_-gdwarf-4_-Wall/timingleaks/crypto_aead/omdsha256k256n248tau256v1/sse4/work/./omdsha256.h:137: first defined here
try.c: clang: error: linker command failed with exit code 1 (use -v to see invocation)

Number of similar (implementation,compiler) pairs: 1, namely:
ImplementationCompiler
T:sse4clang -march=native -Os -fwrapv -Qunused-arguments -fPIC -fPIE -gdwarf-4 -Wall (Ubuntu_Clang_14.0.0)

Compiler output


try.c: /usr/bin/ld: libcrypto_aead_omdsha256k256n248tau256v1.a(omdsha256.o):.../supercop-data/titan0/amd64/try/c/clang_-mcpu=native_-O3_-fwrapv_-Qunused-arguments_-fPIC_-fPIE_-gdwarf-4_-Wall/timingleaks/crypto_aead/omdsha256k256n248tau256v1/sse4/work/./omdsha256.h:137: multiple definition of `Hash'; libcrypto_aead_omdsha256k256n248tau256v1.a(encrypt.o):.../supercop-data/titan0/amd64/try/c/clang_-mcpu=native_-O3_-fwrapv_-Qunused-arguments_-fPIC_-fPIE_-gdwarf-4_-Wall/timingleaks/crypto_aead/omdsha256k256n248tau256v1/sse4/work/./omdsha256.h:137: first defined here
try.c: clang: error: linker command failed with exit code 1 (use -v to see invocation)

Number of similar (implementation,compiler) pairs: 1, namely:
ImplementationCompiler
T:sse4clang -mcpu=native -O3 -fwrapv -Qunused-arguments -fPIC -fPIE -gdwarf-4 -Wall (Ubuntu_Clang_14.0.0)

Compiler output


encrypt.c: /tmp/ccW1F06b.s: Assembler messages:
encrypt.c: /tmp/ccW1F06b.s:961: Warning: dwarf line number information for .data ignored
encrypt.c: /tmp/ccW1F06b.s:963: Warning: dwarf line number information for .data ignored
encrypt.c: /tmp/ccW1F06b.s:965: Warning: dwarf line number information for .data ignored
encrypt.c: /tmp/ccW1F06b.s:966: Warning: dwarf line number information for .data ignored
encrypt.c: /tmp/ccW1F06b.s:967: Warning: dwarf line number information for .data ignored
encrypt.c: /tmp/ccW1F06b.s:978: Warning: dwarf line number information for .data ignored
encrypt.c: /tmp/ccW1F06b.s:985: Warning: dwarf line number information for .data ignored
encrypt.c: /tmp/ccW1F06b.s:988: Warning: dwarf line number information for .data ignored
encrypt.c: /tmp/ccW1F06b.s:989: Warning: dwarf line number information for .data ignored
encrypt.c: /tmp/ccW1F06b.s:996: Warning: dwarf line number information for .data ignored
encrypt.c: /tmp/ccW1F06b.s:997: Warning: dwarf line number information for .data ignored
encrypt.c: /tmp/ccW1F06b.s:1000: Warning: dwarf line number information for .data ignored
encrypt.c: /tmp/ccW1F06b.s:1002: Warning: dwarf line number information for .data ignored
encrypt.c: /tmp/ccW1F06b.s:1005: Warning: dwarf line number information for .data ignored
encrypt.c: /tmp/ccW1F06b.s:1013: Warning: dwarf line number information for .data ignored
encrypt.c: /tmp/ccW1F06b.s:1024: Warning: dwarf line number information for .data ignored
encrypt.c: /tmp/ccW1F06b.s:1026: Warning: dwarf line number information for .data ignored
encrypt.c: /tmp/ccW1F06b.s:1028: Warning: dwarf line number information for .data ignored
encrypt.c: /tmp/ccW1F06b.s:1029: Warning: dwarf line number information for .data ignored
encrypt.c: /tmp/ccW1F06b.s:1030: Warning: dwarf line number information for .data ignored
encrypt.c: /tmp/ccW1F06b.s:1037: Warning: dwarf line number information for .data ignored
encrypt.c: /tmp/ccW1F06b.s:1044: Warning: dwarf line number information for .data ignored
encrypt.c: /tmp/ccW1F06b.s:1047: Warning: dwarf line number information for .data ignored
encrypt.c: /tmp/ccW1F06b.s:1050: Warning: dwarf line number information for .data ignored
encrypt.c: ...

Number of similar (implementation,compiler) pairs: 1, namely:
ImplementationCompiler
T:sse4gcc -march=native -mtune=native -O2 -fwrapv -fPIC -fPIE -gdwarf-4 -Wall (11.4.0)

Compiler output


encrypt.c: /tmp/cc9gJ8pw.s: Assembler messages:
encrypt.c: /tmp/cc9gJ8pw.s:961: Warning: dwarf line number information for .data ignored
encrypt.c: /tmp/cc9gJ8pw.s:963: Warning: dwarf line number information for .data ignored
encrypt.c: /tmp/cc9gJ8pw.s:965: Warning: dwarf line number information for .data ignored
encrypt.c: /tmp/cc9gJ8pw.s:966: Warning: dwarf line number information for .data ignored
encrypt.c: /tmp/cc9gJ8pw.s:967: Warning: dwarf line number information for .data ignored
encrypt.c: /tmp/cc9gJ8pw.s:978: Warning: dwarf line number information for .data ignored
encrypt.c: /tmp/cc9gJ8pw.s:985: Warning: dwarf line number information for .data ignored
encrypt.c: /tmp/cc9gJ8pw.s:988: Warning: dwarf line number information for .data ignored
encrypt.c: /tmp/cc9gJ8pw.s:989: Warning: dwarf line number information for .data ignored
encrypt.c: /tmp/cc9gJ8pw.s:996: Warning: dwarf line number information for .data ignored
encrypt.c: /tmp/cc9gJ8pw.s:997: Warning: dwarf line number information for .data ignored
encrypt.c: /tmp/cc9gJ8pw.s:1000: Warning: dwarf line number information for .data ignored
encrypt.c: /tmp/cc9gJ8pw.s:1002: Warning: dwarf line number information for .data ignored
encrypt.c: /tmp/cc9gJ8pw.s:1005: Warning: dwarf line number information for .data ignored
encrypt.c: /tmp/cc9gJ8pw.s:1013: Warning: dwarf line number information for .data ignored
encrypt.c: /tmp/cc9gJ8pw.s:1024: Warning: dwarf line number information for .data ignored
encrypt.c: /tmp/cc9gJ8pw.s:1026: Warning: dwarf line number information for .data ignored
encrypt.c: /tmp/cc9gJ8pw.s:1028: Warning: dwarf line number information for .data ignored
encrypt.c: /tmp/cc9gJ8pw.s:1029: Warning: dwarf line number information for .data ignored
encrypt.c: /tmp/cc9gJ8pw.s:1030: Warning: dwarf line number information for .data ignored
encrypt.c: /tmp/cc9gJ8pw.s:1037: Warning: dwarf line number information for .data ignored
encrypt.c: /tmp/cc9gJ8pw.s:1044: Warning: dwarf line number information for .data ignored
encrypt.c: /tmp/cc9gJ8pw.s:1047: Warning: dwarf line number information for .data ignored
encrypt.c: /tmp/cc9gJ8pw.s:1050: Warning: dwarf line number information for .data ignored
encrypt.c: ...

Number of similar (implementation,compiler) pairs: 1, namely:
ImplementationCompiler
T:sse4gcc -march=native -mtune=native -O3 -fwrapv -fPIC -fPIE -gdwarf-4 -Wall (11.4.0)

Compiler output


encrypt.c: /tmp/ccSczZpC.s: Assembler messages:
encrypt.c: /tmp/ccSczZpC.s:960: Warning: dwarf line number information for .data ignored
encrypt.c: /tmp/ccSczZpC.s:962: Warning: dwarf line number information for .data ignored
encrypt.c: /tmp/ccSczZpC.s:974: Warning: dwarf line number information for .data ignored
encrypt.c: /tmp/ccSczZpC.s:975: Warning: dwarf line number information for .data ignored
encrypt.c: /tmp/ccSczZpC.s:976: Warning: dwarf line number information for .data ignored
encrypt.c: /tmp/ccSczZpC.s:983: Warning: dwarf line number information for .data ignored
encrypt.c: /tmp/ccSczZpC.s:986: Warning: dwarf line number information for .data ignored
encrypt.c: /tmp/ccSczZpC.s:987: Warning: dwarf line number information for .data ignored
encrypt.c: /tmp/ccSczZpC.s:992: Warning: dwarf line number information for .data ignored
encrypt.c: /tmp/ccSczZpC.s:993: Warning: dwarf line number information for .data ignored
encrypt.c: /tmp/ccSczZpC.s:996: Warning: dwarf line number information for .data ignored
encrypt.c: /tmp/ccSczZpC.s:998: Warning: dwarf line number information for .data ignored
encrypt.c: /tmp/ccSczZpC.s:1001: Warning: dwarf line number information for .data ignored
encrypt.c: /tmp/ccSczZpC.s:1009: Warning: dwarf line number information for .data ignored
encrypt.c: /tmp/ccSczZpC.s:1019: Warning: dwarf line number information for .data ignored
encrypt.c: /tmp/ccSczZpC.s:1021: Warning: dwarf line number information for .data ignored
encrypt.c: /tmp/ccSczZpC.s:1034: Warning: dwarf line number information for .data ignored
encrypt.c: /tmp/ccSczZpC.s:1038: Warning: dwarf line number information for .data ignored
encrypt.c: /tmp/ccSczZpC.s:1039: Warning: dwarf line number information for .data ignored
encrypt.c: /tmp/ccSczZpC.s:1040: Warning: dwarf line number information for .data ignored
encrypt.c: /tmp/ccSczZpC.s:1047: Warning: dwarf line number information for .data ignored
encrypt.c: /tmp/ccSczZpC.s:1050: Warning: dwarf line number information for .data ignored
encrypt.c: /tmp/ccSczZpC.s:1053: Warning: dwarf line number information for .data ignored
encrypt.c: /tmp/ccSczZpC.s:1056: Warning: dwarf line number information for .data ignored
encrypt.c: ...

Number of similar (implementation,compiler) pairs: 1, namely:
ImplementationCompiler
T:sse4gcc -march=native -mtune=native -O -fwrapv -fPIC -fPIE -gdwarf-4 -Wall (11.4.0)

Compiler output


encrypt.c: /tmp/ccZECmlO.s: Assembler messages:
encrypt.c: /tmp/ccZECmlO.s:960: Warning: dwarf line number information for .data ignored
encrypt.c: /tmp/ccZECmlO.s:962: Warning: dwarf line number information for .data ignored
encrypt.c: /tmp/ccZECmlO.s:964: Warning: dwarf line number information for .data ignored
encrypt.c: /tmp/ccZECmlO.s:965: Warning: dwarf line number information for .data ignored
encrypt.c: /tmp/ccZECmlO.s:966: Warning: dwarf line number information for .data ignored
encrypt.c: /tmp/ccZECmlO.s:977: Warning: dwarf line number information for .data ignored
encrypt.c: /tmp/ccZECmlO.s:984: Warning: dwarf line number information for .data ignored
encrypt.c: /tmp/ccZECmlO.s:987: Warning: dwarf line number information for .data ignored
encrypt.c: /tmp/ccZECmlO.s:988: Warning: dwarf line number information for .data ignored
encrypt.c: /tmp/ccZECmlO.s:995: Warning: dwarf line number information for .data ignored
encrypt.c: /tmp/ccZECmlO.s:996: Warning: dwarf line number information for .data ignored
encrypt.c: /tmp/ccZECmlO.s:999: Warning: dwarf line number information for .data ignored
encrypt.c: /tmp/ccZECmlO.s:1001: Warning: dwarf line number information for .data ignored
encrypt.c: /tmp/ccZECmlO.s:1004: Warning: dwarf line number information for .data ignored
encrypt.c: /tmp/ccZECmlO.s:1012: Warning: dwarf line number information for .data ignored
encrypt.c: /tmp/ccZECmlO.s:1022: Warning: dwarf line number information for .data ignored
encrypt.c: /tmp/ccZECmlO.s:1024: Warning: dwarf line number information for .data ignored
encrypt.c: /tmp/ccZECmlO.s:1026: Warning: dwarf line number information for .data ignored
encrypt.c: /tmp/ccZECmlO.s:1027: Warning: dwarf line number information for .data ignored
encrypt.c: /tmp/ccZECmlO.s:1028: Warning: dwarf line number information for .data ignored
encrypt.c: /tmp/ccZECmlO.s:1035: Warning: dwarf line number information for .data ignored
encrypt.c: /tmp/ccZECmlO.s:1042: Warning: dwarf line number information for .data ignored
encrypt.c: /tmp/ccZECmlO.s:1045: Warning: dwarf line number information for .data ignored
encrypt.c: /tmp/ccZECmlO.s:1048: Warning: dwarf line number information for .data ignored
encrypt.c: ...

Number of similar (implementation,compiler) pairs: 1, namely:
ImplementationCompiler
T:sse4gcc -march=native -mtune=native -Os -fwrapv -fPIC -fPIE -gdwarf-4 -Wall (11.4.0)