Test results for amd64, titan0, crypto_aead/omdsha256k192n104tau128v1

[Page version: 20250315 17:22:32]

Measurements for amd64, titan0, crypto_aead Test results for amd64, titan0, crypto_aead Test results for crypto_aead/omdsha256k192n104tau128v1
Computer: titan0
Microarchitecture: amd64; Haswell+AES (306c3)
Architecture: amd64
CPU ID: GenuineIntel-000306c3-bfebfbff
SUPERCOP version: 20250307
Operation: crypto_aead
Primitive: omdsha256k192n104tau128v1
TimeObject sizeTest sizeImplementationCompilerBenchmark dateSUPERCOP version
16484314890 0 038700 812 1088T:refgcc -march=native -mtune=native -O3 -fwrapv -fPIC -fPIE -gdwarf-4 -Wall2025031120250307
17786511767 0 035448 860 1056T:refclang -march=native -O2 -fwrapv -Qunused-arguments -fPIC -fPIE -gdwarf-4 -Wall2025031120250307
18032010861 0 034744 860 1056T:refclang -march=native -O3 -fwrapv -Qunused-arguments -fPIC -fPIE -gdwarf-4 -Wall2025031120250307
1941084569 0 025314 852 1088T:refclang -march=native -Os -fwrapv -Qunused-arguments -fPIC -fPIE -gdwarf-4 -Wall2025031120250307
2046716469 0 028244 812 1088T:refgcc -march=native -mtune=native -O2 -fwrapv -fPIC -fPIE -gdwarf-4 -Wall2025031120250307
2080675697 0 025632 860 1024T:refclang -march=native -O -fwrapv -Qunused-arguments -fPIC -fPIE -gdwarf-4 -Wall2025031120250307
20879412175 0 034464 860 1024T:refclang -mcpu=native -O3 -fwrapv -Qunused-arguments -fPIC -fPIE -gdwarf-4 -Wall2025031120250307
2103716060 0 027243 804 1088T:refgcc -march=native -mtune=native -O -fwrapv -fPIC -fPIE -gdwarf-4 -Wall2025031120250307
2187394602 0 024143 788 1056T:refgcc -march=native -mtune=native -Os -fwrapv -fPIC -fPIE -gdwarf-4 -Wall2025031120250307

Compiler output


try.c: /usr/bin/ld: libcrypto_aead_omdsha256k192n104tau128v1.a(omdsha256.o):.../supercop-data/titan0/amd64/try/c/clang_-march=native_-O2_-fwrapv_-Qunused-arguments_-fPIC_-fPIE_-gdwarf-4_-Wall/timingleaks/crypto_aead/omdsha256k192n104tau128v1/avx1/work/./omdsha256.h:137: multiple definition of `Hash'; libcrypto_aead_omdsha256k192n104tau128v1.a(encrypt.o):.../supercop-data/titan0/amd64/try/c/clang_-march=native_-O2_-fwrapv_-Qunused-arguments_-fPIC_-fPIE_-gdwarf-4_-Wall/timingleaks/crypto_aead/omdsha256k192n104tau128v1/avx1/work/./omdsha256.h:137: first defined here
try.c: clang: error: linker command failed with exit code 1 (use -v to see invocation)

Number of similar (implementation,compiler) pairs: 1, namely:
ImplementationCompiler
T:avx1clang -march=native -O2 -fwrapv -Qunused-arguments -fPIC -fPIE -gdwarf-4 -Wall (Ubuntu_Clang_14.0.0)

Compiler output


try.c: /usr/bin/ld: libcrypto_aead_omdsha256k192n104tau128v1.a(omdsha256.o):.../supercop-data/titan0/amd64/try/c/clang_-march=native_-O3_-fwrapv_-Qunused-arguments_-fPIC_-fPIE_-gdwarf-4_-Wall/timingleaks/crypto_aead/omdsha256k192n104tau128v1/avx1/work/./omdsha256.h:137: multiple definition of `Hash'; libcrypto_aead_omdsha256k192n104tau128v1.a(encrypt.o):.../supercop-data/titan0/amd64/try/c/clang_-march=native_-O3_-fwrapv_-Qunused-arguments_-fPIC_-fPIE_-gdwarf-4_-Wall/timingleaks/crypto_aead/omdsha256k192n104tau128v1/avx1/work/./omdsha256.h:137: first defined here
try.c: clang: error: linker command failed with exit code 1 (use -v to see invocation)

Number of similar (implementation,compiler) pairs: 1, namely:
ImplementationCompiler
T:avx1clang -march=native -O3 -fwrapv -Qunused-arguments -fPIC -fPIE -gdwarf-4 -Wall (Ubuntu_Clang_14.0.0)

Compiler output


try.c: /usr/bin/ld: libcrypto_aead_omdsha256k192n104tau128v1.a(omdsha256.o):.../supercop-data/titan0/amd64/try/c/clang_-march=native_-O_-fwrapv_-Qunused-arguments_-fPIC_-fPIE_-gdwarf-4_-Wall/timingleaks/crypto_aead/omdsha256k192n104tau128v1/avx1/work/./omdsha256.h:137: multiple definition of `Hash'; libcrypto_aead_omdsha256k192n104tau128v1.a(encrypt.o):.../supercop-data/titan0/amd64/try/c/clang_-march=native_-O_-fwrapv_-Qunused-arguments_-fPIC_-fPIE_-gdwarf-4_-Wall/timingleaks/crypto_aead/omdsha256k192n104tau128v1/avx1/work/./omdsha256.h:137: first defined here
try.c: clang: error: linker command failed with exit code 1 (use -v to see invocation)

Number of similar (implementation,compiler) pairs: 1, namely:
ImplementationCompiler
T:avx1clang -march=native -O -fwrapv -Qunused-arguments -fPIC -fPIE -gdwarf-4 -Wall (Ubuntu_Clang_14.0.0)

Compiler output


try.c: /usr/bin/ld: libcrypto_aead_omdsha256k192n104tau128v1.a(omdsha256.o):.../supercop-data/titan0/amd64/try/c/clang_-march=native_-Os_-fwrapv_-Qunused-arguments_-fPIC_-fPIE_-gdwarf-4_-Wall/timingleaks/crypto_aead/omdsha256k192n104tau128v1/avx1/work/./omdsha256.h:137: multiple definition of `Hash'; libcrypto_aead_omdsha256k192n104tau128v1.a(encrypt.o):.../supercop-data/titan0/amd64/try/c/clang_-march=native_-Os_-fwrapv_-Qunused-arguments_-fPIC_-fPIE_-gdwarf-4_-Wall/timingleaks/crypto_aead/omdsha256k192n104tau128v1/avx1/work/./omdsha256.h:137: first defined here
try.c: clang: error: linker command failed with exit code 1 (use -v to see invocation)

Number of similar (implementation,compiler) pairs: 1, namely:
ImplementationCompiler
T:avx1clang -march=native -Os -fwrapv -Qunused-arguments -fPIC -fPIE -gdwarf-4 -Wall (Ubuntu_Clang_14.0.0)

Compiler output


try.c: /usr/bin/ld: libcrypto_aead_omdsha256k192n104tau128v1.a(omdsha256.o):.../supercop-data/titan0/amd64/try/c/clang_-mcpu=native_-O3_-fwrapv_-Qunused-arguments_-fPIC_-fPIE_-gdwarf-4_-Wall/timingleaks/crypto_aead/omdsha256k192n104tau128v1/avx1/work/./omdsha256.h:137: multiple definition of `Hash'; libcrypto_aead_omdsha256k192n104tau128v1.a(encrypt.o):.../supercop-data/titan0/amd64/try/c/clang_-mcpu=native_-O3_-fwrapv_-Qunused-arguments_-fPIC_-fPIE_-gdwarf-4_-Wall/timingleaks/crypto_aead/omdsha256k192n104tau128v1/avx1/work/./omdsha256.h:137: first defined here
try.c: clang: error: linker command failed with exit code 1 (use -v to see invocation)

Number of similar (implementation,compiler) pairs: 1, namely:
ImplementationCompiler
T:avx1clang -mcpu=native -O3 -fwrapv -Qunused-arguments -fPIC -fPIE -gdwarf-4 -Wall (Ubuntu_Clang_14.0.0)

Compiler output


encrypt.c: /tmp/ccK1ypNW.s: Assembler messages:
encrypt.c: /tmp/ccK1ypNW.s:922: Warning: dwarf line number information for .data ignored
encrypt.c: /tmp/ccK1ypNW.s:924: Warning: dwarf line number information for .data ignored
encrypt.c: /tmp/ccK1ypNW.s:926: Warning: dwarf line number information for .data ignored
encrypt.c: /tmp/ccK1ypNW.s:927: Warning: dwarf line number information for .data ignored
encrypt.c: /tmp/ccK1ypNW.s:928: Warning: dwarf line number information for .data ignored
encrypt.c: /tmp/ccK1ypNW.s:939: Warning: dwarf line number information for .data ignored
encrypt.c: /tmp/ccK1ypNW.s:946: Warning: dwarf line number information for .data ignored
encrypt.c: /tmp/ccK1ypNW.s:949: Warning: dwarf line number information for .data ignored
encrypt.c: /tmp/ccK1ypNW.s:950: Warning: dwarf line number information for .data ignored
encrypt.c: /tmp/ccK1ypNW.s:957: Warning: dwarf line number information for .data ignored
encrypt.c: /tmp/ccK1ypNW.s:958: Warning: dwarf line number information for .data ignored
encrypt.c: /tmp/ccK1ypNW.s:961: Warning: dwarf line number information for .data ignored
encrypt.c: /tmp/ccK1ypNW.s:963: Warning: dwarf line number information for .data ignored
encrypt.c: /tmp/ccK1ypNW.s:966: Warning: dwarf line number information for .data ignored
encrypt.c: /tmp/ccK1ypNW.s:974: Warning: dwarf line number information for .data ignored
encrypt.c: /tmp/ccK1ypNW.s:985: Warning: dwarf line number information for .data ignored
encrypt.c: /tmp/ccK1ypNW.s:987: Warning: dwarf line number information for .data ignored
encrypt.c: /tmp/ccK1ypNW.s:989: Warning: dwarf line number information for .data ignored
encrypt.c: /tmp/ccK1ypNW.s:990: Warning: dwarf line number information for .data ignored
encrypt.c: /tmp/ccK1ypNW.s:991: Warning: dwarf line number information for .data ignored
encrypt.c: /tmp/ccK1ypNW.s:998: Warning: dwarf line number information for .data ignored
encrypt.c: /tmp/ccK1ypNW.s:1005: Warning: dwarf line number information for .data ignored
encrypt.c: /tmp/ccK1ypNW.s:1008: Warning: dwarf line number information for .data ignored
encrypt.c: /tmp/ccK1ypNW.s:1011: Warning: dwarf line number information for .data ignored
encrypt.c: ...

Number of similar (implementation,compiler) pairs: 1, namely:
ImplementationCompiler
T:avx1gcc -march=native -mtune=native -O2 -fwrapv -fPIC -fPIE -gdwarf-4 -Wall (11.4.0)

Compiler output


encrypt.c: /tmp/ccoQUfj6.s: Assembler messages:
encrypt.c: /tmp/ccoQUfj6.s:922: Warning: dwarf line number information for .data ignored
encrypt.c: /tmp/ccoQUfj6.s:924: Warning: dwarf line number information for .data ignored
encrypt.c: /tmp/ccoQUfj6.s:926: Warning: dwarf line number information for .data ignored
encrypt.c: /tmp/ccoQUfj6.s:927: Warning: dwarf line number information for .data ignored
encrypt.c: /tmp/ccoQUfj6.s:928: Warning: dwarf line number information for .data ignored
encrypt.c: /tmp/ccoQUfj6.s:939: Warning: dwarf line number information for .data ignored
encrypt.c: /tmp/ccoQUfj6.s:946: Warning: dwarf line number information for .data ignored
encrypt.c: /tmp/ccoQUfj6.s:949: Warning: dwarf line number information for .data ignored
encrypt.c: /tmp/ccoQUfj6.s:950: Warning: dwarf line number information for .data ignored
encrypt.c: /tmp/ccoQUfj6.s:957: Warning: dwarf line number information for .data ignored
encrypt.c: /tmp/ccoQUfj6.s:958: Warning: dwarf line number information for .data ignored
encrypt.c: /tmp/ccoQUfj6.s:961: Warning: dwarf line number information for .data ignored
encrypt.c: /tmp/ccoQUfj6.s:963: Warning: dwarf line number information for .data ignored
encrypt.c: /tmp/ccoQUfj6.s:966: Warning: dwarf line number information for .data ignored
encrypt.c: /tmp/ccoQUfj6.s:974: Warning: dwarf line number information for .data ignored
encrypt.c: /tmp/ccoQUfj6.s:985: Warning: dwarf line number information for .data ignored
encrypt.c: /tmp/ccoQUfj6.s:987: Warning: dwarf line number information for .data ignored
encrypt.c: /tmp/ccoQUfj6.s:989: Warning: dwarf line number information for .data ignored
encrypt.c: /tmp/ccoQUfj6.s:990: Warning: dwarf line number information for .data ignored
encrypt.c: /tmp/ccoQUfj6.s:991: Warning: dwarf line number information for .data ignored
encrypt.c: /tmp/ccoQUfj6.s:998: Warning: dwarf line number information for .data ignored
encrypt.c: /tmp/ccoQUfj6.s:1005: Warning: dwarf line number information for .data ignored
encrypt.c: /tmp/ccoQUfj6.s:1008: Warning: dwarf line number information for .data ignored
encrypt.c: /tmp/ccoQUfj6.s:1011: Warning: dwarf line number information for .data ignored
encrypt.c: ...

Number of similar (implementation,compiler) pairs: 1, namely:
ImplementationCompiler
T:avx1gcc -march=native -mtune=native -O3 -fwrapv -fPIC -fPIE -gdwarf-4 -Wall (11.4.0)

Compiler output


encrypt.c: /tmp/ccliPW6K.s: Assembler messages:
encrypt.c: /tmp/ccliPW6K.s:921: Warning: dwarf line number information for .data ignored
encrypt.c: /tmp/ccliPW6K.s:923: Warning: dwarf line number information for .data ignored
encrypt.c: /tmp/ccliPW6K.s:935: Warning: dwarf line number information for .data ignored
encrypt.c: /tmp/ccliPW6K.s:936: Warning: dwarf line number information for .data ignored
encrypt.c: /tmp/ccliPW6K.s:937: Warning: dwarf line number information for .data ignored
encrypt.c: /tmp/ccliPW6K.s:944: Warning: dwarf line number information for .data ignored
encrypt.c: /tmp/ccliPW6K.s:947: Warning: dwarf line number information for .data ignored
encrypt.c: /tmp/ccliPW6K.s:948: Warning: dwarf line number information for .data ignored
encrypt.c: /tmp/ccliPW6K.s:953: Warning: dwarf line number information for .data ignored
encrypt.c: /tmp/ccliPW6K.s:954: Warning: dwarf line number information for .data ignored
encrypt.c: /tmp/ccliPW6K.s:957: Warning: dwarf line number information for .data ignored
encrypt.c: /tmp/ccliPW6K.s:959: Warning: dwarf line number information for .data ignored
encrypt.c: /tmp/ccliPW6K.s:962: Warning: dwarf line number information for .data ignored
encrypt.c: /tmp/ccliPW6K.s:970: Warning: dwarf line number information for .data ignored
encrypt.c: /tmp/ccliPW6K.s:980: Warning: dwarf line number information for .data ignored
encrypt.c: /tmp/ccliPW6K.s:982: Warning: dwarf line number information for .data ignored
encrypt.c: /tmp/ccliPW6K.s:995: Warning: dwarf line number information for .data ignored
encrypt.c: /tmp/ccliPW6K.s:999: Warning: dwarf line number information for .data ignored
encrypt.c: /tmp/ccliPW6K.s:1000: Warning: dwarf line number information for .data ignored
encrypt.c: /tmp/ccliPW6K.s:1001: Warning: dwarf line number information for .data ignored
encrypt.c: /tmp/ccliPW6K.s:1008: Warning: dwarf line number information for .data ignored
encrypt.c: /tmp/ccliPW6K.s:1011: Warning: dwarf line number information for .data ignored
encrypt.c: /tmp/ccliPW6K.s:1014: Warning: dwarf line number information for .data ignored
encrypt.c: /tmp/ccliPW6K.s:1017: Warning: dwarf line number information for .data ignored
encrypt.c: ...

Number of similar (implementation,compiler) pairs: 1, namely:
ImplementationCompiler
T:avx1gcc -march=native -mtune=native -O -fwrapv -fPIC -fPIE -gdwarf-4 -Wall (11.4.0)

Compiler output


encrypt.c: /tmp/ccaWvZr5.s: Assembler messages:
encrypt.c: /tmp/ccaWvZr5.s:921: Warning: dwarf line number information for .data ignored
encrypt.c: /tmp/ccaWvZr5.s:923: Warning: dwarf line number information for .data ignored
encrypt.c: /tmp/ccaWvZr5.s:925: Warning: dwarf line number information for .data ignored
encrypt.c: /tmp/ccaWvZr5.s:926: Warning: dwarf line number information for .data ignored
encrypt.c: /tmp/ccaWvZr5.s:927: Warning: dwarf line number information for .data ignored
encrypt.c: /tmp/ccaWvZr5.s:938: Warning: dwarf line number information for .data ignored
encrypt.c: /tmp/ccaWvZr5.s:945: Warning: dwarf line number information for .data ignored
encrypt.c: /tmp/ccaWvZr5.s:948: Warning: dwarf line number information for .data ignored
encrypt.c: /tmp/ccaWvZr5.s:949: Warning: dwarf line number information for .data ignored
encrypt.c: /tmp/ccaWvZr5.s:956: Warning: dwarf line number information for .data ignored
encrypt.c: /tmp/ccaWvZr5.s:957: Warning: dwarf line number information for .data ignored
encrypt.c: /tmp/ccaWvZr5.s:960: Warning: dwarf line number information for .data ignored
encrypt.c: /tmp/ccaWvZr5.s:962: Warning: dwarf line number information for .data ignored
encrypt.c: /tmp/ccaWvZr5.s:965: Warning: dwarf line number information for .data ignored
encrypt.c: /tmp/ccaWvZr5.s:973: Warning: dwarf line number information for .data ignored
encrypt.c: /tmp/ccaWvZr5.s:983: Warning: dwarf line number information for .data ignored
encrypt.c: /tmp/ccaWvZr5.s:985: Warning: dwarf line number information for .data ignored
encrypt.c: /tmp/ccaWvZr5.s:987: Warning: dwarf line number information for .data ignored
encrypt.c: /tmp/ccaWvZr5.s:988: Warning: dwarf line number information for .data ignored
encrypt.c: /tmp/ccaWvZr5.s:989: Warning: dwarf line number information for .data ignored
encrypt.c: /tmp/ccaWvZr5.s:996: Warning: dwarf line number information for .data ignored
encrypt.c: /tmp/ccaWvZr5.s:1003: Warning: dwarf line number information for .data ignored
encrypt.c: /tmp/ccaWvZr5.s:1006: Warning: dwarf line number information for .data ignored
encrypt.c: /tmp/ccaWvZr5.s:1009: Warning: dwarf line number information for .data ignored
encrypt.c: ...

Number of similar (implementation,compiler) pairs: 1, namely:
ImplementationCompiler
T:avx1gcc -march=native -mtune=native -Os -fwrapv -fPIC -fPIE -gdwarf-4 -Wall (11.4.0)

Compiler output


try.c: /usr/bin/ld: libcrypto_aead_omdsha256k192n104tau128v1.a(omdsha256.o):.../supercop-data/titan0/amd64/try/c/clang_-march=native_-O2_-fwrapv_-Qunused-arguments_-fPIC_-fPIE_-gdwarf-4_-Wall/timingleaks/crypto_aead/omdsha256k192n104tau128v1/sse4/work/./omdsha256.h:137: multiple definition of `Hash'; libcrypto_aead_omdsha256k192n104tau128v1.a(encrypt.o):.../supercop-data/titan0/amd64/try/c/clang_-march=native_-O2_-fwrapv_-Qunused-arguments_-fPIC_-fPIE_-gdwarf-4_-Wall/timingleaks/crypto_aead/omdsha256k192n104tau128v1/sse4/work/./omdsha256.h:137: first defined here
try.c: clang: error: linker command failed with exit code 1 (use -v to see invocation)

Number of similar (implementation,compiler) pairs: 1, namely:
ImplementationCompiler
T:sse4clang -march=native -O2 -fwrapv -Qunused-arguments -fPIC -fPIE -gdwarf-4 -Wall (Ubuntu_Clang_14.0.0)

Compiler output


try.c: /usr/bin/ld: libcrypto_aead_omdsha256k192n104tau128v1.a(omdsha256.o):.../supercop-data/titan0/amd64/try/c/clang_-march=native_-O3_-fwrapv_-Qunused-arguments_-fPIC_-fPIE_-gdwarf-4_-Wall/timingleaks/crypto_aead/omdsha256k192n104tau128v1/sse4/work/./omdsha256.h:137: multiple definition of `Hash'; libcrypto_aead_omdsha256k192n104tau128v1.a(encrypt.o):.../supercop-data/titan0/amd64/try/c/clang_-march=native_-O3_-fwrapv_-Qunused-arguments_-fPIC_-fPIE_-gdwarf-4_-Wall/timingleaks/crypto_aead/omdsha256k192n104tau128v1/sse4/work/./omdsha256.h:137: first defined here
try.c: clang: error: linker command failed with exit code 1 (use -v to see invocation)

Number of similar (implementation,compiler) pairs: 1, namely:
ImplementationCompiler
T:sse4clang -march=native -O3 -fwrapv -Qunused-arguments -fPIC -fPIE -gdwarf-4 -Wall (Ubuntu_Clang_14.0.0)

Compiler output


try.c: /usr/bin/ld: libcrypto_aead_omdsha256k192n104tau128v1.a(omdsha256.o):.../supercop-data/titan0/amd64/try/c/clang_-march=native_-O_-fwrapv_-Qunused-arguments_-fPIC_-fPIE_-gdwarf-4_-Wall/timingleaks/crypto_aead/omdsha256k192n104tau128v1/sse4/work/./omdsha256.h:137: multiple definition of `Hash'; libcrypto_aead_omdsha256k192n104tau128v1.a(encrypt.o):.../supercop-data/titan0/amd64/try/c/clang_-march=native_-O_-fwrapv_-Qunused-arguments_-fPIC_-fPIE_-gdwarf-4_-Wall/timingleaks/crypto_aead/omdsha256k192n104tau128v1/sse4/work/./omdsha256.h:137: first defined here
try.c: clang: error: linker command failed with exit code 1 (use -v to see invocation)

Number of similar (implementation,compiler) pairs: 1, namely:
ImplementationCompiler
T:sse4clang -march=native -O -fwrapv -Qunused-arguments -fPIC -fPIE -gdwarf-4 -Wall (Ubuntu_Clang_14.0.0)

Compiler output


try.c: /usr/bin/ld: libcrypto_aead_omdsha256k192n104tau128v1.a(omdsha256.o):.../supercop-data/titan0/amd64/try/c/clang_-march=native_-Os_-fwrapv_-Qunused-arguments_-fPIC_-fPIE_-gdwarf-4_-Wall/timingleaks/crypto_aead/omdsha256k192n104tau128v1/sse4/work/./omdsha256.h:137: multiple definition of `Hash'; libcrypto_aead_omdsha256k192n104tau128v1.a(encrypt.o):.../supercop-data/titan0/amd64/try/c/clang_-march=native_-Os_-fwrapv_-Qunused-arguments_-fPIC_-fPIE_-gdwarf-4_-Wall/timingleaks/crypto_aead/omdsha256k192n104tau128v1/sse4/work/./omdsha256.h:137: first defined here
try.c: clang: error: linker command failed with exit code 1 (use -v to see invocation)

Number of similar (implementation,compiler) pairs: 1, namely:
ImplementationCompiler
T:sse4clang -march=native -Os -fwrapv -Qunused-arguments -fPIC -fPIE -gdwarf-4 -Wall (Ubuntu_Clang_14.0.0)

Compiler output


try.c: /usr/bin/ld: libcrypto_aead_omdsha256k192n104tau128v1.a(omdsha256.o):.../supercop-data/titan0/amd64/try/c/clang_-mcpu=native_-O3_-fwrapv_-Qunused-arguments_-fPIC_-fPIE_-gdwarf-4_-Wall/timingleaks/crypto_aead/omdsha256k192n104tau128v1/sse4/work/./omdsha256.h:137: multiple definition of `Hash'; libcrypto_aead_omdsha256k192n104tau128v1.a(encrypt.o):.../supercop-data/titan0/amd64/try/c/clang_-mcpu=native_-O3_-fwrapv_-Qunused-arguments_-fPIC_-fPIE_-gdwarf-4_-Wall/timingleaks/crypto_aead/omdsha256k192n104tau128v1/sse4/work/./omdsha256.h:137: first defined here
try.c: clang: error: linker command failed with exit code 1 (use -v to see invocation)

Number of similar (implementation,compiler) pairs: 1, namely:
ImplementationCompiler
T:sse4clang -mcpu=native -O3 -fwrapv -Qunused-arguments -fPIC -fPIE -gdwarf-4 -Wall (Ubuntu_Clang_14.0.0)

Compiler output


encrypt.c: /tmp/cc1RagWX.s: Assembler messages:
encrypt.c: /tmp/cc1RagWX.s:961: Warning: dwarf line number information for .data ignored
encrypt.c: /tmp/cc1RagWX.s:963: Warning: dwarf line number information for .data ignored
encrypt.c: /tmp/cc1RagWX.s:965: Warning: dwarf line number information for .data ignored
encrypt.c: /tmp/cc1RagWX.s:966: Warning: dwarf line number information for .data ignored
encrypt.c: /tmp/cc1RagWX.s:967: Warning: dwarf line number information for .data ignored
encrypt.c: /tmp/cc1RagWX.s:978: Warning: dwarf line number information for .data ignored
encrypt.c: /tmp/cc1RagWX.s:985: Warning: dwarf line number information for .data ignored
encrypt.c: /tmp/cc1RagWX.s:988: Warning: dwarf line number information for .data ignored
encrypt.c: /tmp/cc1RagWX.s:989: Warning: dwarf line number information for .data ignored
encrypt.c: /tmp/cc1RagWX.s:996: Warning: dwarf line number information for .data ignored
encrypt.c: /tmp/cc1RagWX.s:997: Warning: dwarf line number information for .data ignored
encrypt.c: /tmp/cc1RagWX.s:1000: Warning: dwarf line number information for .data ignored
encrypt.c: /tmp/cc1RagWX.s:1002: Warning: dwarf line number information for .data ignored
encrypt.c: /tmp/cc1RagWX.s:1005: Warning: dwarf line number information for .data ignored
encrypt.c: /tmp/cc1RagWX.s:1013: Warning: dwarf line number information for .data ignored
encrypt.c: /tmp/cc1RagWX.s:1024: Warning: dwarf line number information for .data ignored
encrypt.c: /tmp/cc1RagWX.s:1026: Warning: dwarf line number information for .data ignored
encrypt.c: /tmp/cc1RagWX.s:1028: Warning: dwarf line number information for .data ignored
encrypt.c: /tmp/cc1RagWX.s:1029: Warning: dwarf line number information for .data ignored
encrypt.c: /tmp/cc1RagWX.s:1030: Warning: dwarf line number information for .data ignored
encrypt.c: /tmp/cc1RagWX.s:1037: Warning: dwarf line number information for .data ignored
encrypt.c: /tmp/cc1RagWX.s:1044: Warning: dwarf line number information for .data ignored
encrypt.c: /tmp/cc1RagWX.s:1047: Warning: dwarf line number information for .data ignored
encrypt.c: /tmp/cc1RagWX.s:1050: Warning: dwarf line number information for .data ignored
encrypt.c: ...

Number of similar (implementation,compiler) pairs: 1, namely:
ImplementationCompiler
T:sse4gcc -march=native -mtune=native -O2 -fwrapv -fPIC -fPIE -gdwarf-4 -Wall (11.4.0)

Compiler output


encrypt.c: /tmp/ccBHY4QJ.s: Assembler messages:
encrypt.c: /tmp/ccBHY4QJ.s:961: Warning: dwarf line number information for .data ignored
encrypt.c: /tmp/ccBHY4QJ.s:963: Warning: dwarf line number information for .data ignored
encrypt.c: /tmp/ccBHY4QJ.s:965: Warning: dwarf line number information for .data ignored
encrypt.c: /tmp/ccBHY4QJ.s:966: Warning: dwarf line number information for .data ignored
encrypt.c: /tmp/ccBHY4QJ.s:967: Warning: dwarf line number information for .data ignored
encrypt.c: /tmp/ccBHY4QJ.s:978: Warning: dwarf line number information for .data ignored
encrypt.c: /tmp/ccBHY4QJ.s:985: Warning: dwarf line number information for .data ignored
encrypt.c: /tmp/ccBHY4QJ.s:988: Warning: dwarf line number information for .data ignored
encrypt.c: /tmp/ccBHY4QJ.s:989: Warning: dwarf line number information for .data ignored
encrypt.c: /tmp/ccBHY4QJ.s:996: Warning: dwarf line number information for .data ignored
encrypt.c: /tmp/ccBHY4QJ.s:997: Warning: dwarf line number information for .data ignored
encrypt.c: /tmp/ccBHY4QJ.s:1000: Warning: dwarf line number information for .data ignored
encrypt.c: /tmp/ccBHY4QJ.s:1002: Warning: dwarf line number information for .data ignored
encrypt.c: /tmp/ccBHY4QJ.s:1005: Warning: dwarf line number information for .data ignored
encrypt.c: /tmp/ccBHY4QJ.s:1013: Warning: dwarf line number information for .data ignored
encrypt.c: /tmp/ccBHY4QJ.s:1024: Warning: dwarf line number information for .data ignored
encrypt.c: /tmp/ccBHY4QJ.s:1026: Warning: dwarf line number information for .data ignored
encrypt.c: /tmp/ccBHY4QJ.s:1028: Warning: dwarf line number information for .data ignored
encrypt.c: /tmp/ccBHY4QJ.s:1029: Warning: dwarf line number information for .data ignored
encrypt.c: /tmp/ccBHY4QJ.s:1030: Warning: dwarf line number information for .data ignored
encrypt.c: /tmp/ccBHY4QJ.s:1037: Warning: dwarf line number information for .data ignored
encrypt.c: /tmp/ccBHY4QJ.s:1044: Warning: dwarf line number information for .data ignored
encrypt.c: /tmp/ccBHY4QJ.s:1047: Warning: dwarf line number information for .data ignored
encrypt.c: /tmp/ccBHY4QJ.s:1050: Warning: dwarf line number information for .data ignored
encrypt.c: ...

Number of similar (implementation,compiler) pairs: 1, namely:
ImplementationCompiler
T:sse4gcc -march=native -mtune=native -O3 -fwrapv -fPIC -fPIE -gdwarf-4 -Wall (11.4.0)

Compiler output


encrypt.c: /tmp/ccqbGBUP.s: Assembler messages:
encrypt.c: /tmp/ccqbGBUP.s:960: Warning: dwarf line number information for .data ignored
encrypt.c: /tmp/ccqbGBUP.s:962: Warning: dwarf line number information for .data ignored
encrypt.c: /tmp/ccqbGBUP.s:974: Warning: dwarf line number information for .data ignored
encrypt.c: /tmp/ccqbGBUP.s:975: Warning: dwarf line number information for .data ignored
encrypt.c: /tmp/ccqbGBUP.s:976: Warning: dwarf line number information for .data ignored
encrypt.c: /tmp/ccqbGBUP.s:983: Warning: dwarf line number information for .data ignored
encrypt.c: /tmp/ccqbGBUP.s:986: Warning: dwarf line number information for .data ignored
encrypt.c: /tmp/ccqbGBUP.s:987: Warning: dwarf line number information for .data ignored
encrypt.c: /tmp/ccqbGBUP.s:992: Warning: dwarf line number information for .data ignored
encrypt.c: /tmp/ccqbGBUP.s:993: Warning: dwarf line number information for .data ignored
encrypt.c: /tmp/ccqbGBUP.s:996: Warning: dwarf line number information for .data ignored
encrypt.c: /tmp/ccqbGBUP.s:998: Warning: dwarf line number information for .data ignored
encrypt.c: /tmp/ccqbGBUP.s:1001: Warning: dwarf line number information for .data ignored
encrypt.c: /tmp/ccqbGBUP.s:1009: Warning: dwarf line number information for .data ignored
encrypt.c: /tmp/ccqbGBUP.s:1019: Warning: dwarf line number information for .data ignored
encrypt.c: /tmp/ccqbGBUP.s:1021: Warning: dwarf line number information for .data ignored
encrypt.c: /tmp/ccqbGBUP.s:1034: Warning: dwarf line number information for .data ignored
encrypt.c: /tmp/ccqbGBUP.s:1038: Warning: dwarf line number information for .data ignored
encrypt.c: /tmp/ccqbGBUP.s:1039: Warning: dwarf line number information for .data ignored
encrypt.c: /tmp/ccqbGBUP.s:1040: Warning: dwarf line number information for .data ignored
encrypt.c: /tmp/ccqbGBUP.s:1047: Warning: dwarf line number information for .data ignored
encrypt.c: /tmp/ccqbGBUP.s:1050: Warning: dwarf line number information for .data ignored
encrypt.c: /tmp/ccqbGBUP.s:1053: Warning: dwarf line number information for .data ignored
encrypt.c: /tmp/ccqbGBUP.s:1056: Warning: dwarf line number information for .data ignored
encrypt.c: ...

Number of similar (implementation,compiler) pairs: 1, namely:
ImplementationCompiler
T:sse4gcc -march=native -mtune=native -O -fwrapv -fPIC -fPIE -gdwarf-4 -Wall (11.4.0)

Compiler output


encrypt.c: /tmp/ccrkHIeT.s: Assembler messages:
encrypt.c: /tmp/ccrkHIeT.s:960: Warning: dwarf line number information for .data ignored
encrypt.c: /tmp/ccrkHIeT.s:962: Warning: dwarf line number information for .data ignored
encrypt.c: /tmp/ccrkHIeT.s:964: Warning: dwarf line number information for .data ignored
encrypt.c: /tmp/ccrkHIeT.s:965: Warning: dwarf line number information for .data ignored
encrypt.c: /tmp/ccrkHIeT.s:966: Warning: dwarf line number information for .data ignored
encrypt.c: /tmp/ccrkHIeT.s:977: Warning: dwarf line number information for .data ignored
encrypt.c: /tmp/ccrkHIeT.s:984: Warning: dwarf line number information for .data ignored
encrypt.c: /tmp/ccrkHIeT.s:987: Warning: dwarf line number information for .data ignored
encrypt.c: /tmp/ccrkHIeT.s:988: Warning: dwarf line number information for .data ignored
encrypt.c: /tmp/ccrkHIeT.s:995: Warning: dwarf line number information for .data ignored
encrypt.c: /tmp/ccrkHIeT.s:996: Warning: dwarf line number information for .data ignored
encrypt.c: /tmp/ccrkHIeT.s:999: Warning: dwarf line number information for .data ignored
encrypt.c: /tmp/ccrkHIeT.s:1001: Warning: dwarf line number information for .data ignored
encrypt.c: /tmp/ccrkHIeT.s:1004: Warning: dwarf line number information for .data ignored
encrypt.c: /tmp/ccrkHIeT.s:1012: Warning: dwarf line number information for .data ignored
encrypt.c: /tmp/ccrkHIeT.s:1022: Warning: dwarf line number information for .data ignored
encrypt.c: /tmp/ccrkHIeT.s:1024: Warning: dwarf line number information for .data ignored
encrypt.c: /tmp/ccrkHIeT.s:1026: Warning: dwarf line number information for .data ignored
encrypt.c: /tmp/ccrkHIeT.s:1027: Warning: dwarf line number information for .data ignored
encrypt.c: /tmp/ccrkHIeT.s:1028: Warning: dwarf line number information for .data ignored
encrypt.c: /tmp/ccrkHIeT.s:1035: Warning: dwarf line number information for .data ignored
encrypt.c: /tmp/ccrkHIeT.s:1042: Warning: dwarf line number information for .data ignored
encrypt.c: /tmp/ccrkHIeT.s:1045: Warning: dwarf line number information for .data ignored
encrypt.c: /tmp/ccrkHIeT.s:1048: Warning: dwarf line number information for .data ignored
encrypt.c: ...

Number of similar (implementation,compiler) pairs: 1, namely:
ImplementationCompiler
T:sse4gcc -march=native -mtune=native -Os -fwrapv -fPIC -fPIE -gdwarf-4 -Wall (11.4.0)

Namespace violations


omdsha256.o calc_L_i T
omdsha256.o double_block T
omdsha256.o final_masking_associated_data T
omdsha256.o final_masking_message T
omdsha256.o hash T
omdsha256.o increment_masking_associated_data T
omdsha256.o increment_masking_message T
omdsha256.o key_func T
omdsha256.o l2b T
omdsha256.o ntz T
omdsha256.o omdsha256_process T
omdsha256.o triple_block T
omdsha256.o xor_block T
sha256.o sha256_comp T

Number of similar (implementation,compiler) pairs: 9, namely:
ImplementationCompiler
T:refclang -march=native -O2 -fwrapv -Qunused-arguments -fPIC -fPIE -gdwarf-4 -Wall (Ubuntu_Clang_14.0.0)
T:refclang -march=native -O3 -fwrapv -Qunused-arguments -fPIC -fPIE -gdwarf-4 -Wall (Ubuntu_Clang_14.0.0)
T:refclang -march=native -O -fwrapv -Qunused-arguments -fPIC -fPIE -gdwarf-4 -Wall (Ubuntu_Clang_14.0.0)
T:refclang -march=native -Os -fwrapv -Qunused-arguments -fPIC -fPIE -gdwarf-4 -Wall (Ubuntu_Clang_14.0.0)
T:refclang -mcpu=native -O3 -fwrapv -Qunused-arguments -fPIC -fPIE -gdwarf-4 -Wall (Ubuntu_Clang_14.0.0)
T:refgcc -march=native -mtune=native -O2 -fwrapv -fPIC -fPIE -gdwarf-4 -Wall (11.4.0)
T:refgcc -march=native -mtune=native -O3 -fwrapv -fPIC -fPIE -gdwarf-4 -Wall (11.4.0)
T:refgcc -march=native -mtune=native -O -fwrapv -fPIC -fPIE -gdwarf-4 -Wall (11.4.0)
T:refgcc -march=native -mtune=native -Os -fwrapv -fPIC -fPIE -gdwarf-4 -Wall (11.4.0)