Test results for amd64, titan0, crypto_aead/omdsha256k128n96tau96v1

[Page version: 20250315 17:22:32]

Measurements for amd64, titan0, crypto_aead Test results for amd64, titan0, crypto_aead Test results for crypto_aead/omdsha256k128n96tau96v1
Computer: titan0
Microarchitecture: amd64; Haswell+AES (306c3)
Architecture: amd64
CPU ID: GenuineIntel-000306c3-bfebfbff
SUPERCOP version: 20250307
Operation: crypto_aead
Primitive: omdsha256k128n96tau96v1
TimeObject sizeTest sizeImplementationCompilerBenchmark dateSUPERCOP version
16683814802 0 038556 812 1088T:refgcc -march=native -mtune=native -O3 -fwrapv -fPIC -fPIE -gdwarf-4 -Wall2025031120250307
17724811789 0 035416 860 1056T:refclang -march=native -O2 -fwrapv -Qunused-arguments -fPIC -fPIE -gdwarf-4 -Wall2025031120250307
18078810877 0 034712 860 1056T:refclang -march=native -O3 -fwrapv -Qunused-arguments -fPIC -fPIE -gdwarf-4 -Wall2025031120250307
1942434587 0 025282 852 1088T:refclang -march=native -Os -fwrapv -Qunused-arguments -fPIC -fPIE -gdwarf-4 -Wall2025031120250307
1975626453 0 028164 812 1088T:refgcc -march=native -mtune=native -O2 -fwrapv -fPIC -fPIE -gdwarf-4 -Wall2025031120250307
2059886052 0 027195 804 1088T:refgcc -march=native -mtune=native -O -fwrapv -fPIC -fPIE -gdwarf-4 -Wall2025031120250307
2095965697 0 025584 860 1024T:refclang -march=native -O -fwrapv -Qunused-arguments -fPIC -fPIE -gdwarf-4 -Wall2025031120250307
21021112170 0 034432 860 1024T:refclang -mcpu=native -O3 -fwrapv -Qunused-arguments -fPIC -fPIE -gdwarf-4 -Wall2025031120250307
2190244619 0 024143 788 1056T:refgcc -march=native -mtune=native -Os -fwrapv -fPIC -fPIE -gdwarf-4 -Wall2025031120250307

Compiler output


try.c: /usr/bin/ld: libcrypto_aead_omdsha256k128n96tau96v1.a(omdsha256.o):.../supercop-data/titan0/amd64/try/c/clang_-march=native_-O2_-fwrapv_-Qunused-arguments_-fPIC_-fPIE_-gdwarf-4_-Wall/timingleaks/crypto_aead/omdsha256k128n96tau96v1/avx1/work/./omdsha256.h:137: multiple definition of `Hash'; libcrypto_aead_omdsha256k128n96tau96v1.a(encrypt.o):.../supercop-data/titan0/amd64/try/c/clang_-march=native_-O2_-fwrapv_-Qunused-arguments_-fPIC_-fPIE_-gdwarf-4_-Wall/timingleaks/crypto_aead/omdsha256k128n96tau96v1/avx1/work/./omdsha256.h:137: first defined here
try.c: clang: error: linker command failed with exit code 1 (use -v to see invocation)

Number of similar (implementation,compiler) pairs: 1, namely:
ImplementationCompiler
T:avx1clang -march=native -O2 -fwrapv -Qunused-arguments -fPIC -fPIE -gdwarf-4 -Wall (Ubuntu_Clang_14.0.0)

Compiler output


try.c: /usr/bin/ld: libcrypto_aead_omdsha256k128n96tau96v1.a(omdsha256.o):.../supercop-data/titan0/amd64/try/c/clang_-march=native_-O3_-fwrapv_-Qunused-arguments_-fPIC_-fPIE_-gdwarf-4_-Wall/timingleaks/crypto_aead/omdsha256k128n96tau96v1/avx1/work/./omdsha256.h:137: multiple definition of `Hash'; libcrypto_aead_omdsha256k128n96tau96v1.a(encrypt.o):.../supercop-data/titan0/amd64/try/c/clang_-march=native_-O3_-fwrapv_-Qunused-arguments_-fPIC_-fPIE_-gdwarf-4_-Wall/timingleaks/crypto_aead/omdsha256k128n96tau96v1/avx1/work/./omdsha256.h:137: first defined here
try.c: clang: error: linker command failed with exit code 1 (use -v to see invocation)

Number of similar (implementation,compiler) pairs: 1, namely:
ImplementationCompiler
T:avx1clang -march=native -O3 -fwrapv -Qunused-arguments -fPIC -fPIE -gdwarf-4 -Wall (Ubuntu_Clang_14.0.0)

Compiler output


try.c: /usr/bin/ld: libcrypto_aead_omdsha256k128n96tau96v1.a(omdsha256.o):.../supercop-data/titan0/amd64/try/c/clang_-march=native_-O_-fwrapv_-Qunused-arguments_-fPIC_-fPIE_-gdwarf-4_-Wall/timingleaks/crypto_aead/omdsha256k128n96tau96v1/avx1/work/./omdsha256.h:137: multiple definition of `Hash'; libcrypto_aead_omdsha256k128n96tau96v1.a(encrypt.o):.../supercop-data/titan0/amd64/try/c/clang_-march=native_-O_-fwrapv_-Qunused-arguments_-fPIC_-fPIE_-gdwarf-4_-Wall/timingleaks/crypto_aead/omdsha256k128n96tau96v1/avx1/work/./omdsha256.h:137: first defined here
try.c: clang: error: linker command failed with exit code 1 (use -v to see invocation)

Number of similar (implementation,compiler) pairs: 1, namely:
ImplementationCompiler
T:avx1clang -march=native -O -fwrapv -Qunused-arguments -fPIC -fPIE -gdwarf-4 -Wall (Ubuntu_Clang_14.0.0)

Compiler output


try.c: /usr/bin/ld: libcrypto_aead_omdsha256k128n96tau96v1.a(omdsha256.o):.../supercop-data/titan0/amd64/try/c/clang_-march=native_-Os_-fwrapv_-Qunused-arguments_-fPIC_-fPIE_-gdwarf-4_-Wall/timingleaks/crypto_aead/omdsha256k128n96tau96v1/avx1/work/./omdsha256.h:137: multiple definition of `Hash'; libcrypto_aead_omdsha256k128n96tau96v1.a(encrypt.o):.../supercop-data/titan0/amd64/try/c/clang_-march=native_-Os_-fwrapv_-Qunused-arguments_-fPIC_-fPIE_-gdwarf-4_-Wall/timingleaks/crypto_aead/omdsha256k128n96tau96v1/avx1/work/./omdsha256.h:137: first defined here
try.c: clang: error: linker command failed with exit code 1 (use -v to see invocation)

Number of similar (implementation,compiler) pairs: 1, namely:
ImplementationCompiler
T:avx1clang -march=native -Os -fwrapv -Qunused-arguments -fPIC -fPIE -gdwarf-4 -Wall (Ubuntu_Clang_14.0.0)

Compiler output


try.c: /usr/bin/ld: libcrypto_aead_omdsha256k128n96tau96v1.a(omdsha256.o):.../supercop-data/titan0/amd64/try/c/clang_-mcpu=native_-O3_-fwrapv_-Qunused-arguments_-fPIC_-fPIE_-gdwarf-4_-Wall/timingleaks/crypto_aead/omdsha256k128n96tau96v1/avx1/work/./omdsha256.h:137: multiple definition of `Hash'; libcrypto_aead_omdsha256k128n96tau96v1.a(encrypt.o):.../supercop-data/titan0/amd64/try/c/clang_-mcpu=native_-O3_-fwrapv_-Qunused-arguments_-fPIC_-fPIE_-gdwarf-4_-Wall/timingleaks/crypto_aead/omdsha256k128n96tau96v1/avx1/work/./omdsha256.h:137: first defined here
try.c: clang: error: linker command failed with exit code 1 (use -v to see invocation)

Number of similar (implementation,compiler) pairs: 1, namely:
ImplementationCompiler
T:avx1clang -mcpu=native -O3 -fwrapv -Qunused-arguments -fPIC -fPIE -gdwarf-4 -Wall (Ubuntu_Clang_14.0.0)

Compiler output


encrypt.c: /tmp/ccez1sSU.s: Assembler messages:
encrypt.c: /tmp/ccez1sSU.s:922: Warning: dwarf line number information for .data ignored
encrypt.c: /tmp/ccez1sSU.s:924: Warning: dwarf line number information for .data ignored
encrypt.c: /tmp/ccez1sSU.s:926: Warning: dwarf line number information for .data ignored
encrypt.c: /tmp/ccez1sSU.s:927: Warning: dwarf line number information for .data ignored
encrypt.c: /tmp/ccez1sSU.s:928: Warning: dwarf line number information for .data ignored
encrypt.c: /tmp/ccez1sSU.s:939: Warning: dwarf line number information for .data ignored
encrypt.c: /tmp/ccez1sSU.s:946: Warning: dwarf line number information for .data ignored
encrypt.c: /tmp/ccez1sSU.s:949: Warning: dwarf line number information for .data ignored
encrypt.c: /tmp/ccez1sSU.s:950: Warning: dwarf line number information for .data ignored
encrypt.c: /tmp/ccez1sSU.s:957: Warning: dwarf line number information for .data ignored
encrypt.c: /tmp/ccez1sSU.s:958: Warning: dwarf line number information for .data ignored
encrypt.c: /tmp/ccez1sSU.s:961: Warning: dwarf line number information for .data ignored
encrypt.c: /tmp/ccez1sSU.s:963: Warning: dwarf line number information for .data ignored
encrypt.c: /tmp/ccez1sSU.s:966: Warning: dwarf line number information for .data ignored
encrypt.c: /tmp/ccez1sSU.s:974: Warning: dwarf line number information for .data ignored
encrypt.c: /tmp/ccez1sSU.s:985: Warning: dwarf line number information for .data ignored
encrypt.c: /tmp/ccez1sSU.s:987: Warning: dwarf line number information for .data ignored
encrypt.c: /tmp/ccez1sSU.s:989: Warning: dwarf line number information for .data ignored
encrypt.c: /tmp/ccez1sSU.s:990: Warning: dwarf line number information for .data ignored
encrypt.c: /tmp/ccez1sSU.s:991: Warning: dwarf line number information for .data ignored
encrypt.c: /tmp/ccez1sSU.s:998: Warning: dwarf line number information for .data ignored
encrypt.c: /tmp/ccez1sSU.s:1005: Warning: dwarf line number information for .data ignored
encrypt.c: /tmp/ccez1sSU.s:1008: Warning: dwarf line number information for .data ignored
encrypt.c: /tmp/ccez1sSU.s:1011: Warning: dwarf line number information for .data ignored
encrypt.c: ...

Number of similar (implementation,compiler) pairs: 1, namely:
ImplementationCompiler
T:avx1gcc -march=native -mtune=native -O2 -fwrapv -fPIC -fPIE -gdwarf-4 -Wall (11.4.0)

Compiler output


encrypt.c: /tmp/cc0sks5n.s: Assembler messages:
encrypt.c: /tmp/cc0sks5n.s:922: Warning: dwarf line number information for .data ignored
encrypt.c: /tmp/cc0sks5n.s:924: Warning: dwarf line number information for .data ignored
encrypt.c: /tmp/cc0sks5n.s:926: Warning: dwarf line number information for .data ignored
encrypt.c: /tmp/cc0sks5n.s:927: Warning: dwarf line number information for .data ignored
encrypt.c: /tmp/cc0sks5n.s:928: Warning: dwarf line number information for .data ignored
encrypt.c: /tmp/cc0sks5n.s:939: Warning: dwarf line number information for .data ignored
encrypt.c: /tmp/cc0sks5n.s:946: Warning: dwarf line number information for .data ignored
encrypt.c: /tmp/cc0sks5n.s:949: Warning: dwarf line number information for .data ignored
encrypt.c: /tmp/cc0sks5n.s:950: Warning: dwarf line number information for .data ignored
encrypt.c: /tmp/cc0sks5n.s:957: Warning: dwarf line number information for .data ignored
encrypt.c: /tmp/cc0sks5n.s:958: Warning: dwarf line number information for .data ignored
encrypt.c: /tmp/cc0sks5n.s:961: Warning: dwarf line number information for .data ignored
encrypt.c: /tmp/cc0sks5n.s:963: Warning: dwarf line number information for .data ignored
encrypt.c: /tmp/cc0sks5n.s:966: Warning: dwarf line number information for .data ignored
encrypt.c: /tmp/cc0sks5n.s:974: Warning: dwarf line number information for .data ignored
encrypt.c: /tmp/cc0sks5n.s:985: Warning: dwarf line number information for .data ignored
encrypt.c: /tmp/cc0sks5n.s:987: Warning: dwarf line number information for .data ignored
encrypt.c: /tmp/cc0sks5n.s:989: Warning: dwarf line number information for .data ignored
encrypt.c: /tmp/cc0sks5n.s:990: Warning: dwarf line number information for .data ignored
encrypt.c: /tmp/cc0sks5n.s:991: Warning: dwarf line number information for .data ignored
encrypt.c: /tmp/cc0sks5n.s:998: Warning: dwarf line number information for .data ignored
encrypt.c: /tmp/cc0sks5n.s:1005: Warning: dwarf line number information for .data ignored
encrypt.c: /tmp/cc0sks5n.s:1008: Warning: dwarf line number information for .data ignored
encrypt.c: /tmp/cc0sks5n.s:1011: Warning: dwarf line number information for .data ignored
encrypt.c: ...

Number of similar (implementation,compiler) pairs: 1, namely:
ImplementationCompiler
T:avx1gcc -march=native -mtune=native -O3 -fwrapv -fPIC -fPIE -gdwarf-4 -Wall (11.4.0)

Compiler output


encrypt.c: /tmp/ccniwXDu.s: Assembler messages:
encrypt.c: /tmp/ccniwXDu.s:921: Warning: dwarf line number information for .data ignored
encrypt.c: /tmp/ccniwXDu.s:923: Warning: dwarf line number information for .data ignored
encrypt.c: /tmp/ccniwXDu.s:935: Warning: dwarf line number information for .data ignored
encrypt.c: /tmp/ccniwXDu.s:936: Warning: dwarf line number information for .data ignored
encrypt.c: /tmp/ccniwXDu.s:937: Warning: dwarf line number information for .data ignored
encrypt.c: /tmp/ccniwXDu.s:944: Warning: dwarf line number information for .data ignored
encrypt.c: /tmp/ccniwXDu.s:947: Warning: dwarf line number information for .data ignored
encrypt.c: /tmp/ccniwXDu.s:948: Warning: dwarf line number information for .data ignored
encrypt.c: /tmp/ccniwXDu.s:953: Warning: dwarf line number information for .data ignored
encrypt.c: /tmp/ccniwXDu.s:954: Warning: dwarf line number information for .data ignored
encrypt.c: /tmp/ccniwXDu.s:957: Warning: dwarf line number information for .data ignored
encrypt.c: /tmp/ccniwXDu.s:959: Warning: dwarf line number information for .data ignored
encrypt.c: /tmp/ccniwXDu.s:962: Warning: dwarf line number information for .data ignored
encrypt.c: /tmp/ccniwXDu.s:970: Warning: dwarf line number information for .data ignored
encrypt.c: /tmp/ccniwXDu.s:980: Warning: dwarf line number information for .data ignored
encrypt.c: /tmp/ccniwXDu.s:982: Warning: dwarf line number information for .data ignored
encrypt.c: /tmp/ccniwXDu.s:995: Warning: dwarf line number information for .data ignored
encrypt.c: /tmp/ccniwXDu.s:999: Warning: dwarf line number information for .data ignored
encrypt.c: /tmp/ccniwXDu.s:1000: Warning: dwarf line number information for .data ignored
encrypt.c: /tmp/ccniwXDu.s:1001: Warning: dwarf line number information for .data ignored
encrypt.c: /tmp/ccniwXDu.s:1008: Warning: dwarf line number information for .data ignored
encrypt.c: /tmp/ccniwXDu.s:1011: Warning: dwarf line number information for .data ignored
encrypt.c: /tmp/ccniwXDu.s:1014: Warning: dwarf line number information for .data ignored
encrypt.c: /tmp/ccniwXDu.s:1017: Warning: dwarf line number information for .data ignored
encrypt.c: ...

Number of similar (implementation,compiler) pairs: 1, namely:
ImplementationCompiler
T:avx1gcc -march=native -mtune=native -O -fwrapv -fPIC -fPIE -gdwarf-4 -Wall (11.4.0)

Compiler output


encrypt.c: /tmp/cc1Y8pRb.s: Assembler messages:
encrypt.c: /tmp/cc1Y8pRb.s:921: Warning: dwarf line number information for .data ignored
encrypt.c: /tmp/cc1Y8pRb.s:923: Warning: dwarf line number information for .data ignored
encrypt.c: /tmp/cc1Y8pRb.s:925: Warning: dwarf line number information for .data ignored
encrypt.c: /tmp/cc1Y8pRb.s:926: Warning: dwarf line number information for .data ignored
encrypt.c: /tmp/cc1Y8pRb.s:927: Warning: dwarf line number information for .data ignored
encrypt.c: /tmp/cc1Y8pRb.s:938: Warning: dwarf line number information for .data ignored
encrypt.c: /tmp/cc1Y8pRb.s:945: Warning: dwarf line number information for .data ignored
encrypt.c: /tmp/cc1Y8pRb.s:948: Warning: dwarf line number information for .data ignored
encrypt.c: /tmp/cc1Y8pRb.s:949: Warning: dwarf line number information for .data ignored
encrypt.c: /tmp/cc1Y8pRb.s:956: Warning: dwarf line number information for .data ignored
encrypt.c: /tmp/cc1Y8pRb.s:957: Warning: dwarf line number information for .data ignored
encrypt.c: /tmp/cc1Y8pRb.s:960: Warning: dwarf line number information for .data ignored
encrypt.c: /tmp/cc1Y8pRb.s:962: Warning: dwarf line number information for .data ignored
encrypt.c: /tmp/cc1Y8pRb.s:965: Warning: dwarf line number information for .data ignored
encrypt.c: /tmp/cc1Y8pRb.s:973: Warning: dwarf line number information for .data ignored
encrypt.c: /tmp/cc1Y8pRb.s:983: Warning: dwarf line number information for .data ignored
encrypt.c: /tmp/cc1Y8pRb.s:985: Warning: dwarf line number information for .data ignored
encrypt.c: /tmp/cc1Y8pRb.s:987: Warning: dwarf line number information for .data ignored
encrypt.c: /tmp/cc1Y8pRb.s:988: Warning: dwarf line number information for .data ignored
encrypt.c: /tmp/cc1Y8pRb.s:989: Warning: dwarf line number information for .data ignored
encrypt.c: /tmp/cc1Y8pRb.s:996: Warning: dwarf line number information for .data ignored
encrypt.c: /tmp/cc1Y8pRb.s:1003: Warning: dwarf line number information for .data ignored
encrypt.c: /tmp/cc1Y8pRb.s:1006: Warning: dwarf line number information for .data ignored
encrypt.c: /tmp/cc1Y8pRb.s:1009: Warning: dwarf line number information for .data ignored
encrypt.c: ...

Number of similar (implementation,compiler) pairs: 1, namely:
ImplementationCompiler
T:avx1gcc -march=native -mtune=native -Os -fwrapv -fPIC -fPIE -gdwarf-4 -Wall (11.4.0)

Compiler output


try.c: /usr/bin/ld: libcrypto_aead_omdsha256k128n96tau96v1.a(omdsha256.o):.../supercop-data/titan0/amd64/try/c/clang_-march=native_-O2_-fwrapv_-Qunused-arguments_-fPIC_-fPIE_-gdwarf-4_-Wall/timingleaks/crypto_aead/omdsha256k128n96tau96v1/sse4/work/./omdsha256.h:137: multiple definition of `Hash'; libcrypto_aead_omdsha256k128n96tau96v1.a(encrypt.o):.../supercop-data/titan0/amd64/try/c/clang_-march=native_-O2_-fwrapv_-Qunused-arguments_-fPIC_-fPIE_-gdwarf-4_-Wall/timingleaks/crypto_aead/omdsha256k128n96tau96v1/sse4/work/./omdsha256.h:137: first defined here
try.c: clang: error: linker command failed with exit code 1 (use -v to see invocation)

Number of similar (implementation,compiler) pairs: 1, namely:
ImplementationCompiler
T:sse4clang -march=native -O2 -fwrapv -Qunused-arguments -fPIC -fPIE -gdwarf-4 -Wall (Ubuntu_Clang_14.0.0)

Compiler output


try.c: /usr/bin/ld: libcrypto_aead_omdsha256k128n96tau96v1.a(omdsha256.o):.../supercop-data/titan0/amd64/try/c/clang_-march=native_-O3_-fwrapv_-Qunused-arguments_-fPIC_-fPIE_-gdwarf-4_-Wall/timingleaks/crypto_aead/omdsha256k128n96tau96v1/sse4/work/./omdsha256.h:137: multiple definition of `Hash'; libcrypto_aead_omdsha256k128n96tau96v1.a(encrypt.o):.../supercop-data/titan0/amd64/try/c/clang_-march=native_-O3_-fwrapv_-Qunused-arguments_-fPIC_-fPIE_-gdwarf-4_-Wall/timingleaks/crypto_aead/omdsha256k128n96tau96v1/sse4/work/./omdsha256.h:137: first defined here
try.c: clang: error: linker command failed with exit code 1 (use -v to see invocation)

Number of similar (implementation,compiler) pairs: 1, namely:
ImplementationCompiler
T:sse4clang -march=native -O3 -fwrapv -Qunused-arguments -fPIC -fPIE -gdwarf-4 -Wall (Ubuntu_Clang_14.0.0)

Compiler output


try.c: /usr/bin/ld: libcrypto_aead_omdsha256k128n96tau96v1.a(omdsha256.o):.../supercop-data/titan0/amd64/try/c/clang_-march=native_-O_-fwrapv_-Qunused-arguments_-fPIC_-fPIE_-gdwarf-4_-Wall/timingleaks/crypto_aead/omdsha256k128n96tau96v1/sse4/work/./omdsha256.h:137: multiple definition of `Hash'; libcrypto_aead_omdsha256k128n96tau96v1.a(encrypt.o):.../supercop-data/titan0/amd64/try/c/clang_-march=native_-O_-fwrapv_-Qunused-arguments_-fPIC_-fPIE_-gdwarf-4_-Wall/timingleaks/crypto_aead/omdsha256k128n96tau96v1/sse4/work/./omdsha256.h:137: first defined here
try.c: clang: error: linker command failed with exit code 1 (use -v to see invocation)

Number of similar (implementation,compiler) pairs: 1, namely:
ImplementationCompiler
T:sse4clang -march=native -O -fwrapv -Qunused-arguments -fPIC -fPIE -gdwarf-4 -Wall (Ubuntu_Clang_14.0.0)

Compiler output


try.c: /usr/bin/ld: libcrypto_aead_omdsha256k128n96tau96v1.a(omdsha256.o):.../supercop-data/titan0/amd64/try/c/clang_-march=native_-Os_-fwrapv_-Qunused-arguments_-fPIC_-fPIE_-gdwarf-4_-Wall/timingleaks/crypto_aead/omdsha256k128n96tau96v1/sse4/work/./omdsha256.h:137: multiple definition of `Hash'; libcrypto_aead_omdsha256k128n96tau96v1.a(encrypt.o):.../supercop-data/titan0/amd64/try/c/clang_-march=native_-Os_-fwrapv_-Qunused-arguments_-fPIC_-fPIE_-gdwarf-4_-Wall/timingleaks/crypto_aead/omdsha256k128n96tau96v1/sse4/work/./omdsha256.h:137: first defined here
try.c: clang: error: linker command failed with exit code 1 (use -v to see invocation)

Number of similar (implementation,compiler) pairs: 1, namely:
ImplementationCompiler
T:sse4clang -march=native -Os -fwrapv -Qunused-arguments -fPIC -fPIE -gdwarf-4 -Wall (Ubuntu_Clang_14.0.0)

Compiler output


try.c: /usr/bin/ld: libcrypto_aead_omdsha256k128n96tau96v1.a(omdsha256.o):.../supercop-data/titan0/amd64/try/c/clang_-mcpu=native_-O3_-fwrapv_-Qunused-arguments_-fPIC_-fPIE_-gdwarf-4_-Wall/timingleaks/crypto_aead/omdsha256k128n96tau96v1/sse4/work/./omdsha256.h:137: multiple definition of `Hash'; libcrypto_aead_omdsha256k128n96tau96v1.a(encrypt.o):.../supercop-data/titan0/amd64/try/c/clang_-mcpu=native_-O3_-fwrapv_-Qunused-arguments_-fPIC_-fPIE_-gdwarf-4_-Wall/timingleaks/crypto_aead/omdsha256k128n96tau96v1/sse4/work/./omdsha256.h:137: first defined here
try.c: clang: error: linker command failed with exit code 1 (use -v to see invocation)

Number of similar (implementation,compiler) pairs: 1, namely:
ImplementationCompiler
T:sse4clang -mcpu=native -O3 -fwrapv -Qunused-arguments -fPIC -fPIE -gdwarf-4 -Wall (Ubuntu_Clang_14.0.0)

Compiler output


encrypt.c: /tmp/ccCRUzpw.s: Assembler messages:
encrypt.c: /tmp/ccCRUzpw.s:961: Warning: dwarf line number information for .data ignored
encrypt.c: /tmp/ccCRUzpw.s:963: Warning: dwarf line number information for .data ignored
encrypt.c: /tmp/ccCRUzpw.s:965: Warning: dwarf line number information for .data ignored
encrypt.c: /tmp/ccCRUzpw.s:966: Warning: dwarf line number information for .data ignored
encrypt.c: /tmp/ccCRUzpw.s:967: Warning: dwarf line number information for .data ignored
encrypt.c: /tmp/ccCRUzpw.s:978: Warning: dwarf line number information for .data ignored
encrypt.c: /tmp/ccCRUzpw.s:985: Warning: dwarf line number information for .data ignored
encrypt.c: /tmp/ccCRUzpw.s:988: Warning: dwarf line number information for .data ignored
encrypt.c: /tmp/ccCRUzpw.s:989: Warning: dwarf line number information for .data ignored
encrypt.c: /tmp/ccCRUzpw.s:996: Warning: dwarf line number information for .data ignored
encrypt.c: /tmp/ccCRUzpw.s:997: Warning: dwarf line number information for .data ignored
encrypt.c: /tmp/ccCRUzpw.s:1000: Warning: dwarf line number information for .data ignored
encrypt.c: /tmp/ccCRUzpw.s:1002: Warning: dwarf line number information for .data ignored
encrypt.c: /tmp/ccCRUzpw.s:1005: Warning: dwarf line number information for .data ignored
encrypt.c: /tmp/ccCRUzpw.s:1013: Warning: dwarf line number information for .data ignored
encrypt.c: /tmp/ccCRUzpw.s:1024: Warning: dwarf line number information for .data ignored
encrypt.c: /tmp/ccCRUzpw.s:1026: Warning: dwarf line number information for .data ignored
encrypt.c: /tmp/ccCRUzpw.s:1028: Warning: dwarf line number information for .data ignored
encrypt.c: /tmp/ccCRUzpw.s:1029: Warning: dwarf line number information for .data ignored
encrypt.c: /tmp/ccCRUzpw.s:1030: Warning: dwarf line number information for .data ignored
encrypt.c: /tmp/ccCRUzpw.s:1037: Warning: dwarf line number information for .data ignored
encrypt.c: /tmp/ccCRUzpw.s:1044: Warning: dwarf line number information for .data ignored
encrypt.c: /tmp/ccCRUzpw.s:1047: Warning: dwarf line number information for .data ignored
encrypt.c: /tmp/ccCRUzpw.s:1050: Warning: dwarf line number information for .data ignored
encrypt.c: ...

Number of similar (implementation,compiler) pairs: 1, namely:
ImplementationCompiler
T:sse4gcc -march=native -mtune=native -O2 -fwrapv -fPIC -fPIE -gdwarf-4 -Wall (11.4.0)

Compiler output


encrypt.c: /tmp/ccpbJtfX.s: Assembler messages:
encrypt.c: /tmp/ccpbJtfX.s:961: Warning: dwarf line number information for .data ignored
encrypt.c: /tmp/ccpbJtfX.s:963: Warning: dwarf line number information for .data ignored
encrypt.c: /tmp/ccpbJtfX.s:965: Warning: dwarf line number information for .data ignored
encrypt.c: /tmp/ccpbJtfX.s:966: Warning: dwarf line number information for .data ignored
encrypt.c: /tmp/ccpbJtfX.s:967: Warning: dwarf line number information for .data ignored
encrypt.c: /tmp/ccpbJtfX.s:978: Warning: dwarf line number information for .data ignored
encrypt.c: /tmp/ccpbJtfX.s:985: Warning: dwarf line number information for .data ignored
encrypt.c: /tmp/ccpbJtfX.s:988: Warning: dwarf line number information for .data ignored
encrypt.c: /tmp/ccpbJtfX.s:989: Warning: dwarf line number information for .data ignored
encrypt.c: /tmp/ccpbJtfX.s:996: Warning: dwarf line number information for .data ignored
encrypt.c: /tmp/ccpbJtfX.s:997: Warning: dwarf line number information for .data ignored
encrypt.c: /tmp/ccpbJtfX.s:1000: Warning: dwarf line number information for .data ignored
encrypt.c: /tmp/ccpbJtfX.s:1002: Warning: dwarf line number information for .data ignored
encrypt.c: /tmp/ccpbJtfX.s:1005: Warning: dwarf line number information for .data ignored
encrypt.c: /tmp/ccpbJtfX.s:1013: Warning: dwarf line number information for .data ignored
encrypt.c: /tmp/ccpbJtfX.s:1024: Warning: dwarf line number information for .data ignored
encrypt.c: /tmp/ccpbJtfX.s:1026: Warning: dwarf line number information for .data ignored
encrypt.c: /tmp/ccpbJtfX.s:1028: Warning: dwarf line number information for .data ignored
encrypt.c: /tmp/ccpbJtfX.s:1029: Warning: dwarf line number information for .data ignored
encrypt.c: /tmp/ccpbJtfX.s:1030: Warning: dwarf line number information for .data ignored
encrypt.c: /tmp/ccpbJtfX.s:1037: Warning: dwarf line number information for .data ignored
encrypt.c: /tmp/ccpbJtfX.s:1044: Warning: dwarf line number information for .data ignored
encrypt.c: /tmp/ccpbJtfX.s:1047: Warning: dwarf line number information for .data ignored
encrypt.c: /tmp/ccpbJtfX.s:1050: Warning: dwarf line number information for .data ignored
encrypt.c: ...

Number of similar (implementation,compiler) pairs: 1, namely:
ImplementationCompiler
T:sse4gcc -march=native -mtune=native -O3 -fwrapv -fPIC -fPIE -gdwarf-4 -Wall (11.4.0)

Compiler output


encrypt.c: /tmp/ccLhnjkd.s: Assembler messages:
encrypt.c: /tmp/ccLhnjkd.s:960: Warning: dwarf line number information for .data ignored
encrypt.c: /tmp/ccLhnjkd.s:962: Warning: dwarf line number information for .data ignored
encrypt.c: /tmp/ccLhnjkd.s:974: Warning: dwarf line number information for .data ignored
encrypt.c: /tmp/ccLhnjkd.s:975: Warning: dwarf line number information for .data ignored
encrypt.c: /tmp/ccLhnjkd.s:976: Warning: dwarf line number information for .data ignored
encrypt.c: /tmp/ccLhnjkd.s:983: Warning: dwarf line number information for .data ignored
encrypt.c: /tmp/ccLhnjkd.s:986: Warning: dwarf line number information for .data ignored
encrypt.c: /tmp/ccLhnjkd.s:987: Warning: dwarf line number information for .data ignored
encrypt.c: /tmp/ccLhnjkd.s:992: Warning: dwarf line number information for .data ignored
encrypt.c: /tmp/ccLhnjkd.s:993: Warning: dwarf line number information for .data ignored
encrypt.c: /tmp/ccLhnjkd.s:996: Warning: dwarf line number information for .data ignored
encrypt.c: /tmp/ccLhnjkd.s:998: Warning: dwarf line number information for .data ignored
encrypt.c: /tmp/ccLhnjkd.s:1001: Warning: dwarf line number information for .data ignored
encrypt.c: /tmp/ccLhnjkd.s:1009: Warning: dwarf line number information for .data ignored
encrypt.c: /tmp/ccLhnjkd.s:1019: Warning: dwarf line number information for .data ignored
encrypt.c: /tmp/ccLhnjkd.s:1021: Warning: dwarf line number information for .data ignored
encrypt.c: /tmp/ccLhnjkd.s:1034: Warning: dwarf line number information for .data ignored
encrypt.c: /tmp/ccLhnjkd.s:1038: Warning: dwarf line number information for .data ignored
encrypt.c: /tmp/ccLhnjkd.s:1039: Warning: dwarf line number information for .data ignored
encrypt.c: /tmp/ccLhnjkd.s:1040: Warning: dwarf line number information for .data ignored
encrypt.c: /tmp/ccLhnjkd.s:1047: Warning: dwarf line number information for .data ignored
encrypt.c: /tmp/ccLhnjkd.s:1050: Warning: dwarf line number information for .data ignored
encrypt.c: /tmp/ccLhnjkd.s:1053: Warning: dwarf line number information for .data ignored
encrypt.c: /tmp/ccLhnjkd.s:1056: Warning: dwarf line number information for .data ignored
encrypt.c: ...

Number of similar (implementation,compiler) pairs: 1, namely:
ImplementationCompiler
T:sse4gcc -march=native -mtune=native -O -fwrapv -fPIC -fPIE -gdwarf-4 -Wall (11.4.0)

Compiler output


encrypt.c: /tmp/ccerNTq3.s: Assembler messages:
encrypt.c: /tmp/ccerNTq3.s:960: Warning: dwarf line number information for .data ignored
encrypt.c: /tmp/ccerNTq3.s:962: Warning: dwarf line number information for .data ignored
encrypt.c: /tmp/ccerNTq3.s:964: Warning: dwarf line number information for .data ignored
encrypt.c: /tmp/ccerNTq3.s:965: Warning: dwarf line number information for .data ignored
encrypt.c: /tmp/ccerNTq3.s:966: Warning: dwarf line number information for .data ignored
encrypt.c: /tmp/ccerNTq3.s:977: Warning: dwarf line number information for .data ignored
encrypt.c: /tmp/ccerNTq3.s:984: Warning: dwarf line number information for .data ignored
encrypt.c: /tmp/ccerNTq3.s:987: Warning: dwarf line number information for .data ignored
encrypt.c: /tmp/ccerNTq3.s:988: Warning: dwarf line number information for .data ignored
encrypt.c: /tmp/ccerNTq3.s:995: Warning: dwarf line number information for .data ignored
encrypt.c: /tmp/ccerNTq3.s:996: Warning: dwarf line number information for .data ignored
encrypt.c: /tmp/ccerNTq3.s:999: Warning: dwarf line number information for .data ignored
encrypt.c: /tmp/ccerNTq3.s:1001: Warning: dwarf line number information for .data ignored
encrypt.c: /tmp/ccerNTq3.s:1004: Warning: dwarf line number information for .data ignored
encrypt.c: /tmp/ccerNTq3.s:1012: Warning: dwarf line number information for .data ignored
encrypt.c: /tmp/ccerNTq3.s:1022: Warning: dwarf line number information for .data ignored
encrypt.c: /tmp/ccerNTq3.s:1024: Warning: dwarf line number information for .data ignored
encrypt.c: /tmp/ccerNTq3.s:1026: Warning: dwarf line number information for .data ignored
encrypt.c: /tmp/ccerNTq3.s:1027: Warning: dwarf line number information for .data ignored
encrypt.c: /tmp/ccerNTq3.s:1028: Warning: dwarf line number information for .data ignored
encrypt.c: /tmp/ccerNTq3.s:1035: Warning: dwarf line number information for .data ignored
encrypt.c: /tmp/ccerNTq3.s:1042: Warning: dwarf line number information for .data ignored
encrypt.c: /tmp/ccerNTq3.s:1045: Warning: dwarf line number information for .data ignored
encrypt.c: /tmp/ccerNTq3.s:1048: Warning: dwarf line number information for .data ignored
encrypt.c: ...

Number of similar (implementation,compiler) pairs: 1, namely:
ImplementationCompiler
T:sse4gcc -march=native -mtune=native -Os -fwrapv -fPIC -fPIE -gdwarf-4 -Wall (11.4.0)

Namespace violations


omdsha256.o calc_L_i T
omdsha256.o double_block T
omdsha256.o final_masking_associated_data T
omdsha256.o final_masking_message T
omdsha256.o hash T
omdsha256.o increment_masking_associated_data T
omdsha256.o increment_masking_message T
omdsha256.o key_func T
omdsha256.o l2b T
omdsha256.o ntz T
omdsha256.o omdsha256_process T
omdsha256.o triple_block T
omdsha256.o xor_block T
sha256.o sha256_comp T

Number of similar (implementation,compiler) pairs: 9, namely:
ImplementationCompiler
T:refclang -march=native -O2 -fwrapv -Qunused-arguments -fPIC -fPIE -gdwarf-4 -Wall (Ubuntu_Clang_14.0.0)
T:refclang -march=native -O3 -fwrapv -Qunused-arguments -fPIC -fPIE -gdwarf-4 -Wall (Ubuntu_Clang_14.0.0)
T:refclang -march=native -O -fwrapv -Qunused-arguments -fPIC -fPIE -gdwarf-4 -Wall (Ubuntu_Clang_14.0.0)
T:refclang -march=native -Os -fwrapv -Qunused-arguments -fPIC -fPIE -gdwarf-4 -Wall (Ubuntu_Clang_14.0.0)
T:refclang -mcpu=native -O3 -fwrapv -Qunused-arguments -fPIC -fPIE -gdwarf-4 -Wall (Ubuntu_Clang_14.0.0)
T:refgcc -march=native -mtune=native -O2 -fwrapv -fPIC -fPIE -gdwarf-4 -Wall (11.4.0)
T:refgcc -march=native -mtune=native -O3 -fwrapv -fPIC -fPIE -gdwarf-4 -Wall (11.4.0)
T:refgcc -march=native -mtune=native -O -fwrapv -fPIC -fPIE -gdwarf-4 -Wall (11.4.0)
T:refgcc -march=native -mtune=native -Os -fwrapv -fPIC -fPIE -gdwarf-4 -Wall (11.4.0)