Implementation notes: amd64, titan0, crypto_aead/morus1280128v1

Computer: titan0
Microarchitecture: amd64; Haswell+AES (306c3)
Architecture: amd64
CPU ID: GenuineIntel-000306c3-bfebfbff
SUPERCOP version: 20240425
Operation: crypto_aead
Primitive: morus1280128v1
TimeObject sizeTest sizeImplementationCompilerBenchmark dateSUPERCOP version
49355757 0 023472 860 1056T:avx2clang_-march=native_-O2_-fomit-frame-pointer_-fwrapv_-Qunused-arguments_-fPIC_-fPIE2024042620240425
49375757 0 023752 860 1056T:avx2clang_-march=native_-O3_-fomit-frame-pointer_-fwrapv_-Qunused-arguments_-fPIC_-fPIE2024042620240425
50226612 0 020496 860 1024T:avx2clang_-march=native_-O_-fomit-frame-pointer_-fwrapv_-Qunused-arguments_-fPIC_-fPIE2024042620240425
51024449 0 019098 852 1088T:avx2clang_-march=native_-Os_-fomit-frame-pointer_-fwrapv_-Qunused-arguments_-fPIC_-fPIE2024042620240425
53805974 0 023292 812 1088T:avx2gcc_-march=native_-mtune=native_-O3_-fomit-frame-pointer_-fwrapv_-fPIC_-fPIE2024042620240425
55493812 0 019116 812 1088T:avx2gcc_-march=native_-mtune=native_-O2_-fomit-frame-pointer_-fwrapv_-fPIC_-fPIE2024042620240425
55983824 0 018836 812 1088T:avx2gcc_-march=native_-mtune=native_-O_-fomit-frame-pointer_-fwrapv_-fPIC_-fPIE2024042620240425
68046790 0 021402 852 1088T:sse2clang_-march=native_-Os_-fomit-frame-pointer_-fwrapv_-Qunused-arguments_-fPIC_-fPIE2024042620240425
726010228 0 027912 860 1056T:sse2clang_-march=native_-O2_-fomit-frame-pointer_-fwrapv_-Qunused-arguments_-fPIC_-fPIE2024042620240425
740410260 0 028224 860 1056T:sse2clang_-march=native_-O3_-fomit-frame-pointer_-fwrapv_-Qunused-arguments_-fPIC_-fPIE2024042620240425
781312315 0 028656 860 1024T:sse2clang_-mcpu=native_-O3_-fomit-frame-pointer_-fwrapv_-Qunused-arguments_-fPIC_-fPIE2024042620240425
816811472 0 025304 860 1024T:sse2clang_-march=native_-O_-fomit-frame-pointer_-fwrapv_-Qunused-arguments_-fPIC_-fPIE2024042620240425
84018401 0 025732 812 1088T:sse2gcc_-march=native_-mtune=native_-O3_-fomit-frame-pointer_-fwrapv_-fPIC_-fPIE2024042620240425
1156911638 0 028956 812 1088T:refgcc_-march=native_-mtune=native_-O3_-fomit-frame-pointer_-fwrapv_-fPIC_-fPIE2024042620240425
1164914902 0 032244 812 1088T:ref64gcc_-march=native_-mtune=native_-O3_-fomit-frame-pointer_-fwrapv_-fPIC_-fPIE2024042620240425
1481913483 0 029928 860 1024T:refclang_-mcpu=native_-O3_-fomit-frame-pointer_-fwrapv_-Qunused-arguments_-fPIC_-fPIE2024042620240425
1484918911 0 032848 860 1024T:refclang_-march=native_-O_-fomit-frame-pointer_-fwrapv_-Qunused-arguments_-fPIC_-fPIE2024042620240425
1526813623 0 031680 860 1056T:refclang_-march=native_-O3_-fomit-frame-pointer_-fwrapv_-Qunused-arguments_-fPIC_-fPIE2024042620240425
1527613591 0 031368 860 1056T:refclang_-march=native_-O2_-fomit-frame-pointer_-fwrapv_-Qunused-arguments_-fPIC_-fPIE2024042620240425
154309202 0 023850 852 1088T:refclang_-march=native_-Os_-fomit-frame-pointer_-fwrapv_-Qunused-arguments_-fPIC_-fPIE2024042620240425
186035959 0 020875 804 1088T:ref64gcc_-march=native_-mtune=native_-O_-fomit-frame-pointer_-fwrapv_-fPIC_-fPIE2024042620240425
187496086 0 021396 812 1088T:ref64gcc_-march=native_-mtune=native_-O2_-fomit-frame-pointer_-fwrapv_-fPIC_-fPIE2024042620240425
190793737 0 017439 788 1056T:refgcc_-march=native_-mtune=native_-Os_-fomit-frame-pointer_-fwrapv_-fPIC_-fPIE2024042620240425
190844331 0 019235 804 1088T:refgcc_-march=native_-mtune=native_-O_-fomit-frame-pointer_-fwrapv_-fPIC_-fPIE2024042620240425
191074366 0 019660 812 1088T:refgcc_-march=native_-mtune=native_-O2_-fomit-frame-pointer_-fwrapv_-fPIC_-fPIE2024042620240425
192135640 0 019343 788 1056T:ref64gcc_-march=native_-mtune=native_-Os_-fomit-frame-pointer_-fwrapv_-fPIC_-fPIE2024042620240425
203086730 0 023192 860 1024T:ref64clang_-mcpu=native_-O3_-fomit-frame-pointer_-fwrapv_-Qunused-arguments_-fPIC_-fPIE2024042620240425
212845558 0 020218 852 1088T:ref64clang_-march=native_-Os_-fomit-frame-pointer_-fwrapv_-Qunused-arguments_-fPIC_-fPIE2024042620240425
214256648 0 024440 860 1056T:ref64clang_-march=native_-O2_-fomit-frame-pointer_-fwrapv_-Qunused-arguments_-fPIC_-fPIE2024042620240425
214586648 0 024720 860 1056T:ref64clang_-march=native_-O3_-fomit-frame-pointer_-fwrapv_-Qunused-arguments_-fPIC_-fPIE2024042620240425
239607478 0 021432 860 1024T:ref64clang_-march=native_-O_-fomit-frame-pointer_-fwrapv_-Qunused-arguments_-fPIC_-fPIE2024042620240425

Compiler output

Implementation: T:avx2
Security model: timingleaks
Compiler: clang -mcpu=native -O3 -fomit-frame-pointer -fwrapv -Qunused-arguments -fPIC -fPIE
morus1280128v1avx2.c: morus1280128v1avx2.c:55:13: error: always_inline function '_mm256_xor_si256' requires target feature 'avx2', but would be inlined into function 'morus_stateupdate' that is compiled without support for 'avx2'
morus1280128v1avx2.c: state[0] = XOR256(state[0], state[3]);
morus1280128v1avx2.c: ^
morus1280128v1avx2.c: morus1280128v1avx2.c:25:27: note: expanded from macro 'XOR256'
morus1280128v1avx2.c: #define XOR256(x,y) _mm256_xor_si256((x),(y)) /*XOR256(x,y) = x ^ y, where x and y are two 256-bit word*/
morus1280128v1avx2.c: ^
morus1280128v1avx2.c: morus1280128v1avx2.c:55:13: error: AVX vector argument of type '__m256i' (vector of 4 'long long' values) without 'avx' enabled changes the ABI
morus1280128v1avx2.c: morus1280128v1avx2.c:25:27: note: expanded from macro 'XOR256'
morus1280128v1avx2.c: #define XOR256(x,y) _mm256_xor_si256((x),(y)) /*XOR256(x,y) = x ^ y, where x and y are two 256-bit word*/
morus1280128v1avx2.c: ^
morus1280128v1avx2.c: morus1280128v1avx2.c:56:30: error: always_inline function '_mm256_and_si256' requires target feature 'avx2', but would be inlined into function 'morus_stateupdate' that is compiled without support for 'avx2'
morus1280128v1avx2.c: state[0] = XOR256(state[0], AND256(state[1], state[2]));
morus1280128v1avx2.c: ^
morus1280128v1avx2.c: morus1280128v1avx2.c:26:27: note: expanded from macro 'AND256'
morus1280128v1avx2.c: #define AND256(x,y) _mm256_and_si256((x),(y)) /*AND(x,y) = x & y, where x and y are two 256-bit word*/
morus1280128v1avx2.c: ^
morus1280128v1avx2.c: morus1280128v1avx2.c:56:30: error: AVX vector argument of type '__m256i' (vector of 4 'long long' values) without 'avx' enabled changes the ABI
morus1280128v1avx2.c: morus1280128v1avx2.c:26:27: note: expanded from macro 'AND256'
morus1280128v1avx2.c: #define AND256(x,y) _mm256_and_si256((x),(y)) /*AND(x,y) = x & y, where x and y are two 256-bit word*/
morus1280128v1avx2.c: ^
morus1280128v1avx2.c: morus1280128v1avx2.c:56:13: error: always_inline function '_mm256_xor_si256' requires target feature 'avx2', but would be inlined into function 'morus_stateupdate' that is compiled without support for 'avx2'
morus1280128v1avx2.c: state[0] = XOR256(state[0], AND256(state[1], state[2]));
morus1280128v1avx2.c: ^
morus1280128v1avx2.c: morus1280128v1avx2.c:25:27: note: expanded from macro 'XOR256'
morus1280128v1avx2.c: #define XOR256(x,y) _mm256_xor_si256((x),(y)) /*XOR256(x,y) = x ^ y, where x and y are two 256-bit word*/
morus1280128v1avx2.c: ...

Number of similar (compiler,implementation) pairs: 1, namely:
CompilerImplementations
clang -mcpu=native -O3 -fomit-frame-pointer -fwrapv -Qunused-arguments -fPIC -fPIE T:avx2

Compiler output

Implementation: T:avx2
Security model: timingleaks
Compiler: gcc -march=native -mtune=native -Os -fomit-frame-pointer -fwrapv -fPIC -fPIE
try.c: /usr/bin/ld: libcrypto_aead_morus1280128v1.a(morus1280128v1avx2.o): in function `crypto_aead_morus1280128v1_avx2_timingleaks_encrypt':
try.c: morus1280128v1avx2.c:(.text+0x...): undefined reference to `morus_enc_aut_step'
try.c: /usr/bin/ld: morus1280128v1avx2.c:(.text+0x...): undefined reference to `morus_enc_aut_step'
try.c: /usr/bin/ld: libcrypto_aead_morus1280128v1.a(morus1280128v1avx2.o): in function `crypto_aead_morus1280128v1_avx2_timingleaks_decrypt':
try.c: morus1280128v1avx2.c:(.text+0x...): undefined reference to `morus_enc_aut_step'
try.c: /usr/bin/ld: morus1280128v1avx2.c:(.text+0x...): undefined reference to `morus_dec_aut_step'
try.c: collect2: error: ld returned 1 exit status

Number of similar (compiler,implementation) pairs: 1, namely:
CompilerImplementations
gcc -march=native -mtune=native -Os -fomit-frame-pointer -fwrapv -fPIC -fPIE T:avx2

Compiler output

Implementation: T:sse2
Security model: timingleaks
Compiler: gcc -march=native -mtune=native -O2 -fomit-frame-pointer -fwrapv -fPIC -fPIE
try.c: /usr/bin/ld: libcrypto_aead_morus1280128v1.a(morus1280128v1sse2.o): in function `morus_initialization':
try.c: morus1280128v1sse2.c:(.text+0x...): undefined reference to `morus_stateupdate'
try.c: /usr/bin/ld: libcrypto_aead_morus1280128v1.a(morus1280128v1sse2.o): in function `morus_initialization_key_256':
try.c: morus1280128v1sse2.c:(.text+0x...): undefined reference to `morus_stateupdate'
try.c: /usr/bin/ld: libcrypto_aead_morus1280128v1.a(morus1280128v1sse2.o): in function `morus_tag_generation':
try.c: morus1280128v1sse2.c:(.text+0x...): undefined reference to `morus_stateupdate'
try.c: /usr/bin/ld: libcrypto_aead_morus1280128v1.a(morus1280128v1sse2.o): in function `morus_tag_verification':
try.c: morus1280128v1sse2.c:(.text+0x...): undefined reference to `morus_stateupdate'
try.c: /usr/bin/ld: libcrypto_aead_morus1280128v1.a(morus1280128v1sse2.o): in function `morus_enc_aut_partialblock':
try.c: morus1280128v1sse2.c:(.text+0x...): undefined reference to `morus_stateupdate'
try.c: /usr/bin/ld: libcrypto_aead_morus1280128v1.a(morus1280128v1sse2.o):morus1280128v1sse2.c:(.text+0x...): more undefined references to `morus_stateupdate' follow
try.c: collect2: error: ld returned 1 exit status

Number of similar (compiler,implementation) pairs: 2, namely:
CompilerImplementations
gcc -march=native -mtune=native -O2 -fomit-frame-pointer -fwrapv -fPIC -fPIE T:sse2
gcc -march=native -mtune=native -O -fomit-frame-pointer -fwrapv -fPIC -fPIE T:sse2

Compiler output

Implementation: T:sse2
Security model: timingleaks
Compiler: gcc -march=native -mtune=native -Os -fomit-frame-pointer -fwrapv -fPIC -fPIE
try.c: /usr/bin/ld: libcrypto_aead_morus1280128v1.a(morus1280128v1sse2.o): in function `morus_initialization':
try.c: morus1280128v1sse2.c:(.text+0x...): undefined reference to `morus_stateupdate'
try.c: /usr/bin/ld: libcrypto_aead_morus1280128v1.a(morus1280128v1sse2.o): in function `morus_initialization_key_256':
try.c: morus1280128v1sse2.c:(.text+0x...): undefined reference to `morus_stateupdate'
try.c: /usr/bin/ld: libcrypto_aead_morus1280128v1.a(morus1280128v1sse2.o): in function `morus_tag_generation':
try.c: morus1280128v1sse2.c:(.text+0x...): undefined reference to `morus_stateupdate'
try.c: /usr/bin/ld: libcrypto_aead_morus1280128v1.a(morus1280128v1sse2.o): in function `morus_tag_verification':
try.c: morus1280128v1sse2.c:(.text+0x...): undefined reference to `morus_stateupdate'
try.c: /usr/bin/ld: libcrypto_aead_morus1280128v1.a(morus1280128v1sse2.o): in function `morus_enc_aut_partialblock':
try.c: morus1280128v1sse2.c:(.text+0x...): undefined reference to `morus_stateupdate'
try.c: /usr/bin/ld: libcrypto_aead_morus1280128v1.a(morus1280128v1sse2.o):morus1280128v1sse2.c:(.text+0x...): more undefined references to `morus_stateupdate' follow
try.c: /usr/bin/ld: libcrypto_aead_morus1280128v1.a(morus1280128v1sse2.o): in function `crypto_aead_morus1280128v1_sse2_timingleaks_encrypt':
try.c: morus1280128v1sse2.c:(.text+0x...): undefined reference to `morus_enc_aut_step'
try.c: /usr/bin/ld: morus1280128v1sse2.c:(.text+0x...): undefined reference to `morus_enc_aut_step'
try.c: /usr/bin/ld: libcrypto_aead_morus1280128v1.a(morus1280128v1sse2.o): in function `crypto_aead_morus1280128v1_sse2_timingleaks_decrypt':
try.c: morus1280128v1sse2.c:(.text+0x...): undefined reference to `morus_enc_aut_step'
try.c: /usr/bin/ld: morus1280128v1sse2.c:(.text+0x...): undefined reference to `morus_dec_aut_step'
try.c: collect2: error: ld returned 1 exit status

Number of similar (compiler,implementation) pairs: 1, namely:
CompilerImplementations
gcc -march=native -mtune=native -Os -fomit-frame-pointer -fwrapv -fPIC -fPIE T:sse2