Test results for amd64, speed2supercop, crypto_sign/picnic2l1fs

[Page version: 20250318 22:34:28]

Measurements for amd64, speed2supercop, crypto_sign Test results for amd64, speed2supercop, crypto_sign Test results for crypto_sign/picnic2l1fs
Computer: speed2supercop
Microarchitecture: amd64; Haswell+AES (306c3)
Architecture: amd64
CPU ID: GenuineIntel-000306c3-1fc9cbf5
SUPERCOP version: 20250307
Operation: crypto_sign
Primitive: picnic2l1fs

Compiler output


KeccakHashtimes4.c: In file included from KeccakHashtimes4.c:15:
KeccakHashtimes4.c: ./KeccakHashtimes4.h:22:10: fatal error: 'libkeccak.a.headers/KeccakHash.h' file not found
KeccakHashtimes4.c:    22 | #include <libkeccak.a.headers/KeccakHash.h>
KeccakHashtimes4.c:       |          ^~~~~~~~~~~~~~~~~~~~~~~~~~~~~~~~~~
KeccakHashtimes4.c: 1 error generated.

Number of similar (implementation,compiler) pairs: 5, namely:
ImplementationCompiler
T:optimizedct/avx2clang -march=native -O2 -fwrapv -Qunused-arguments -fPIC -fPIE -gdwarf-4 -Wall (Debian_Clang_19.1.7_(1+b1))
T:optimizedct/avx2clang -march=native -O3 -fwrapv -Qunused-arguments -fPIC -fPIE -gdwarf-4 -Wall (Debian_Clang_19.1.7_(1+b1))
T:optimizedct/avx2clang -march=native -O -fwrapv -Qunused-arguments -fPIC -fPIE -gdwarf-4 -Wall (Debian_Clang_19.1.7_(1+b1))
T:optimizedct/avx2clang -march=native -Os -fwrapv -Qunused-arguments -fPIC -fPIE -gdwarf-4 -Wall (Debian_Clang_19.1.7_(1+b1))
T:optimizedct/avx2clang -mcpu=native -O3 -fwrapv -Qunused-arguments -fPIC -fPIE -gdwarf-4 -Wall (Debian_Clang_19.1.7_(1+b1))

Compiler output


KeccakHashtimes4.c: In file included from KeccakHashtimes4.c:15:
KeccakHashtimes4.c: KeccakHashtimes4.h:22:10: fatal error: libkeccak.a.headers/KeccakHash.h: No such file or directory
KeccakHashtimes4.c:    22 | #include <libkeccak.a.headers/KeccakHash.h>
KeccakHashtimes4.c:       |          ^~~~~~~~~~~~~~~~~~~~~~~~~~~~~~~~~~
KeccakHashtimes4.c: compilation terminated.

Number of similar (implementation,compiler) pairs: 4, namely:
ImplementationCompiler
T:optimizedct/avx2gcc -march=native -mtune=native -O2 -fwrapv -fPIC -fPIE -gdwarf-4 -Wall (14.2.0)
T:optimizedct/avx2gcc -march=native -mtune=native -O3 -fwrapv -fPIC -fPIE -gdwarf-4 -Wall (14.2.0)
T:optimizedct/avx2gcc -march=native -mtune=native -O -fwrapv -fPIC -fPIE -gdwarf-4 -Wall (14.2.0)
T:optimizedct/avx2gcc -march=native -mtune=native -Os -fwrapv -fPIC -fPIE -gdwarf-4 -Wall (14.2.0)

Compiler output


picnic2_impl.c: In file included from picnic2_impl.c:22:
picnic2_impl.c: ./kdf_shake.h:43:10: fatal error: 'libkeccak.a.headers/KeccakHash.h' file not found
picnic2_impl.c:    43 | #include <libkeccak.a.headers/KeccakHash.h>
picnic2_impl.c:       |          ^~~~~~~~~~~~~~~~~~~~~~~~~~~~~~~~~~
picnic2_impl.c: 1 error generated.

Number of similar (implementation,compiler) pairs: 5, namely:
ImplementationCompiler
T:optimizedct/cclang -march=native -O2 -fwrapv -Qunused-arguments -fPIC -fPIE -gdwarf-4 -Wall (Debian_Clang_19.1.7_(1+b1))
T:optimizedct/cclang -march=native -O3 -fwrapv -Qunused-arguments -fPIC -fPIE -gdwarf-4 -Wall (Debian_Clang_19.1.7_(1+b1))
T:optimizedct/cclang -march=native -O -fwrapv -Qunused-arguments -fPIC -fPIE -gdwarf-4 -Wall (Debian_Clang_19.1.7_(1+b1))
T:optimizedct/cclang -march=native -Os -fwrapv -Qunused-arguments -fPIC -fPIE -gdwarf-4 -Wall (Debian_Clang_19.1.7_(1+b1))
T:optimizedct/cclang -mcpu=native -O3 -fwrapv -Qunused-arguments -fPIC -fPIE -gdwarf-4 -Wall (Debian_Clang_19.1.7_(1+b1))

Compiler output


picnic2_impl.c: In file included from picnic2_impl.c:22:
picnic2_impl.c: kdf_shake.h:43:10: fatal error: libkeccak.a.headers/KeccakHash.h: No such file or directory
picnic2_impl.c:    43 | #include <libkeccak.a.headers/KeccakHash.h>
picnic2_impl.c:       |          ^~~~~~~~~~~~~~~~~~~~~~~~~~~~~~~~~~
picnic2_impl.c: compilation terminated.

Number of similar (implementation,compiler) pairs: 4, namely:
ImplementationCompiler
T:optimizedct/cgcc -march=native -mtune=native -O2 -fwrapv -fPIC -fPIE -gdwarf-4 -Wall (14.2.0)
T:optimizedct/cgcc -march=native -mtune=native -O3 -fwrapv -fPIC -fPIE -gdwarf-4 -Wall (14.2.0)
T:optimizedct/cgcc -march=native -mtune=native -O -fwrapv -fPIC -fPIE -gdwarf-4 -Wall (14.2.0)
T:optimizedct/cgcc -march=native -mtune=native -Os -fwrapv -fPIC -fPIE -gdwarf-4 -Wall (14.2.0)

Compiler output


picnic2_impl.c: In file included from picnic2_impl.c:22:
picnic2_impl.c: ./kdf_shake.h:39:10: fatal error: 'libkeccak.a.headers/KeccakHash.h' file not found
picnic2_impl.c:    39 | #include <libkeccak.a.headers/KeccakHash.h>
picnic2_impl.c:       |          ^~~~~~~~~~~~~~~~~~~~~~~~~~~~~~~~~~
picnic2_impl.c: 1 error generated.

Number of similar (implementation,compiler) pairs: 5, namely:
ImplementationCompiler
T:optimizedct/sse2clang -march=native -O2 -fwrapv -Qunused-arguments -fPIC -fPIE -gdwarf-4 -Wall (Debian_Clang_19.1.7_(1+b1))
T:optimizedct/sse2clang -march=native -O3 -fwrapv -Qunused-arguments -fPIC -fPIE -gdwarf-4 -Wall (Debian_Clang_19.1.7_(1+b1))
T:optimizedct/sse2clang -march=native -O -fwrapv -Qunused-arguments -fPIC -fPIE -gdwarf-4 -Wall (Debian_Clang_19.1.7_(1+b1))
T:optimizedct/sse2clang -march=native -Os -fwrapv -Qunused-arguments -fPIC -fPIE -gdwarf-4 -Wall (Debian_Clang_19.1.7_(1+b1))
T:optimizedct/sse2clang -mcpu=native -O3 -fwrapv -Qunused-arguments -fPIC -fPIE -gdwarf-4 -Wall (Debian_Clang_19.1.7_(1+b1))

Compiler output


picnic2_impl.c: In file included from picnic2_impl.c:22:
picnic2_impl.c: kdf_shake.h:39:10: fatal error: libkeccak.a.headers/KeccakHash.h: No such file or directory
picnic2_impl.c:    39 | #include <libkeccak.a.headers/KeccakHash.h>
picnic2_impl.c:       |          ^~~~~~~~~~~~~~~~~~~~~~~~~~~~~~~~~~
picnic2_impl.c: compilation terminated.

Number of similar (implementation,compiler) pairs: 4, namely:
ImplementationCompiler
T:optimizedct/sse2gcc -march=native -mtune=native -O2 -fwrapv -fPIC -fPIE -gdwarf-4 -Wall (14.2.0)
T:optimizedct/sse2gcc -march=native -mtune=native -O3 -fwrapv -fPIC -fPIE -gdwarf-4 -Wall (14.2.0)
T:optimizedct/sse2gcc -march=native -mtune=native -O -fwrapv -fPIC -fPIE -gdwarf-4 -Wall (14.2.0)
T:optimizedct/sse2gcc -march=native -mtune=native -Os -fwrapv -fPIC -fPIE -gdwarf-4 -Wall (14.2.0)

Compiler output


hash.c: In file included from hash.c:12:
hash.c: ./hash.h:18:10: fatal error: 'libkeccak.a.headers/KeccakHash.h' file not found
hash.c:    18 | #include <libkeccak.a.headers/KeccakHash.h>
hash.c:       |          ^~~~~~~~~~~~~~~~~~~~~~~~~~~~~~~~~~
hash.c: 1 error generated.

Number of similar (implementation,compiler) pairs: 5, namely:
ImplementationCompiler
T:refclang -march=native -O2 -fwrapv -Qunused-arguments -fPIC -fPIE -gdwarf-4 -Wall (Debian_Clang_19.1.7_(1+b1))
T:refclang -march=native -O3 -fwrapv -Qunused-arguments -fPIC -fPIE -gdwarf-4 -Wall (Debian_Clang_19.1.7_(1+b1))
T:refclang -march=native -O -fwrapv -Qunused-arguments -fPIC -fPIE -gdwarf-4 -Wall (Debian_Clang_19.1.7_(1+b1))
T:refclang -march=native -Os -fwrapv -Qunused-arguments -fPIC -fPIE -gdwarf-4 -Wall (Debian_Clang_19.1.7_(1+b1))
T:refclang -mcpu=native -O3 -fwrapv -Qunused-arguments -fPIC -fPIE -gdwarf-4 -Wall (Debian_Clang_19.1.7_(1+b1))

Compiler output


hash.c: In file included from hash.c:12:
hash.c: hash.h:18:10: fatal error: libkeccak.a.headers/KeccakHash.h: No such file or directory
hash.c:    18 | #include <libkeccak.a.headers/KeccakHash.h>
hash.c:       |          ^~~~~~~~~~~~~~~~~~~~~~~~~~~~~~~~~~
hash.c: compilation terminated.

Number of similar (implementation,compiler) pairs: 4, namely:
ImplementationCompiler
T:refgcc -march=native -mtune=native -O2 -fwrapv -fPIC -fPIE -gdwarf-4 -Wall (14.2.0)
T:refgcc -march=native -mtune=native -O3 -fwrapv -fPIC -fPIE -gdwarf-4 -Wall (14.2.0)
T:refgcc -march=native -mtune=native -O -fwrapv -fPIC -fPIE -gdwarf-4 -Wall (14.2.0)
T:refgcc -march=native -mtune=native -Os -fwrapv -fPIC -fPIE -gdwarf-4 -Wall (14.2.0)