Test results for amd64, speed2supercop, crypto_sign/luov890351
[Page version: 20250318 22:34:28]
Measurements for amd64, speed2supercop, crypto_sign
Test results for amd64, speed2supercop, crypto_sign
Test results for crypto_sign/luov890351
Computer: speed2supercop
Microarchitecture: amd64; Haswell+AES (306c3)
Architecture: amd64
CPU ID: GenuineIntel-000306c3-1fc9cbf5
SUPERCOP version: 20250307
Operation: crypto_sign
Primitive: luov890351
Compiler output
LUOV.c: In file included from LUOV.c:1:
LUOV.c: In file included from ./LUOV.h:15:
LUOV.c: ./keccakrng.h:5:10: fatal error: 'libkeccak.a.headers/KeccakHash.h' file not found
LUOV.c: 5 | #include <libkeccak.a.headers/KeccakHash.h>
LUOV.c: | ^~~~~~~~~~~~~~~~~~~~~~~~~~~~~~~~~~
LUOV.c: 1 error generated.
Number of similar (implementation,compiler) pairs: 5, namely:
Implementation | Compiler |
T:avx2 | clang -march=native -O2 -fwrapv -Qunused-arguments -fPIC -fPIE -gdwarf-4 -Wall (Debian_Clang_19.1.7_(1+b1)) |
T:avx2 | clang -march=native -O3 -fwrapv -Qunused-arguments -fPIC -fPIE -gdwarf-4 -Wall (Debian_Clang_19.1.7_(1+b1)) |
T:avx2 | clang -march=native -O -fwrapv -Qunused-arguments -fPIC -fPIE -gdwarf-4 -Wall (Debian_Clang_19.1.7_(1+b1)) |
T:avx2 | clang -march=native -Os -fwrapv -Qunused-arguments -fPIC -fPIE -gdwarf-4 -Wall (Debian_Clang_19.1.7_(1+b1)) |
T:avx2 | clang -mcpu=native -O3 -fwrapv -Qunused-arguments -fPIC -fPIE -gdwarf-4 -Wall (Debian_Clang_19.1.7_(1+b1)) |
Compiler output
LUOV.c: In file included from LUOV.h:15,
LUOV.c: from LUOV.c:1:
LUOV.c: keccakrng.h:5:10: fatal error: libkeccak.a.headers/KeccakHash.h: No such file or directory
LUOV.c: 5 | #include <libkeccak.a.headers/KeccakHash.h>
LUOV.c: | ^~~~~~~~~~~~~~~~~~~~~~~~~~~~~~~~~~
LUOV.c: compilation terminated.
Number of similar (implementation,compiler) pairs: 4, namely:
Implementation | Compiler |
T:avx2 | gcc -march=native -mtune=native -O2 -fwrapv -fPIC -fPIE -gdwarf-4 -Wall (14.2.0) |
T:avx2 | gcc -march=native -mtune=native -O3 -fwrapv -fPIC -fPIE -gdwarf-4 -Wall (14.2.0) |
T:avx2 | gcc -march=native -mtune=native -O -fwrapv -fPIC -fPIE -gdwarf-4 -Wall (14.2.0) |
T:avx2 | gcc -march=native -mtune=native -Os -fwrapv -fPIC -fPIE -gdwarf-4 -Wall (14.2.0) |
Compiler output
Bitcontainer.c: In file included from Bitcontainer.c:1:
Bitcontainer.c: ./Bitcontainer.h:9:10: fatal error: 'libkeccak.a.headers/KeccakSponge.h' file not found
Bitcontainer.c: 9 | #include <libkeccak.a.headers/KeccakSponge.h>
Bitcontainer.c: | ^~~~~~~~~~~~~~~~~~~~~~~~~~~~~~~~~~~~
Bitcontainer.c: 1 error generated.
Number of similar (implementation,compiler) pairs: 10, namely:
Implementation | Compiler |
T:portable | clang -march=native -O2 -fwrapv -Qunused-arguments -fPIC -fPIE -gdwarf-4 -Wall (Debian_Clang_19.1.7_(1+b1)) |
T:portable | clang -march=native -O3 -fwrapv -Qunused-arguments -fPIC -fPIE -gdwarf-4 -Wall (Debian_Clang_19.1.7_(1+b1)) |
T:portable | clang -march=native -O -fwrapv -Qunused-arguments -fPIC -fPIE -gdwarf-4 -Wall (Debian_Clang_19.1.7_(1+b1)) |
T:portable | clang -march=native -Os -fwrapv -Qunused-arguments -fPIC -fPIE -gdwarf-4 -Wall (Debian_Clang_19.1.7_(1+b1)) |
T:portable | clang -mcpu=native -O3 -fwrapv -Qunused-arguments -fPIC -fPIE -gdwarf-4 -Wall (Debian_Clang_19.1.7_(1+b1)) |
T:ref | clang -march=native -O2 -fwrapv -Qunused-arguments -fPIC -fPIE -gdwarf-4 -Wall (Debian_Clang_19.1.7_(1+b1)) |
T:ref | clang -march=native -O3 -fwrapv -Qunused-arguments -fPIC -fPIE -gdwarf-4 -Wall (Debian_Clang_19.1.7_(1+b1)) |
T:ref | clang -march=native -O -fwrapv -Qunused-arguments -fPIC -fPIE -gdwarf-4 -Wall (Debian_Clang_19.1.7_(1+b1)) |
T:ref | clang -march=native -Os -fwrapv -Qunused-arguments -fPIC -fPIE -gdwarf-4 -Wall (Debian_Clang_19.1.7_(1+b1)) |
T:ref | clang -mcpu=native -O3 -fwrapv -Qunused-arguments -fPIC -fPIE -gdwarf-4 -Wall (Debian_Clang_19.1.7_(1+b1)) |
Compiler output
Bitcontainer.c: In file included from Bitcontainer.c:1:
Bitcontainer.c: Bitcontainer.h:9:10: fatal error: libkeccak.a.headers/KeccakSponge.h: No such file or directory
Bitcontainer.c: 9 | #include <libkeccak.a.headers/KeccakSponge.h>
Bitcontainer.c: | ^~~~~~~~~~~~~~~~~~~~~~~~~~~~~~~~~~~~
Bitcontainer.c: compilation terminated.
Number of similar (implementation,compiler) pairs: 8, namely:
Implementation | Compiler |
T:portable | gcc -march=native -mtune=native -O2 -fwrapv -fPIC -fPIE -gdwarf-4 -Wall (14.2.0) |
T:portable | gcc -march=native -mtune=native -O3 -fwrapv -fPIC -fPIE -gdwarf-4 -Wall (14.2.0) |
T:portable | gcc -march=native -mtune=native -O -fwrapv -fPIC -fPIE -gdwarf-4 -Wall (14.2.0) |
T:portable | gcc -march=native -mtune=native -Os -fwrapv -fPIC -fPIE -gdwarf-4 -Wall (14.2.0) |
T:ref | gcc -march=native -mtune=native -O2 -fwrapv -fPIC -fPIE -gdwarf-4 -Wall (14.2.0) |
T:ref | gcc -march=native -mtune=native -O3 -fwrapv -fPIC -fPIE -gdwarf-4 -Wall (14.2.0) |
T:ref | gcc -march=native -mtune=native -O -fwrapv -fPIC -fPIE -gdwarf-4 -Wall (14.2.0) |
T:ref | gcc -march=native -mtune=native -Os -fwrapv -fPIC -fPIE -gdwarf-4 -Wall (14.2.0) |