Test results for amd64, speed2supercop, crypto_aead/omdsha256k256n248tau256v1

[Page version: 20250318 22:34:28]

Measurements for amd64, speed2supercop, crypto_aead Test results for amd64, speed2supercop, crypto_aead Test results for crypto_aead/omdsha256k256n248tau256v1
Computer: speed2supercop
Microarchitecture: amd64; Haswell+AES (306c3)
Architecture: amd64
CPU ID: GenuineIntel-000306c3-1fc9cbf5
SUPERCOP version: 20250307
Operation: crypto_aead
Primitive: omdsha256k256n248tau256v1
TimeObject sizeTest sizeImplementationCompilerBenchmark dateSUPERCOP version
16232411648 0 033509 752 928T:refgcc -march=native -mtune=native -O3 -fwrapv -fPIC -fPIE -gdwarf-4 -Wall2025031120250307
1743329521 0 033574 792 920T:refclang -march=native -O3 -fwrapv -Qunused-arguments -fPIC -fPIE -gdwarf-4 -Wall2025031120250307
17484810279 0 034374 792 920T:refclang -march=native -O2 -fwrapv -Qunused-arguments -fPIC -fPIE -gdwarf-4 -Wall2025031120250307
1753965652 0 025685 752 928T:refgcc -march=native -mtune=native -O2 -fwrapv -fPIC -fPIE -gdwarf-4 -Wall2025031120250307
1919204756 0 025207 784 920T:refclang -march=native -Os -fwrapv -Qunused-arguments -fPIC -fPIE -gdwarf-4 -Wall2025031120250307
1974409949 0 035782 792 856T:refclang -mcpu=native -O3 -fwrapv -Qunused-arguments -fPIC -fPIE -gdwarf-4 -Wall2025031120250307
2024885504 0 025164 744 928T:refgcc -march=native -mtune=native -O -fwrapv -fPIC -fPIE -gdwarf-4 -Wall2025031120250307
2048925671 0 025062 792 856T:refclang -march=native -O -fwrapv -Qunused-arguments -fPIC -fPIE -gdwarf-4 -Wall2025031120250307
2346363873 0 021648 728 896T:refgcc -march=native -mtune=native -Os -fwrapv -fPIC -fPIE -gdwarf-4 -Wall2025031120250307

Compiler output


try.c: /usr/bin/ld: libcrypto_aead_omdsha256k256n248tau256v1.a(omdsha256.o):.../supercop-data/speed2supercop/amd64/try/c/clang_-march=native_-O2_-fwrapv_-Qunused-arguments_-fPIC_-fPIE_-gdwarf-4_-Wall/timingleaks/crypto_aead/omdsha256k256n248tau256v1/avx1/work/./omdsha256.h:137: multiple definition of `Hash'; libcrypto_aead_omdsha256k256n248tau256v1.a(encrypt.o):.../supercop-data/speed2supercop/amd64/try/c/clang_-march=native_-O2_-fwrapv_-Qunused-arguments_-fPIC_-fPIE_-gdwarf-4_-Wall/timingleaks/crypto_aead/omdsha256k256n248tau256v1/avx1/work/./omdsha256.h:137: first defined here
try.c: clang: error: linker command failed with exit code 1 (use -v to see invocation)

Number of similar (implementation,compiler) pairs: 1, namely:
ImplementationCompiler
T:avx1clang -march=native -O2 -fwrapv -Qunused-arguments -fPIC -fPIE -gdwarf-4 -Wall (Debian_Clang_19.1.7_(1+b1))

Compiler output


try.c: /usr/bin/ld: libcrypto_aead_omdsha256k256n248tau256v1.a(omdsha256.o):.../supercop-data/speed2supercop/amd64/try/c/clang_-march=native_-O3_-fwrapv_-Qunused-arguments_-fPIC_-fPIE_-gdwarf-4_-Wall/timingleaks/crypto_aead/omdsha256k256n248tau256v1/avx1/work/./omdsha256.h:137: multiple definition of `Hash'; libcrypto_aead_omdsha256k256n248tau256v1.a(encrypt.o):.../supercop-data/speed2supercop/amd64/try/c/clang_-march=native_-O3_-fwrapv_-Qunused-arguments_-fPIC_-fPIE_-gdwarf-4_-Wall/timingleaks/crypto_aead/omdsha256k256n248tau256v1/avx1/work/./omdsha256.h:137: first defined here
try.c: clang: error: linker command failed with exit code 1 (use -v to see invocation)

Number of similar (implementation,compiler) pairs: 1, namely:
ImplementationCompiler
T:avx1clang -march=native -O3 -fwrapv -Qunused-arguments -fPIC -fPIE -gdwarf-4 -Wall (Debian_Clang_19.1.7_(1+b1))

Compiler output


try.c: /usr/bin/ld: libcrypto_aead_omdsha256k256n248tau256v1.a(omdsha256.o):.../supercop-data/speed2supercop/amd64/try/c/clang_-march=native_-O_-fwrapv_-Qunused-arguments_-fPIC_-fPIE_-gdwarf-4_-Wall/timingleaks/crypto_aead/omdsha256k256n248tau256v1/avx1/work/./omdsha256.h:137: multiple definition of `Hash'; libcrypto_aead_omdsha256k256n248tau256v1.a(encrypt.o):.../supercop-data/speed2supercop/amd64/try/c/clang_-march=native_-O_-fwrapv_-Qunused-arguments_-fPIC_-fPIE_-gdwarf-4_-Wall/timingleaks/crypto_aead/omdsha256k256n248tau256v1/avx1/work/./omdsha256.h:137: first defined here
try.c: clang: error: linker command failed with exit code 1 (use -v to see invocation)

Number of similar (implementation,compiler) pairs: 1, namely:
ImplementationCompiler
T:avx1clang -march=native -O -fwrapv -Qunused-arguments -fPIC -fPIE -gdwarf-4 -Wall (Debian_Clang_19.1.7_(1+b1))

Compiler output


try.c: /usr/bin/ld: libcrypto_aead_omdsha256k256n248tau256v1.a(omdsha256.o):.../supercop-data/speed2supercop/amd64/try/c/clang_-march=native_-Os_-fwrapv_-Qunused-arguments_-fPIC_-fPIE_-gdwarf-4_-Wall/timingleaks/crypto_aead/omdsha256k256n248tau256v1/avx1/work/./omdsha256.h:137: multiple definition of `Hash'; libcrypto_aead_omdsha256k256n248tau256v1.a(encrypt.o):.../supercop-data/speed2supercop/amd64/try/c/clang_-march=native_-Os_-fwrapv_-Qunused-arguments_-fPIC_-fPIE_-gdwarf-4_-Wall/timingleaks/crypto_aead/omdsha256k256n248tau256v1/avx1/work/./omdsha256.h:137: first defined here
try.c: clang: error: linker command failed with exit code 1 (use -v to see invocation)

Number of similar (implementation,compiler) pairs: 1, namely:
ImplementationCompiler
T:avx1clang -march=native -Os -fwrapv -Qunused-arguments -fPIC -fPIE -gdwarf-4 -Wall (Debian_Clang_19.1.7_(1+b1))

Compiler output


try.c: /usr/bin/ld: libcrypto_aead_omdsha256k256n248tau256v1.a(omdsha256.o):.../supercop-data/speed2supercop/amd64/try/c/clang_-mcpu=native_-O3_-fwrapv_-Qunused-arguments_-fPIC_-fPIE_-gdwarf-4_-Wall/timingleaks/crypto_aead/omdsha256k256n248tau256v1/avx1/work/./omdsha256.h:137: multiple definition of `Hash'; libcrypto_aead_omdsha256k256n248tau256v1.a(encrypt.o):.../supercop-data/speed2supercop/amd64/try/c/clang_-mcpu=native_-O3_-fwrapv_-Qunused-arguments_-fPIC_-fPIE_-gdwarf-4_-Wall/timingleaks/crypto_aead/omdsha256k256n248tau256v1/avx1/work/./omdsha256.h:137: first defined here
try.c: clang: error: linker command failed with exit code 1 (use -v to see invocation)

Number of similar (implementation,compiler) pairs: 1, namely:
ImplementationCompiler
T:avx1clang -mcpu=native -O3 -fwrapv -Qunused-arguments -fPIC -fPIE -gdwarf-4 -Wall (Debian_Clang_19.1.7_(1+b1))

Compiler output


encrypt.c: /tmp/ccbMQ6hu.s: Assembler messages:
encrypt.c: /tmp/ccbMQ6hu.s:922: Warning: dwarf line number information for .data ignored
encrypt.c: /tmp/ccbMQ6hu.s:924: Warning: dwarf line number information for .data ignored
encrypt.c: /tmp/ccbMQ6hu.s:925: Warning: dwarf line number information for .data ignored
encrypt.c: /tmp/ccbMQ6hu.s:926: Warning: dwarf line number information for .data ignored
encrypt.c: /tmp/ccbMQ6hu.s:937: Warning: dwarf line number information for .data ignored
encrypt.c: /tmp/ccbMQ6hu.s:944: Warning: dwarf line number information for .data ignored
encrypt.c: /tmp/ccbMQ6hu.s:947: Warning: dwarf line number information for .data ignored
encrypt.c: /tmp/ccbMQ6hu.s:948: Warning: dwarf line number information for .data ignored
encrypt.c: /tmp/ccbMQ6hu.s:955: Warning: dwarf line number information for .data ignored
encrypt.c: /tmp/ccbMQ6hu.s:956: Warning: dwarf line number information for .data ignored
encrypt.c: /tmp/ccbMQ6hu.s:959: Warning: dwarf line number information for .data ignored
encrypt.c: /tmp/ccbMQ6hu.s:961: Warning: dwarf line number information for .data ignored
encrypt.c: /tmp/ccbMQ6hu.s:964: Warning: dwarf line number information for .data ignored
encrypt.c: /tmp/ccbMQ6hu.s:972: Warning: dwarf line number information for .data ignored
encrypt.c: /tmp/ccbMQ6hu.s:983: Warning: dwarf line number information for .data ignored
encrypt.c: /tmp/ccbMQ6hu.s:985: Warning: dwarf line number information for .data ignored
encrypt.c: /tmp/ccbMQ6hu.s:986: Warning: dwarf line number information for .data ignored
encrypt.c: /tmp/ccbMQ6hu.s:987: Warning: dwarf line number information for .data ignored
encrypt.c: /tmp/ccbMQ6hu.s:994: Warning: dwarf line number information for .data ignored
encrypt.c: /tmp/ccbMQ6hu.s:1001: Warning: dwarf line number information for .data ignored
encrypt.c: /tmp/ccbMQ6hu.s:1004: Warning: dwarf line number information for .data ignored
encrypt.c: /tmp/ccbMQ6hu.s:1007: Warning: dwarf line number information for .data ignored
encrypt.c: /tmp/ccbMQ6hu.s:1014: Warning: dwarf line number information for .data ignored
encrypt.c: /tmp/ccbMQ6hu.s:1017: Warning: dwarf line number information for .data ignored
encrypt.c: ...

Number of similar (implementation,compiler) pairs: 1, namely:
ImplementationCompiler
T:avx1gcc -march=native -mtune=native -O2 -fwrapv -fPIC -fPIE -gdwarf-4 -Wall (14.2.0)

Compiler output


encrypt.c: /tmp/ccimVR27.s: Assembler messages:
encrypt.c: /tmp/ccimVR27.s:922: Warning: dwarf line number information for .data ignored
encrypt.c: /tmp/ccimVR27.s:924: Warning: dwarf line number information for .data ignored
encrypt.c: /tmp/ccimVR27.s:925: Warning: dwarf line number information for .data ignored
encrypt.c: /tmp/ccimVR27.s:926: Warning: dwarf line number information for .data ignored
encrypt.c: /tmp/ccimVR27.s:937: Warning: dwarf line number information for .data ignored
encrypt.c: /tmp/ccimVR27.s:944: Warning: dwarf line number information for .data ignored
encrypt.c: /tmp/ccimVR27.s:947: Warning: dwarf line number information for .data ignored
encrypt.c: /tmp/ccimVR27.s:948: Warning: dwarf line number information for .data ignored
encrypt.c: /tmp/ccimVR27.s:955: Warning: dwarf line number information for .data ignored
encrypt.c: /tmp/ccimVR27.s:956: Warning: dwarf line number information for .data ignored
encrypt.c: /tmp/ccimVR27.s:959: Warning: dwarf line number information for .data ignored
encrypt.c: /tmp/ccimVR27.s:961: Warning: dwarf line number information for .data ignored
encrypt.c: /tmp/ccimVR27.s:964: Warning: dwarf line number information for .data ignored
encrypt.c: /tmp/ccimVR27.s:972: Warning: dwarf line number information for .data ignored
encrypt.c: /tmp/ccimVR27.s:983: Warning: dwarf line number information for .data ignored
encrypt.c: /tmp/ccimVR27.s:985: Warning: dwarf line number information for .data ignored
encrypt.c: /tmp/ccimVR27.s:986: Warning: dwarf line number information for .data ignored
encrypt.c: /tmp/ccimVR27.s:987: Warning: dwarf line number information for .data ignored
encrypt.c: /tmp/ccimVR27.s:994: Warning: dwarf line number information for .data ignored
encrypt.c: /tmp/ccimVR27.s:1001: Warning: dwarf line number information for .data ignored
encrypt.c: /tmp/ccimVR27.s:1004: Warning: dwarf line number information for .data ignored
encrypt.c: /tmp/ccimVR27.s:1007: Warning: dwarf line number information for .data ignored
encrypt.c: /tmp/ccimVR27.s:1014: Warning: dwarf line number information for .data ignored
encrypt.c: /tmp/ccimVR27.s:1017: Warning: dwarf line number information for .data ignored
encrypt.c: ...

Number of similar (implementation,compiler) pairs: 1, namely:
ImplementationCompiler
T:avx1gcc -march=native -mtune=native -O3 -fwrapv -fPIC -fPIE -gdwarf-4 -Wall (14.2.0)

Compiler output


encrypt.c: /tmp/ccoT5jkg.s: Assembler messages:
encrypt.c: /tmp/ccoT5jkg.s:921: Warning: dwarf line number information for .data ignored
encrypt.c: /tmp/ccoT5jkg.s:923: Warning: dwarf line number information for .data ignored
encrypt.c: /tmp/ccoT5jkg.s:934: Warning: dwarf line number information for .data ignored
encrypt.c: /tmp/ccoT5jkg.s:935: Warning: dwarf line number information for .data ignored
encrypt.c: /tmp/ccoT5jkg.s:936: Warning: dwarf line number information for .data ignored
encrypt.c: /tmp/ccoT5jkg.s:943: Warning: dwarf line number information for .data ignored
encrypt.c: /tmp/ccoT5jkg.s:946: Warning: dwarf line number information for .data ignored
encrypt.c: /tmp/ccoT5jkg.s:947: Warning: dwarf line number information for .data ignored
encrypt.c: /tmp/ccoT5jkg.s:952: Warning: dwarf line number information for .data ignored
encrypt.c: /tmp/ccoT5jkg.s:953: Warning: dwarf line number information for .data ignored
encrypt.c: /tmp/ccoT5jkg.s:956: Warning: dwarf line number information for .data ignored
encrypt.c: /tmp/ccoT5jkg.s:958: Warning: dwarf line number information for .data ignored
encrypt.c: /tmp/ccoT5jkg.s:961: Warning: dwarf line number information for .data ignored
encrypt.c: /tmp/ccoT5jkg.s:969: Warning: dwarf line number information for .data ignored
encrypt.c: /tmp/ccoT5jkg.s:979: Warning: dwarf line number information for .data ignored
encrypt.c: /tmp/ccoT5jkg.s:981: Warning: dwarf line number information for .data ignored
encrypt.c: /tmp/ccoT5jkg.s:993: Warning: dwarf line number information for .data ignored
encrypt.c: /tmp/ccoT5jkg.s:997: Warning: dwarf line number information for .data ignored
encrypt.c: /tmp/ccoT5jkg.s:998: Warning: dwarf line number information for .data ignored
encrypt.c: /tmp/ccoT5jkg.s:999: Warning: dwarf line number information for .data ignored
encrypt.c: /tmp/ccoT5jkg.s:1006: Warning: dwarf line number information for .data ignored
encrypt.c: /tmp/ccoT5jkg.s:1009: Warning: dwarf line number information for .data ignored
encrypt.c: /tmp/ccoT5jkg.s:1012: Warning: dwarf line number information for .data ignored
encrypt.c: /tmp/ccoT5jkg.s:1015: Warning: dwarf line number information for .data ignored
encrypt.c: ...

Number of similar (implementation,compiler) pairs: 1, namely:
ImplementationCompiler
T:avx1gcc -march=native -mtune=native -O -fwrapv -fPIC -fPIE -gdwarf-4 -Wall (14.2.0)

Compiler output


encrypt.c: /tmp/ccC5mEJr.s: Assembler messages:
encrypt.c: /tmp/ccC5mEJr.s:921: Warning: dwarf line number information for .data ignored
encrypt.c: /tmp/ccC5mEJr.s:923: Warning: dwarf line number information for .data ignored
encrypt.c: /tmp/ccC5mEJr.s:924: Warning: dwarf line number information for .data ignored
encrypt.c: /tmp/ccC5mEJr.s:925: Warning: dwarf line number information for .data ignored
encrypt.c: /tmp/ccC5mEJr.s:936: Warning: dwarf line number information for .data ignored
encrypt.c: /tmp/ccC5mEJr.s:943: Warning: dwarf line number information for .data ignored
encrypt.c: /tmp/ccC5mEJr.s:946: Warning: dwarf line number information for .data ignored
encrypt.c: /tmp/ccC5mEJr.s:947: Warning: dwarf line number information for .data ignored
encrypt.c: /tmp/ccC5mEJr.s:954: Warning: dwarf line number information for .data ignored
encrypt.c: /tmp/ccC5mEJr.s:955: Warning: dwarf line number information for .data ignored
encrypt.c: /tmp/ccC5mEJr.s:958: Warning: dwarf line number information for .data ignored
encrypt.c: /tmp/ccC5mEJr.s:960: Warning: dwarf line number information for .data ignored
encrypt.c: /tmp/ccC5mEJr.s:963: Warning: dwarf line number information for .data ignored
encrypt.c: /tmp/ccC5mEJr.s:971: Warning: dwarf line number information for .data ignored
encrypt.c: /tmp/ccC5mEJr.s:981: Warning: dwarf line number information for .data ignored
encrypt.c: /tmp/ccC5mEJr.s:983: Warning: dwarf line number information for .data ignored
encrypt.c: /tmp/ccC5mEJr.s:984: Warning: dwarf line number information for .data ignored
encrypt.c: /tmp/ccC5mEJr.s:985: Warning: dwarf line number information for .data ignored
encrypt.c: /tmp/ccC5mEJr.s:992: Warning: dwarf line number information for .data ignored
encrypt.c: /tmp/ccC5mEJr.s:999: Warning: dwarf line number information for .data ignored
encrypt.c: /tmp/ccC5mEJr.s:1002: Warning: dwarf line number information for .data ignored
encrypt.c: /tmp/ccC5mEJr.s:1005: Warning: dwarf line number information for .data ignored
encrypt.c: /tmp/ccC5mEJr.s:1012: Warning: dwarf line number information for .data ignored
encrypt.c: /tmp/ccC5mEJr.s:1015: Warning: dwarf line number information for .data ignored
encrypt.c: ...

Number of similar (implementation,compiler) pairs: 1, namely:
ImplementationCompiler
T:avx1gcc -march=native -mtune=native -Os -fwrapv -fPIC -fPIE -gdwarf-4 -Wall (14.2.0)

Compiler output


try.c: /usr/bin/ld: libcrypto_aead_omdsha256k256n248tau256v1.a(omdsha256.o):.../supercop-data/speed2supercop/amd64/try/c/clang_-march=native_-O2_-fwrapv_-Qunused-arguments_-fPIC_-fPIE_-gdwarf-4_-Wall/timingleaks/crypto_aead/omdsha256k256n248tau256v1/sse4/work/./omdsha256.h:137: multiple definition of `Hash'; libcrypto_aead_omdsha256k256n248tau256v1.a(encrypt.o):.../supercop-data/speed2supercop/amd64/try/c/clang_-march=native_-O2_-fwrapv_-Qunused-arguments_-fPIC_-fPIE_-gdwarf-4_-Wall/timingleaks/crypto_aead/omdsha256k256n248tau256v1/sse4/work/./omdsha256.h:137: first defined here
try.c: clang: error: linker command failed with exit code 1 (use -v to see invocation)

Number of similar (implementation,compiler) pairs: 1, namely:
ImplementationCompiler
T:sse4clang -march=native -O2 -fwrapv -Qunused-arguments -fPIC -fPIE -gdwarf-4 -Wall (Debian_Clang_19.1.7_(1+b1))

Compiler output


try.c: /usr/bin/ld: libcrypto_aead_omdsha256k256n248tau256v1.a(omdsha256.o):.../supercop-data/speed2supercop/amd64/try/c/clang_-march=native_-O3_-fwrapv_-Qunused-arguments_-fPIC_-fPIE_-gdwarf-4_-Wall/timingleaks/crypto_aead/omdsha256k256n248tau256v1/sse4/work/./omdsha256.h:137: multiple definition of `Hash'; libcrypto_aead_omdsha256k256n248tau256v1.a(encrypt.o):.../supercop-data/speed2supercop/amd64/try/c/clang_-march=native_-O3_-fwrapv_-Qunused-arguments_-fPIC_-fPIE_-gdwarf-4_-Wall/timingleaks/crypto_aead/omdsha256k256n248tau256v1/sse4/work/./omdsha256.h:137: first defined here
try.c: clang: error: linker command failed with exit code 1 (use -v to see invocation)

Number of similar (implementation,compiler) pairs: 1, namely:
ImplementationCompiler
T:sse4clang -march=native -O3 -fwrapv -Qunused-arguments -fPIC -fPIE -gdwarf-4 -Wall (Debian_Clang_19.1.7_(1+b1))

Compiler output


try.c: /usr/bin/ld: libcrypto_aead_omdsha256k256n248tau256v1.a(omdsha256.o):.../supercop-data/speed2supercop/amd64/try/c/clang_-march=native_-O_-fwrapv_-Qunused-arguments_-fPIC_-fPIE_-gdwarf-4_-Wall/timingleaks/crypto_aead/omdsha256k256n248tau256v1/sse4/work/./omdsha256.h:137: multiple definition of `Hash'; libcrypto_aead_omdsha256k256n248tau256v1.a(encrypt.o):.../supercop-data/speed2supercop/amd64/try/c/clang_-march=native_-O_-fwrapv_-Qunused-arguments_-fPIC_-fPIE_-gdwarf-4_-Wall/timingleaks/crypto_aead/omdsha256k256n248tau256v1/sse4/work/./omdsha256.h:137: first defined here
try.c: clang: error: linker command failed with exit code 1 (use -v to see invocation)

Number of similar (implementation,compiler) pairs: 1, namely:
ImplementationCompiler
T:sse4clang -march=native -O -fwrapv -Qunused-arguments -fPIC -fPIE -gdwarf-4 -Wall (Debian_Clang_19.1.7_(1+b1))

Compiler output


try.c: /usr/bin/ld: libcrypto_aead_omdsha256k256n248tau256v1.a(omdsha256.o):.../supercop-data/speed2supercop/amd64/try/c/clang_-march=native_-Os_-fwrapv_-Qunused-arguments_-fPIC_-fPIE_-gdwarf-4_-Wall/timingleaks/crypto_aead/omdsha256k256n248tau256v1/sse4/work/./omdsha256.h:137: multiple definition of `Hash'; libcrypto_aead_omdsha256k256n248tau256v1.a(encrypt.o):.../supercop-data/speed2supercop/amd64/try/c/clang_-march=native_-Os_-fwrapv_-Qunused-arguments_-fPIC_-fPIE_-gdwarf-4_-Wall/timingleaks/crypto_aead/omdsha256k256n248tau256v1/sse4/work/./omdsha256.h:137: first defined here
try.c: clang: error: linker command failed with exit code 1 (use -v to see invocation)

Number of similar (implementation,compiler) pairs: 1, namely:
ImplementationCompiler
T:sse4clang -march=native -Os -fwrapv -Qunused-arguments -fPIC -fPIE -gdwarf-4 -Wall (Debian_Clang_19.1.7_(1+b1))

Compiler output


try.c: /usr/bin/ld: libcrypto_aead_omdsha256k256n248tau256v1.a(omdsha256.o):.../supercop-data/speed2supercop/amd64/try/c/clang_-mcpu=native_-O3_-fwrapv_-Qunused-arguments_-fPIC_-fPIE_-gdwarf-4_-Wall/timingleaks/crypto_aead/omdsha256k256n248tau256v1/sse4/work/./omdsha256.h:137: multiple definition of `Hash'; libcrypto_aead_omdsha256k256n248tau256v1.a(encrypt.o):.../supercop-data/speed2supercop/amd64/try/c/clang_-mcpu=native_-O3_-fwrapv_-Qunused-arguments_-fPIC_-fPIE_-gdwarf-4_-Wall/timingleaks/crypto_aead/omdsha256k256n248tau256v1/sse4/work/./omdsha256.h:137: first defined here
try.c: clang: error: linker command failed with exit code 1 (use -v to see invocation)

Number of similar (implementation,compiler) pairs: 1, namely:
ImplementationCompiler
T:sse4clang -mcpu=native -O3 -fwrapv -Qunused-arguments -fPIC -fPIE -gdwarf-4 -Wall (Debian_Clang_19.1.7_(1+b1))

Compiler output


encrypt.c: /tmp/ccUCwMzi.s: Assembler messages:
encrypt.c: /tmp/ccUCwMzi.s:961: Warning: dwarf line number information for .data ignored
encrypt.c: /tmp/ccUCwMzi.s:963: Warning: dwarf line number information for .data ignored
encrypt.c: /tmp/ccUCwMzi.s:964: Warning: dwarf line number information for .data ignored
encrypt.c: /tmp/ccUCwMzi.s:965: Warning: dwarf line number information for .data ignored
encrypt.c: /tmp/ccUCwMzi.s:976: Warning: dwarf line number information for .data ignored
encrypt.c: /tmp/ccUCwMzi.s:983: Warning: dwarf line number information for .data ignored
encrypt.c: /tmp/ccUCwMzi.s:986: Warning: dwarf line number information for .data ignored
encrypt.c: /tmp/ccUCwMzi.s:987: Warning: dwarf line number information for .data ignored
encrypt.c: /tmp/ccUCwMzi.s:994: Warning: dwarf line number information for .data ignored
encrypt.c: /tmp/ccUCwMzi.s:995: Warning: dwarf line number information for .data ignored
encrypt.c: /tmp/ccUCwMzi.s:998: Warning: dwarf line number information for .data ignored
encrypt.c: /tmp/ccUCwMzi.s:1000: Warning: dwarf line number information for .data ignored
encrypt.c: /tmp/ccUCwMzi.s:1003: Warning: dwarf line number information for .data ignored
encrypt.c: /tmp/ccUCwMzi.s:1011: Warning: dwarf line number information for .data ignored
encrypt.c: /tmp/ccUCwMzi.s:1022: Warning: dwarf line number information for .data ignored
encrypt.c: /tmp/ccUCwMzi.s:1024: Warning: dwarf line number information for .data ignored
encrypt.c: /tmp/ccUCwMzi.s:1025: Warning: dwarf line number information for .data ignored
encrypt.c: /tmp/ccUCwMzi.s:1026: Warning: dwarf line number information for .data ignored
encrypt.c: /tmp/ccUCwMzi.s:1033: Warning: dwarf line number information for .data ignored
encrypt.c: /tmp/ccUCwMzi.s:1040: Warning: dwarf line number information for .data ignored
encrypt.c: /tmp/ccUCwMzi.s:1043: Warning: dwarf line number information for .data ignored
encrypt.c: /tmp/ccUCwMzi.s:1046: Warning: dwarf line number information for .data ignored
encrypt.c: /tmp/ccUCwMzi.s:1053: Warning: dwarf line number information for .data ignored
encrypt.c: /tmp/ccUCwMzi.s:1056: Warning: dwarf line number information for .data ignored
encrypt.c: ...

Number of similar (implementation,compiler) pairs: 1, namely:
ImplementationCompiler
T:sse4gcc -march=native -mtune=native -O2 -fwrapv -fPIC -fPIE -gdwarf-4 -Wall (14.2.0)

Compiler output


encrypt.c: /tmp/ccG8Dexp.s: Assembler messages:
encrypt.c: /tmp/ccG8Dexp.s:961: Warning: dwarf line number information for .data ignored
encrypt.c: /tmp/ccG8Dexp.s:963: Warning: dwarf line number information for .data ignored
encrypt.c: /tmp/ccG8Dexp.s:964: Warning: dwarf line number information for .data ignored
encrypt.c: /tmp/ccG8Dexp.s:965: Warning: dwarf line number information for .data ignored
encrypt.c: /tmp/ccG8Dexp.s:976: Warning: dwarf line number information for .data ignored
encrypt.c: /tmp/ccG8Dexp.s:983: Warning: dwarf line number information for .data ignored
encrypt.c: /tmp/ccG8Dexp.s:986: Warning: dwarf line number information for .data ignored
encrypt.c: /tmp/ccG8Dexp.s:987: Warning: dwarf line number information for .data ignored
encrypt.c: /tmp/ccG8Dexp.s:994: Warning: dwarf line number information for .data ignored
encrypt.c: /tmp/ccG8Dexp.s:995: Warning: dwarf line number information for .data ignored
encrypt.c: /tmp/ccG8Dexp.s:998: Warning: dwarf line number information for .data ignored
encrypt.c: /tmp/ccG8Dexp.s:1000: Warning: dwarf line number information for .data ignored
encrypt.c: /tmp/ccG8Dexp.s:1003: Warning: dwarf line number information for .data ignored
encrypt.c: /tmp/ccG8Dexp.s:1011: Warning: dwarf line number information for .data ignored
encrypt.c: /tmp/ccG8Dexp.s:1022: Warning: dwarf line number information for .data ignored
encrypt.c: /tmp/ccG8Dexp.s:1024: Warning: dwarf line number information for .data ignored
encrypt.c: /tmp/ccG8Dexp.s:1025: Warning: dwarf line number information for .data ignored
encrypt.c: /tmp/ccG8Dexp.s:1026: Warning: dwarf line number information for .data ignored
encrypt.c: /tmp/ccG8Dexp.s:1033: Warning: dwarf line number information for .data ignored
encrypt.c: /tmp/ccG8Dexp.s:1040: Warning: dwarf line number information for .data ignored
encrypt.c: /tmp/ccG8Dexp.s:1043: Warning: dwarf line number information for .data ignored
encrypt.c: /tmp/ccG8Dexp.s:1046: Warning: dwarf line number information for .data ignored
encrypt.c: /tmp/ccG8Dexp.s:1053: Warning: dwarf line number information for .data ignored
encrypt.c: /tmp/ccG8Dexp.s:1056: Warning: dwarf line number information for .data ignored
encrypt.c: ...

Number of similar (implementation,compiler) pairs: 1, namely:
ImplementationCompiler
T:sse4gcc -march=native -mtune=native -O3 -fwrapv -fPIC -fPIE -gdwarf-4 -Wall (14.2.0)

Compiler output


encrypt.c: /tmp/cc32XsmC.s: Assembler messages:
encrypt.c: /tmp/cc32XsmC.s:960: Warning: dwarf line number information for .data ignored
encrypt.c: /tmp/cc32XsmC.s:962: Warning: dwarf line number information for .data ignored
encrypt.c: /tmp/cc32XsmC.s:973: Warning: dwarf line number information for .data ignored
encrypt.c: /tmp/cc32XsmC.s:974: Warning: dwarf line number information for .data ignored
encrypt.c: /tmp/cc32XsmC.s:975: Warning: dwarf line number information for .data ignored
encrypt.c: /tmp/cc32XsmC.s:982: Warning: dwarf line number information for .data ignored
encrypt.c: /tmp/cc32XsmC.s:985: Warning: dwarf line number information for .data ignored
encrypt.c: /tmp/cc32XsmC.s:986: Warning: dwarf line number information for .data ignored
encrypt.c: /tmp/cc32XsmC.s:991: Warning: dwarf line number information for .data ignored
encrypt.c: /tmp/cc32XsmC.s:992: Warning: dwarf line number information for .data ignored
encrypt.c: /tmp/cc32XsmC.s:995: Warning: dwarf line number information for .data ignored
encrypt.c: /tmp/cc32XsmC.s:997: Warning: dwarf line number information for .data ignored
encrypt.c: /tmp/cc32XsmC.s:1000: Warning: dwarf line number information for .data ignored
encrypt.c: /tmp/cc32XsmC.s:1008: Warning: dwarf line number information for .data ignored
encrypt.c: /tmp/cc32XsmC.s:1018: Warning: dwarf line number information for .data ignored
encrypt.c: /tmp/cc32XsmC.s:1020: Warning: dwarf line number information for .data ignored
encrypt.c: /tmp/cc32XsmC.s:1032: Warning: dwarf line number information for .data ignored
encrypt.c: /tmp/cc32XsmC.s:1036: Warning: dwarf line number information for .data ignored
encrypt.c: /tmp/cc32XsmC.s:1037: Warning: dwarf line number information for .data ignored
encrypt.c: /tmp/cc32XsmC.s:1038: Warning: dwarf line number information for .data ignored
encrypt.c: /tmp/cc32XsmC.s:1045: Warning: dwarf line number information for .data ignored
encrypt.c: /tmp/cc32XsmC.s:1048: Warning: dwarf line number information for .data ignored
encrypt.c: /tmp/cc32XsmC.s:1051: Warning: dwarf line number information for .data ignored
encrypt.c: /tmp/cc32XsmC.s:1054: Warning: dwarf line number information for .data ignored
encrypt.c: ...

Number of similar (implementation,compiler) pairs: 1, namely:
ImplementationCompiler
T:sse4gcc -march=native -mtune=native -O -fwrapv -fPIC -fPIE -gdwarf-4 -Wall (14.2.0)

Compiler output


encrypt.c: /tmp/ccFIkY2X.s: Assembler messages:
encrypt.c: /tmp/ccFIkY2X.s:960: Warning: dwarf line number information for .data ignored
encrypt.c: /tmp/ccFIkY2X.s:962: Warning: dwarf line number information for .data ignored
encrypt.c: /tmp/ccFIkY2X.s:963: Warning: dwarf line number information for .data ignored
encrypt.c: /tmp/ccFIkY2X.s:964: Warning: dwarf line number information for .data ignored
encrypt.c: /tmp/ccFIkY2X.s:975: Warning: dwarf line number information for .data ignored
encrypt.c: /tmp/ccFIkY2X.s:982: Warning: dwarf line number information for .data ignored
encrypt.c: /tmp/ccFIkY2X.s:985: Warning: dwarf line number information for .data ignored
encrypt.c: /tmp/ccFIkY2X.s:986: Warning: dwarf line number information for .data ignored
encrypt.c: /tmp/ccFIkY2X.s:993: Warning: dwarf line number information for .data ignored
encrypt.c: /tmp/ccFIkY2X.s:994: Warning: dwarf line number information for .data ignored
encrypt.c: /tmp/ccFIkY2X.s:997: Warning: dwarf line number information for .data ignored
encrypt.c: /tmp/ccFIkY2X.s:999: Warning: dwarf line number information for .data ignored
encrypt.c: /tmp/ccFIkY2X.s:1002: Warning: dwarf line number information for .data ignored
encrypt.c: /tmp/ccFIkY2X.s:1010: Warning: dwarf line number information for .data ignored
encrypt.c: /tmp/ccFIkY2X.s:1020: Warning: dwarf line number information for .data ignored
encrypt.c: /tmp/ccFIkY2X.s:1022: Warning: dwarf line number information for .data ignored
encrypt.c: /tmp/ccFIkY2X.s:1023: Warning: dwarf line number information for .data ignored
encrypt.c: /tmp/ccFIkY2X.s:1024: Warning: dwarf line number information for .data ignored
encrypt.c: /tmp/ccFIkY2X.s:1031: Warning: dwarf line number information for .data ignored
encrypt.c: /tmp/ccFIkY2X.s:1038: Warning: dwarf line number information for .data ignored
encrypt.c: /tmp/ccFIkY2X.s:1041: Warning: dwarf line number information for .data ignored
encrypt.c: /tmp/ccFIkY2X.s:1044: Warning: dwarf line number information for .data ignored
encrypt.c: /tmp/ccFIkY2X.s:1051: Warning: dwarf line number information for .data ignored
encrypt.c: /tmp/ccFIkY2X.s:1054: Warning: dwarf line number information for .data ignored
encrypt.c: ...

Number of similar (implementation,compiler) pairs: 1, namely:
ImplementationCompiler
T:sse4gcc -march=native -mtune=native -Os -fwrapv -fPIC -fPIE -gdwarf-4 -Wall (14.2.0)

Namespace violations


omdsha256.o calc_L_i T
omdsha256.o double_block T
omdsha256.o final_masking_associated_data T
omdsha256.o final_masking_message T
omdsha256.o hash T
omdsha256.o increment_masking_associated_data T
omdsha256.o increment_masking_message T
omdsha256.o key_func T
omdsha256.o l2b T
omdsha256.o ntz T
omdsha256.o omdsha256_process T
omdsha256.o triple_block T
omdsha256.o xor_block T
sha256.o sha256_comp T

Number of similar (implementation,compiler) pairs: 9, namely:
ImplementationCompiler
T:refclang -march=native -O2 -fwrapv -Qunused-arguments -fPIC -fPIE -gdwarf-4 -Wall (Debian_Clang_19.1.7_(1+b1))
T:refclang -march=native -O3 -fwrapv -Qunused-arguments -fPIC -fPIE -gdwarf-4 -Wall (Debian_Clang_19.1.7_(1+b1))
T:refclang -march=native -O -fwrapv -Qunused-arguments -fPIC -fPIE -gdwarf-4 -Wall (Debian_Clang_19.1.7_(1+b1))
T:refclang -march=native -Os -fwrapv -Qunused-arguments -fPIC -fPIE -gdwarf-4 -Wall (Debian_Clang_19.1.7_(1+b1))
T:refclang -mcpu=native -O3 -fwrapv -Qunused-arguments -fPIC -fPIE -gdwarf-4 -Wall (Debian_Clang_19.1.7_(1+b1))
T:refgcc -march=native -mtune=native -O2 -fwrapv -fPIC -fPIE -gdwarf-4 -Wall (14.2.0)
T:refgcc -march=native -mtune=native -O3 -fwrapv -fPIC -fPIE -gdwarf-4 -Wall (14.2.0)
T:refgcc -march=native -mtune=native -O -fwrapv -fPIC -fPIE -gdwarf-4 -Wall (14.2.0)
T:refgcc -march=native -mtune=native -Os -fwrapv -fPIC -fPIE -gdwarf-4 -Wall (14.2.0)