Implementation notes: amd64, samba, crypto_kem/titaniumccalite

Computer: samba
Architecture: amd64
CPU ID: GenuineIntel-000506e3-bfebfbff
SUPERCOP version: 20210604
Operation: crypto_kem
Primitive: titaniumccalite
TimeObject sizeTest sizeImplementationCompilerBenchmark dateSUPERCOP version
195060976039 0 0235998 828 1784T:avx2clang_-march=native_-O3_-fomit-frame-pointer_-fwrapv_-Qunused-arguments_-fPIC_-fPIE2021011920210114
197850871502 0 0231430 828 1784T:avx2clang_-march=native_-O_-fomit-frame-pointer_-fwrapv_-Qunused-arguments_-fPIC_-fPIE2021011920210114
198720571502 0 0231430 828 1784T:avx2clang_-march=native_-O2_-fomit-frame-pointer_-fwrapv_-Qunused-arguments_-fPIC_-fPIE2021011920210114
200912165124 0 0221308 820 1784T:avx2clang_-march=native_-Os_-fomit-frame-pointer_-fwrapv_-Qunused-arguments_-fPIC_-fPIE2021011920210114
203271899279 0 0260055 828 1832T:avx2gcc_-march=native_-mtune=native_-O3_-fomit-frame-pointer_-fwrapv_-fPIC_-fPIE2021011920210114
209993370994 0 0228751 828 1832T:avx2gcc_-march=native_-mtune=native_-O2_-fomit-frame-pointer_-fwrapv_-fPIC_-fPIE2021011920210114
220610070781 0 0228303 828 1832T:avx2gcc_-march=native_-mtune=native_-O_-fomit-frame-pointer_-fwrapv_-fPIC_-fPIE2021011920210114
2829408113367 0 0271494 828 1784T:optclang_-march=native_-O3_-fomit-frame-pointer_-fwrapv_-Qunused-arguments_-fPIC_-fPIE2021011920210114
285746397521 0 0255590 828 1784T:optclang_-march=native_-O_-fomit-frame-pointer_-fwrapv_-Qunused-arguments_-fPIC_-fPIE2021011920210114
286976037382 0 0193628 820 1784T:optclang_-march=native_-Os_-fomit-frame-pointer_-fwrapv_-Qunused-arguments_-fPIC_-fPIE2021011920210114
287551097521 0 0255590 828 1784T:optclang_-march=native_-O2_-fomit-frame-pointer_-fwrapv_-Qunused-arguments_-fPIC_-fPIE2021011920210114
289321884027 0 0244719 828 1832T:optgcc_-march=native_-mtune=native_-O3_-fomit-frame-pointer_-fwrapv_-fPIC_-fPIE2021011920210114
300248260083 0 0219414 828 1784T:optclang_-mcpu=native_-O3_-fomit-frame-pointer_-fwrapv_-Qunused-arguments_-fPIC_-fPIE2021011920210114
325801540355 0 0198327 828 1832T:optgcc_-march=native_-mtune=native_-O2_-fomit-frame-pointer_-fwrapv_-fPIC_-fPIE2021011920210114
377744640076 0 0197815 828 1832T:optgcc_-march=native_-mtune=native_-O_-fomit-frame-pointer_-fwrapv_-fPIC_-fPIE2021011920210114
28901548561671 0 0220950 828 1784T:refclang_-mcpu=native_-O3_-fomit-frame-pointer_-fwrapv_-Qunused-arguments_-fPIC_-fPIE2021011920210114
29893639029972 0 0187775 828 1832T:refgcc_-march=native_-mtune=native_-O2_-fomit-frame-pointer_-fwrapv_-fPIC_-fPIE2021011920210114
30756357746471 0 0207167 828 1832T:refgcc_-march=native_-mtune=native_-O3_-fomit-frame-pointer_-fwrapv_-fPIC_-fPIE2021011920210114
32309312550169 0 0209838 828 1784T:refclang_-march=native_-O2_-fomit-frame-pointer_-fwrapv_-Qunused-arguments_-fPIC_-fPIE2021011920210114
32311836089038 0 0248782 828 1784T:refclang_-march=native_-O3_-fomit-frame-pointer_-fwrapv_-Qunused-arguments_-fPIC_-fPIE2021011920210114
32317412050169 0 0209838 828 1784T:refclang_-march=native_-O_-fomit-frame-pointer_-fwrapv_-Qunused-arguments_-fPIC_-fPIE2021011920210114
32773059329428 0 0185676 820 1784T:refclang_-march=native_-Os_-fomit-frame-pointer_-fwrapv_-Qunused-arguments_-fPIC_-fPIE2021011920210114
34758190930241 0 0187839 828 1832T:refgcc_-march=native_-mtune=native_-O_-fomit-frame-pointer_-fwrapv_-fPIC_-fPIE2021011920210114

Compiler output

Implementation: T:avx2
Security model: timingleaks
Compiler: clang -mcpu=native -O3 -fomit-frame-pointer -fwrapv -Qunused-arguments -fPIC -fPIE
encrypt.c: encrypt.c:64:8: error: always_inline function '_mm256_loadu_si256' requires target feature 'sse4.2', but would be inlined into function 'crypto_encrypt_keypair' that is compiled without support for 'sse4.2'
encrypt.c: u = _mm256_loadu_si256((__m256i *)(a[i] + j));
encrypt.c: ^
encrypt.c: encrypt.c:65:8: error: always_inline function '_mm256_loadu_si256' requires target feature 'sse4.2', but would be inlined into function 'crypto_encrypt_keypair' that is compiled without support for 'sse4.2'
encrypt.c: v = _mm256_loadu_si256((__m256i *)(s + j));
encrypt.c: ^
encrypt.c: encrypt.c:66:8: error: always_inline function '_mm256_mul_epu32' requires target feature 'avx2', but would be inlined into function 'crypto_encrypt_keypair' that is compiled without support for 'avx2'
encrypt.c: t = _mm256_mul_epu32(u, v);
encrypt.c: ^
encrypt.c: encrypt.c:67:4: error: always_inline function '_mm256_storeu_si256' requires target feature 'sse4.2', but would be inlined into function 'crypto_encrypt_keypair' that is compiled without support for 'sse4.2'
encrypt.c: _mm256_storeu_si256((__m256i *)(a[i] + j), t);
encrypt.c: ^
encrypt.c: encrypt.c:79:8: error: always_inline function '_mm256_loadu_si256' requires target feature 'sse4.2', but would be inlined into function 'crypto_encrypt_keypair' that is compiled without support for 'sse4.2'
encrypt.c: u = _mm256_loadu_si256((__m256i *)(a[i] + j));
encrypt.c: ^
encrypt.c: encrypt.c:80:8: error: always_inline function '_mm256_loadu_si256' requires target feature 'sse4.2', but would be inlined into function 'crypto_encrypt_keypair' that is compiled without support for 'sse4.2'
encrypt.c: v = _mm256_loadu_si256((__m256i *)(e[i] + j));
encrypt.c: ^
encrypt.c: encrypt.c:81:8: error: always_inline function '_mm256_add_epi64' requires target feature 'avx2', but would be inlined into function 'crypto_encrypt_keypair' that is compiled without support for 'avx2'
encrypt.c: t = _mm256_add_epi64(u, v);
encrypt.c: ^
encrypt.c: encrypt.c:82:9: error: always_inline function '_mm256_mul_epu32' requires target feature 'avx2', but would be inlined into function 'crypto_encrypt_keypair' that is compiled without support for 'avx2'
encrypt.c: t1 = _mm256_mul_epu32(t, V_B4Q_B4Q_B4Q_B4Q);
encrypt.c: ^
encrypt.c: encrypt.c:83:9: error: always_inline function '_mm256_srli_epi64' requires target feature 'avx2', but would be inlined into function 'crypto_encrypt_keypair' that is compiled without support for 'avx2'
encrypt.c: ...

Number of similar (compiler,implementation) pairs: 1, namely:
CompilerImplementations
clang -mcpu=native -O3 -fomit-frame-pointer -fwrapv -Qunused-arguments -fPIC -fPIE T:avx2

Compiler output

Implementation: T:avx2
Security model: timingleaks
Compiler: gcc -march=native -mtune=native -Os -fomit-frame-pointer -fwrapv -fPIC -fPIE
try.c: crypto_kem_titaniumccalite.a(sampler.o): In function `sampler_zq':
try.c: sampler.c:(.text+0x...): undefined reference to `load_24'
try.c: sampler.c:(.text+0x...): undefined reference to `barrett_zq'
try.c: collect2: error: ld returned 1 exit status

Number of similar (compiler,implementation) pairs: 1, namely:
CompilerImplementations
gcc -march=native -mtune=native -Os -fomit-frame-pointer -fwrapv -fPIC -fPIE T:avx2

Compiler output

Implementation: T:opt
Security model: timingleaks
Compiler: gcc -march=native -mtune=native -Os -fomit-frame-pointer -fwrapv -fPIC -fPIE
try.c: crypto_kem_titaniumccalite.a(encrypt.o): In function `crypto_encrypt_keypair':
try.c: encrypt.c:(.text+0x...): undefined reference to `barrett_4q2'
try.c: encrypt.c:(.text+0x...): undefined reference to `barrett_4q'
try.c: crypto_kem_titaniumccalite.a(encrypt.o): In function `crypto_encrypt':
try.c: encrypt.c:(.text+0x...): undefined reference to `barrett_4q2'
try.c: encrypt.c:(.text+0x...): undefined reference to `barrett_4q2'
try.c: crypto_kem_titaniumccalite.a(encrypt.o): In function `crypto_encrypt_open':
try.c: encrypt.c:(.text+0x...): undefined reference to `barrett_4q2'
try.c: crypto_kem_titaniumccalite.a(fastrandombytes.o): In function `fastrandombytes':
try.c: fastrandombytes.c:(.text+0x...): undefined reference to `load_32'
try.c: fastrandombytes.c:(.text+0x...): undefined reference to `store_32'
try.c: crypto_kem_titaniumccalite.a(ntt.o): In function `ntt_butterfly_1024_1536':
try.c: ntt.c:(.text+0x...): undefined reference to `barrett_8q'
try.c: crypto_kem_titaniumccalite.a(ntt.o): In function `ntt_butterfly_1536_768':
try.c: ntt.c:(.text+0x...): undefined reference to `barrett_16q'
try.c: crypto_kem_titaniumccalite.a(ntt.o): In function `ntt_butterfly_512_1280':
try.c: ntt.c:(.text+0x...): undefined reference to `barrett_4q'
try.c: crypto_kem_titaniumccalite.a(ntt.o): In function `ntt_butterfly_1024_1280':
try.c: ntt.c:(.text+0x...): undefined reference to `barrett_8q'
try.c: crypto_kem_titaniumccalite.a(ntt.o): In function `ntt_butterfly_1280_1280_inv':
try.c: ntt.c:(.text+0x...): undefined reference to `barrett_16q'
try.c: crypto_kem_titaniumccalite.a(ntt.o): In function `ntt_butterfly_768_768_inv':
try.c: ntt.c:(.text+0x...): undefined reference to `barrett_8q'
try.c: crypto_kem_titaniumccalite.a(ntt.o): In function `ntt_butterfly_512_768':
try.c: ntt.c:(.text+0x...): undefined reference to `barrett_4q'
try.c: ...

Number of similar (compiler,implementation) pairs: 1, namely:
CompilerImplementations
gcc -march=native -mtune=native -Os -fomit-frame-pointer -fwrapv -fPIC -fPIE T:opt

Compiler output

Implementation: T:ref
Security model: timingleaks
Compiler: gcc -march=native -mtune=native -Os -fomit-frame-pointer -fwrapv -fPIC -fPIE
try.c: crypto_kem_titaniumccalite.a(fastrandombytes.o): In function `fastrandombytes':
try.c: fastrandombytes.c:(.text+0x...): undefined reference to `load_32'
try.c: fastrandombytes.c:(.text+0x...): undefined reference to `store_32'
try.c: crypto_kem_titaniumccalite.a(sampler.o): In function `sampler_zq':
try.c: sampler.c:(.text+0x...): undefined reference to `load_24'
try.c: collect2: error: ld returned 1 exit status

Number of similar (compiler,implementation) pairs: 1, namely:
CompilerImplementations
gcc -march=native -mtune=native -Os -fomit-frame-pointer -fwrapv -fPIC -fPIE T:ref

Namespace violations

Implementation: T:avx2
Security model: timingleaks
Compiler: clang -march=native -O2 -fomit-frame-pointer -fwrapv -Qunused-arguments -fPIC -fPIE
encrypt.o crypto_encrypt T
encrypt.o crypto_encrypt_keypair T
encrypt.o crypto_encrypt_open T
fastrandombytes.o fastrandombytes T
fastrandombytes.o fastrandombytes_setseed T
fastrandombytes.o iv C
fastrandombytes.o key C
ntt.o intt_1280_1280_inv T
ntt.o intt_1536_256 T
ntt.o intt_1536_768 T
ntt.o intt_768_256 T
ntt.o ntt_1024_1280 T
ntt.o ntt_1024_1536 T
ntt.o ntt_1280_1536 T
ntt.o ntt_512_1280 T
ntt.o ntt_512_768 T
ntt.o ntt_768_768_inv T
pack.o poly_decode T
pack.o poly_decode_c2 T
pack.o poly_encode T
pack.o poly_encode_c2 T
sampler.o sampler_binomial T
sampler.o sampler_zb T
sampler.o sampler_zq T

Number of similar (compiler,implementation) pairs: 15, namely:
CompilerImplementations
clang -march=native -O2 -fomit-frame-pointer -fwrapv -Qunused-arguments -fPIC -fPIE T:avx2
clang -march=native -O3 -fomit-frame-pointer -fwrapv -Qunused-arguments -fPIC -fPIE T:avx2
clang -march=native -O -fomit-frame-pointer -fwrapv -Qunused-arguments -fPIC -fPIE T:avx2
clang -march=native -Os -fomit-frame-pointer -fwrapv -Qunused-arguments -fPIC -fPIE T:avx2
gcc -march=native -mtune=native -O2 -fomit-frame-pointer -fwrapv -fPIC -fPIE T:avx2
gcc -march=native -mtune=native -O3 -fomit-frame-pointer -fwrapv -fPIC -fPIE T:avx2
gcc -march=native -mtune=native -O -fomit-frame-pointer -fwrapv -fPIC -fPIE T:avx2
clang -march=native -O2 -fomit-frame-pointer -fwrapv -Qunused-arguments -fPIC -fPIE T:opt
clang -march=native -O3 -fomit-frame-pointer -fwrapv -Qunused-arguments -fPIC -fPIE T:opt
clang -march=native -O -fomit-frame-pointer -fwrapv -Qunused-arguments -fPIC -fPIE T:opt
clang -march=native -Os -fomit-frame-pointer -fwrapv -Qunused-arguments -fPIC -fPIE T:opt
clang -mcpu=native -O3 -fomit-frame-pointer -fwrapv -Qunused-arguments -fPIC -fPIE T:opt
gcc -march=native -mtune=native -O2 -fomit-frame-pointer -fwrapv -fPIC -fPIE T:opt
gcc -march=native -mtune=native -O3 -fomit-frame-pointer -fwrapv -fPIC -fPIE T:opt
gcc -march=native -mtune=native -O -fomit-frame-pointer -fwrapv -fPIC -fPIE T:opt

Namespace violations

Implementation: T:ref
Security model: timingleaks
Compiler: clang -march=native -O2 -fomit-frame-pointer -fwrapv -Qunused-arguments -fPIC -fPIE
encrypt.o crypto_encrypt T
encrypt.o crypto_encrypt_keypair T
encrypt.o crypto_encrypt_open T
fastrandombytes.o fastrandombytes T
fastrandombytes.o fastrandombytes_setseed T
fastrandombytes.o iv C
fastrandombytes.o key C
ntt.o intt_1280_1280_inv T
ntt.o intt_1536_1536 T
ntt.o intt_768_768 T
ntt.o ntt_1280_1280 T
ntt.o ntt_768_768_inv T
pack.o poly_decode T
pack.o poly_decode_c2 T
pack.o poly_encode T
pack.o poly_encode_c2 T
product.o mp T
product.o product T
sampler.o sampler_binomial T
sampler.o sampler_zb T
sampler.o sampler_zq T

Number of similar (compiler,implementation) pairs: 8, namely:
CompilerImplementations
clang -march=native -O2 -fomit-frame-pointer -fwrapv -Qunused-arguments -fPIC -fPIE T:ref
clang -march=native -O3 -fomit-frame-pointer -fwrapv -Qunused-arguments -fPIC -fPIE T:ref
clang -march=native -O -fomit-frame-pointer -fwrapv -Qunused-arguments -fPIC -fPIE T:ref
clang -march=native -Os -fomit-frame-pointer -fwrapv -Qunused-arguments -fPIC -fPIE T:ref
clang -mcpu=native -O3 -fomit-frame-pointer -fwrapv -Qunused-arguments -fPIC -fPIE T:ref
gcc -march=native -mtune=native -O2 -fomit-frame-pointer -fwrapv -fPIC -fPIE T:ref
gcc -march=native -mtune=native -O3 -fomit-frame-pointer -fwrapv -fPIC -fPIE T:ref
gcc -march=native -mtune=native -O -fomit-frame-pointer -fwrapv -fPIC -fPIE T:ref