Implementation notes: amd64, saber214, crypto_hash/luffa512

Computer: saber214
Architecture: amd64
CPU ID: AuthenticAMD-00600f20-178bfbff
SUPERCOP version: 20211108
Operation: crypto_hash
Primitive: luffa512
TimeObject sizeTest sizeImplementationCompilerBenchmark dateSUPERCOP version
312468986 0 020785 776 1296T:sse2clang_-march=native_-O2_-fomit-frame-pointer_-fwrapv_-Qunused-arguments_-fPIC_-fPIE2021053020210529
312548986 0 020785 776 1296T:sse2clang_-march=native_-O_-fomit-frame-pointer_-fwrapv_-Qunused-arguments_-fPIC_-fPIE2021053020210529
312929250 0 022625 776 1296T:sse2clang_-march=native_-O3_-fomit-frame-pointer_-fwrapv_-Qunused-arguments_-fPIC_-fPIE2021053020210529
335327806 0 017151 768 1280T:sse2clang_-march=native_-Os_-fomit-frame-pointer_-fwrapv_-Qunused-arguments_-fPIC_-fPIE2021053020210529
414799824 0 022910 776 1392T:sse2gcc_-march=native_-mtune=native_-O3_-fomit-frame-pointer_-fwrapv_-fPIC_-fPIE2021053020210529
4154011738 0 024073 776 1280T:sse2clang_-mcpu=native_-O3_-fomit-frame-pointer_-fwrapv_-Qunused-arguments_-fPIC_-fPIE2021053020210529
446959069 0 019805 768 1392T:sse2gcc_-march=native_-mtune=native_-O2_-fomit-frame-pointer_-fwrapv_-fPIC_-fPIE2021053020210529
447748596 0 018337 752 1360T:sse2gcc_-march=native_-mtune=native_-Os_-fomit-frame-pointer_-fwrapv_-fPIC_-fPIE2021053020210529
479369669 0 020261 768 1392T:sse2gcc_-march=native_-mtune=native_-O_-fomit-frame-pointer_-fwrapv_-fPIC_-fPIE2021053020210529
7774327045 0 040238 776 808T:sphlibgcc_-march=native_-mtune=native_-O3_-fomit-frame-pointer_-fwrapv_-fPIC_-fPIE2021053020210529
7870727057 0 037942 776 808T:sphlibgcc_-march=native_-mtune=native_-O2_-fomit-frame-pointer_-fwrapv_-fPIC_-fPIE2021053020210529
7941426490 0 037238 776 808T:sphlibgcc_-march=native_-mtune=native_-O_-fomit-frame-pointer_-fwrapv_-fPIC_-fPIE2021053020210529
8660822643 0 032457 752 776T:sphlibgcc_-march=native_-mtune=native_-Os_-fomit-frame-pointer_-fwrapv_-fPIC_-fPIE2021053020210529
9244019784 320 032161 1104 736T:opt32clang_-mcpu=native_-O3_-fomit-frame-pointer_-fwrapv_-Qunused-arguments_-fPIC_-fPIE2021053020210529
9667626444 0 035911 768 736T:sphlibclang_-march=native_-Os_-fomit-frame-pointer_-fwrapv_-Qunused-arguments_-fPIC_-fPIE2021053020210529
9677827430 0 040009 776 736T:sphlibclang_-mcpu=native_-O3_-fomit-frame-pointer_-fwrapv_-Qunused-arguments_-fPIC_-fPIE2021053020210529
9717626966 0 040609 776 752T:sphlibclang_-march=native_-O3_-fomit-frame-pointer_-fwrapv_-Qunused-arguments_-fPIC_-fPIE2021053020210529
9729326934 0 039009 776 752T:sphlibclang_-march=native_-O_-fomit-frame-pointer_-fwrapv_-Qunused-arguments_-fPIC_-fPIE2021053020210529
9740726934 0 039009 776 752T:sphlibclang_-march=native_-O2_-fomit-frame-pointer_-fwrapv_-Qunused-arguments_-fPIC_-fPIE2021053020210529
11690616736 320 030041 1104 752T:opt32clang_-march=native_-O3_-fomit-frame-pointer_-fwrapv_-Qunused-arguments_-fPIC_-fPIE2021053020210529
12183714510 320 026505 1104 752T:opt32clang_-march=native_-O2_-fomit-frame-pointer_-fwrapv_-Qunused-arguments_-fPIC_-fPIE2021053020210529
13739414510 320 026505 1104 752T:opt32clang_-march=native_-O_-fomit-frame-pointer_-fwrapv_-Qunused-arguments_-fPIC_-fPIE2021053020210529
1382999575 320 018943 1096 736T:opt32clang_-march=native_-Os_-fomit-frame-pointer_-fwrapv_-Qunused-arguments_-fPIC_-fPIE2021053020210529
14926210253 320 021061 1096 808T:opt32gcc_-march=native_-mtune=native_-O2_-fomit-frame-pointer_-fwrapv_-fPIC_-fPIE2021053020210529
1534879198 320 019017 1080 776T:opt32gcc_-march=native_-mtune=native_-Os_-fomit-frame-pointer_-fwrapv_-fPIC_-fPIE2021053020210529
16206310433 320 021101 1096 808T:opt32gcc_-march=native_-mtune=native_-O_-fomit-frame-pointer_-fwrapv_-fPIC_-fPIE2021053020210529

Test failure

Implementation: T:opt32
Security model: timingleaks
Compiler: gcc -march=native -mtune=native -O3 -fomit-frame-pointer -fwrapv -fPIC -fPIE
error 111

Number of similar (compiler,implementation) pairs: 1, namely:
CompilerImplementations
gcc -march=native -mtune=native -O3 -fomit-frame-pointer -fwrapv -fPIC -fPIE T:opt32

Compiler output

Implementation: T:sse2_x64asm
Security model: timingleaks
Compiler: clang -march=native -O2 -fomit-frame-pointer -fwrapv -Qunused-arguments -fPIC -fPIE
luffa_x64asm.s: luffa_x64asm.s:780:13: error: unknown token in expression
luffa_x64asm.s: movaps %xmm0, [IV ]
luffa_x64asm.s: ^
luffa_x64asm.s: luffa_x64asm.s:781:13: error: unknown token in expression
luffa_x64asm.s: movaps %xmm1, [IV+16]
luffa_x64asm.s: ^
luffa_x64asm.s: luffa_x64asm.s:782:13: error: unknown token in expression
luffa_x64asm.s: movaps %xmm2, [IV+32]
luffa_x64asm.s: ^
luffa_x64asm.s: luffa_x64asm.s:783:13: error: unknown token in expression
luffa_x64asm.s: movaps %xmm3, [IV+48]
luffa_x64asm.s: ^
luffa_x64asm.s: luffa_x64asm.s:784:13: error: unknown token in expression
luffa_x64asm.s: movaps %xmm4, [IV+64]
luffa_x64asm.s: ^
luffa_x64asm.s: luffa_x64asm.s:785:13: error: unknown token in expression
luffa_x64asm.s: movaps %xmm5, [IV+80]
luffa_x64asm.s: ^
luffa_x64asm.s: luffa_x64asm.s:786:14: error: unknown token in expression
luffa_x64asm.s: movups [%rdi ], %xmm0
luffa_x64asm.s: ^
luffa_x64asm.s: luffa_x64asm.s:787:14: error: unknown token in expression
luffa_x64asm.s: movups [%rdi+16], %xmm1
luffa_x64asm.s: ^
luffa_x64asm.s: luffa_x64asm.s:788:14: error: unknown token in expression
luffa_x64asm.s: ...

Number of similar (compiler,implementation) pairs: 10, namely:
CompilerImplementations
clang -march=native -O2 -fomit-frame-pointer -fwrapv -Qunused-arguments -fPIC -fPIE T:sse2_x64asm
clang -march=native -O3 -fomit-frame-pointer -fwrapv -Qunused-arguments -fPIC -fPIE T:sse2_x64asm
clang -march=native -O -fomit-frame-pointer -fwrapv -Qunused-arguments -fPIC -fPIE T:sse2_x64asm
clang -march=native -Os -fomit-frame-pointer -fwrapv -Qunused-arguments -fPIC -fPIE T:sse2_x64asm
clang -mcpu=native -O3 -fomit-frame-pointer -fwrapv -Qunused-arguments -fPIC -fPIE T:sse2_x64asm
clang -march=native -O2 -fomit-frame-pointer -fwrapv -Qunused-arguments -fPIC -fPIE T:ssse3_x64asm
clang -march=native -O3 -fomit-frame-pointer -fwrapv -Qunused-arguments -fPIC -fPIE T:ssse3_x64asm
clang -march=native -O -fomit-frame-pointer -fwrapv -Qunused-arguments -fPIC -fPIE T:ssse3_x64asm
clang -march=native -Os -fomit-frame-pointer -fwrapv -Qunused-arguments -fPIC -fPIE T:ssse3_x64asm
clang -mcpu=native -O3 -fomit-frame-pointer -fwrapv -Qunused-arguments -fPIC -fPIE T:ssse3_x64asm

Compiler output

Implementation: T:sse2_x64asm
Security model: timingleaks
Compiler: gcc -march=native -mtune=native -O2 -fomit-frame-pointer -fwrapv -fPIC -fPIE
try.c: /usr/bin/ld: libcrypto_hash_luffa512.a(luffa_x64asm.o): relocation R_X86_64_32S against symbol `IV' can not be used when making a PIE object; recompile with -fPIC
try.c: /usr/bin/ld: final link failed: Nonrepresentable section on output
try.c: collect2: error: ld returned 1 exit status

Number of similar (compiler,implementation) pairs: 16, namely:
CompilerImplementations
gcc -march=native -mtune=native -O2 -fomit-frame-pointer -fwrapv -fPIC -fPIE T:sse2_x64asm
gcc -march=native -mtune=native -O3 -fomit-frame-pointer -fwrapv -fPIC -fPIE T:sse2_x64asm
gcc -march=native -mtune=native -O -fomit-frame-pointer -fwrapv -fPIC -fPIE T:sse2_x64asm
gcc -march=native -mtune=native -Os -fomit-frame-pointer -fwrapv -fPIC -fPIE T:sse2_x64asm
gcc -march=native -mtune=native -O2 -fomit-frame-pointer -fwrapv -fPIC -fPIE T:sse2_x64asm-2
gcc -march=native -mtune=native -O3 -fomit-frame-pointer -fwrapv -fPIC -fPIE T:sse2_x64asm-2
gcc -march=native -mtune=native -O -fomit-frame-pointer -fwrapv -fPIC -fPIE T:sse2_x64asm-2
gcc -march=native -mtune=native -Os -fomit-frame-pointer -fwrapv -fPIC -fPIE T:sse2_x64asm-2
gcc -march=native -mtune=native -O2 -fomit-frame-pointer -fwrapv -fPIC -fPIE T:ssse3_x64asm
gcc -march=native -mtune=native -O3 -fomit-frame-pointer -fwrapv -fPIC -fPIE T:ssse3_x64asm
gcc -march=native -mtune=native -O -fomit-frame-pointer -fwrapv -fPIC -fPIE T:ssse3_x64asm
gcc -march=native -mtune=native -Os -fomit-frame-pointer -fwrapv -fPIC -fPIE T:ssse3_x64asm
gcc -march=native -mtune=native -O2 -fomit-frame-pointer -fwrapv -fPIC -fPIE T:ssse3_x64asm-2
gcc -march=native -mtune=native -O3 -fomit-frame-pointer -fwrapv -fPIC -fPIE T:ssse3_x64asm-2
gcc -march=native -mtune=native -O -fomit-frame-pointer -fwrapv -fPIC -fPIE T:ssse3_x64asm-2
gcc -march=native -mtune=native -Os -fomit-frame-pointer -fwrapv -fPIC -fPIE T:ssse3_x64asm-2

Compiler output

Implementation: T:sse2_x64asm-2
Security model: timingleaks
Compiler: clang -march=native -O2 -fomit-frame-pointer -fwrapv -Qunused-arguments -fPIC -fPIE
luffa_x64asm.s: luffa_x64asm.s:780:13: error: unknown token in expression
luffa_x64asm.s: movdqa %xmm0, [IV ]
luffa_x64asm.s: ^
luffa_x64asm.s: luffa_x64asm.s:781:13: error: unknown token in expression
luffa_x64asm.s: movdqa %xmm1, [IV+16]
luffa_x64asm.s: ^
luffa_x64asm.s: luffa_x64asm.s:782:13: error: unknown token in expression
luffa_x64asm.s: movdqa %xmm2, [IV+32]
luffa_x64asm.s: ^
luffa_x64asm.s: luffa_x64asm.s:783:13: error: unknown token in expression
luffa_x64asm.s: movdqa %xmm3, [IV+48]
luffa_x64asm.s: ^
luffa_x64asm.s: luffa_x64asm.s:784:13: error: unknown token in expression
luffa_x64asm.s: movdqa %xmm4, [IV+64]
luffa_x64asm.s: ^
luffa_x64asm.s: luffa_x64asm.s:785:13: error: unknown token in expression
luffa_x64asm.s: movdqa %xmm5, [IV+80]
luffa_x64asm.s: ^
luffa_x64asm.s: luffa_x64asm.s:786:14: error: unknown token in expression
luffa_x64asm.s: movups [%rdi ], %xmm0
luffa_x64asm.s: ^
luffa_x64asm.s: luffa_x64asm.s:787:14: error: unknown token in expression
luffa_x64asm.s: movups [%rdi+16], %xmm1
luffa_x64asm.s: ^
luffa_x64asm.s: luffa_x64asm.s:788:14: error: unknown token in expression
luffa_x64asm.s: ...

Number of similar (compiler,implementation) pairs: 10, namely:
CompilerImplementations
clang -march=native -O2 -fomit-frame-pointer -fwrapv -Qunused-arguments -fPIC -fPIE T:sse2_x64asm-2
clang -march=native -O3 -fomit-frame-pointer -fwrapv -Qunused-arguments -fPIC -fPIE T:sse2_x64asm-2
clang -march=native -O -fomit-frame-pointer -fwrapv -Qunused-arguments -fPIC -fPIE T:sse2_x64asm-2
clang -march=native -Os -fomit-frame-pointer -fwrapv -Qunused-arguments -fPIC -fPIE T:sse2_x64asm-2
clang -mcpu=native -O3 -fomit-frame-pointer -fwrapv -Qunused-arguments -fPIC -fPIE T:sse2_x64asm-2
clang -march=native -O2 -fomit-frame-pointer -fwrapv -Qunused-arguments -fPIC -fPIE T:ssse3_x64asm-2
clang -march=native -O3 -fomit-frame-pointer -fwrapv -Qunused-arguments -fPIC -fPIE T:ssse3_x64asm-2
clang -march=native -O -fomit-frame-pointer -fwrapv -Qunused-arguments -fPIC -fPIE T:ssse3_x64asm-2
clang -march=native -Os -fomit-frame-pointer -fwrapv -Qunused-arguments -fPIC -fPIE T:ssse3_x64asm-2
clang -mcpu=native -O3 -fomit-frame-pointer -fwrapv -Qunused-arguments -fPIC -fPIE T:ssse3_x64asm-2

Compiler output

Implementation: T:ssse3_x64asm-PS
Security model: timingleaks
Compiler: clang -march=native -O2 -fomit-frame-pointer -fwrapv -Qunused-arguments -fPIC -fPIE
luffa256_x64asm.s: luffa256_x64asm.s:297:9: error: unknown token in expression
luffa256_x64asm.s: movaps %xmm0, [IV ]
luffa256_x64asm.s: ^
luffa256_x64asm.s: luffa256_x64asm.s:298:9: error: unknown token in expression
luffa256_x64asm.s: movaps %xmm1, [IV+16]
luffa256_x64asm.s: ^
luffa256_x64asm.s: luffa256_x64asm.s:299:9: error: unknown token in expression
luffa256_x64asm.s: movaps %xmm2, [IV+32]
luffa256_x64asm.s: ^
luffa256_x64asm.s: luffa256_x64asm.s:300:9: error: unknown token in expression
luffa256_x64asm.s: movaps %xmm3, [IV+48]
luffa256_x64asm.s: ^
luffa256_x64asm.s: luffa256_x64asm.s:301:9: error: unknown token in expression
luffa256_x64asm.s: movaps %xmm4, [IV+64]
luffa256_x64asm.s: ^
luffa256_x64asm.s: luffa256_x64asm.s:302:9: error: unknown token in expression
luffa256_x64asm.s: movaps %xmm5, [IV+80]
luffa256_x64asm.s: ^
luffa256_x64asm.s: luffa256_x64asm.s:303:10: error: unknown token in expression
luffa256_x64asm.s: movups [%rdi ], %xmm0
luffa256_x64asm.s: ^
luffa256_x64asm.s: luffa256_x64asm.s:304:10: error: unknown token in expression
luffa256_x64asm.s: movups [%rdi+16], %xmm1
luffa256_x64asm.s: ^
luffa256_x64asm.s: luffa256_x64asm.s:305:10: error: unknown token in expression
luffa256_x64asm.s: ...

Number of similar (compiler,implementation) pairs: 5, namely:
CompilerImplementations
clang -march=native -O2 -fomit-frame-pointer -fwrapv -Qunused-arguments -fPIC -fPIE T:ssse3_x64asm-PS
clang -march=native -O3 -fomit-frame-pointer -fwrapv -Qunused-arguments -fPIC -fPIE T:ssse3_x64asm-PS
clang -march=native -O -fomit-frame-pointer -fwrapv -Qunused-arguments -fPIC -fPIE T:ssse3_x64asm-PS
clang -march=native -Os -fomit-frame-pointer -fwrapv -Qunused-arguments -fPIC -fPIE T:ssse3_x64asm-PS
clang -mcpu=native -O3 -fomit-frame-pointer -fwrapv -Qunused-arguments -fPIC -fPIE T:ssse3_x64asm-PS

Compiler output

Implementation: T:ssse3_x64asm-PS
Security model: timingleaks
Compiler: gcc -march=native -mtune=native -O2 -fomit-frame-pointer -fwrapv -fPIC -fPIE
try.c: /usr/bin/ld: libcrypto_hash_luffa512.a(luffa256_x64asm.o): relocation R_X86_64_32S against `.rodata' can not be used when making a PIE object; recompile with -fPIC
try.c: /usr/bin/ld: libcrypto_hash_luffa512.a(luffa384_x64asm.o): relocation R_X86_64_32S against `.rodata' can not be used when making a PIE object; recompile with -fPIC
try.c: /usr/bin/ld: libcrypto_hash_luffa512.a(luffa512_x64asm.o): relocation R_X86_64_32S against `.rodata' can not be used when making a PIE object; recompile with -fPIC
try.c: /usr/bin/ld: final link failed: Nonrepresentable section on output
try.c: collect2: error: ld returned 1 exit status

Number of similar (compiler,implementation) pairs: 8, namely:
CompilerImplementations
gcc -march=native -mtune=native -O2 -fomit-frame-pointer -fwrapv -fPIC -fPIE T:ssse3_x64asm-PS
gcc -march=native -mtune=native -O3 -fomit-frame-pointer -fwrapv -fPIC -fPIE T:ssse3_x64asm-PS
gcc -march=native -mtune=native -O -fomit-frame-pointer -fwrapv -fPIC -fPIE T:ssse3_x64asm-PS
gcc -march=native -mtune=native -Os -fomit-frame-pointer -fwrapv -fPIC -fPIE T:ssse3_x64asm-PS
gcc -march=native -mtune=native -O2 -fomit-frame-pointer -fwrapv -fPIC -fPIE T:ssse3_x64asm-PS-2
gcc -march=native -mtune=native -O3 -fomit-frame-pointer -fwrapv -fPIC -fPIE T:ssse3_x64asm-PS-2
gcc -march=native -mtune=native -O -fomit-frame-pointer -fwrapv -fPIC -fPIE T:ssse3_x64asm-PS-2
gcc -march=native -mtune=native -Os -fomit-frame-pointer -fwrapv -fPIC -fPIE T:ssse3_x64asm-PS-2

Compiler output

Implementation: T:ssse3_x64asm-PS-2
Security model: timingleaks
Compiler: clang -march=native -O2 -fomit-frame-pointer -fwrapv -Qunused-arguments -fPIC -fPIE
luffa256_x64asm.s: luffa256_x64asm.s:297:9: error: unknown token in expression
luffa256_x64asm.s: movdqa %xmm0, [IV ]
luffa256_x64asm.s: ^
luffa256_x64asm.s: luffa256_x64asm.s:298:9: error: unknown token in expression
luffa256_x64asm.s: movdqa %xmm1, [IV+16]
luffa256_x64asm.s: ^
luffa256_x64asm.s: luffa256_x64asm.s:299:9: error: unknown token in expression
luffa256_x64asm.s: movdqa %xmm2, [IV+32]
luffa256_x64asm.s: ^
luffa256_x64asm.s: luffa256_x64asm.s:300:9: error: unknown token in expression
luffa256_x64asm.s: movdqa %xmm3, [IV+48]
luffa256_x64asm.s: ^
luffa256_x64asm.s: luffa256_x64asm.s:301:9: error: unknown token in expression
luffa256_x64asm.s: movdqa %xmm4, [IV+64]
luffa256_x64asm.s: ^
luffa256_x64asm.s: luffa256_x64asm.s:302:9: error: unknown token in expression
luffa256_x64asm.s: movdqa %xmm5, [IV+80]
luffa256_x64asm.s: ^
luffa256_x64asm.s: luffa256_x64asm.s:303:10: error: unknown token in expression
luffa256_x64asm.s: movdqu [%rdi ], %xmm0
luffa256_x64asm.s: ^
luffa256_x64asm.s: luffa256_x64asm.s:304:10: error: unknown token in expression
luffa256_x64asm.s: movdqu [%rdi+16], %xmm1
luffa256_x64asm.s: ^
luffa256_x64asm.s: luffa256_x64asm.s:305:10: error: unknown token in expression
luffa256_x64asm.s: ...

Number of similar (compiler,implementation) pairs: 5, namely:
CompilerImplementations
clang -march=native -O2 -fomit-frame-pointer -fwrapv -Qunused-arguments -fPIC -fPIE T:ssse3_x64asm-PS-2
clang -march=native -O3 -fomit-frame-pointer -fwrapv -Qunused-arguments -fPIC -fPIE T:ssse3_x64asm-PS-2
clang -march=native -O -fomit-frame-pointer -fwrapv -Qunused-arguments -fPIC -fPIE T:ssse3_x64asm-PS-2
clang -march=native -Os -fomit-frame-pointer -fwrapv -Qunused-arguments -fPIC -fPIE T:ssse3_x64asm-PS-2
clang -mcpu=native -O3 -fomit-frame-pointer -fwrapv -Qunused-arguments -fPIC -fPIE T:ssse3_x64asm-PS-2

Compiler output

Implementation: T:thomaz/asm-PS
Security model: timingleaks
Compiler: clang -march=native -O2 -fomit-frame-pointer -fwrapv -Qunused-arguments -fPIC -fPIE
hash.c: hash.c:32:12: warning: passing 'const unsigned char *' to parameter of type 'unsigned char *' discards qualifiers [-Wincompatible-pointer-types-discards-qualifiers]
hash.c: fLuffa512(in, out, inlen);
hash.c: ^~
hash.c: hash.c:29:31: note: passing argument to parameter 'input' here
hash.c: void fLuffa512(unsigned char *input, unsigned char *output, int len);
hash.c: ^
hash.c: 1 warning generated.
luffa_512.s: <instantiation>:1:8: error: unknown token in expression
luffa_512.s: pshufb %xmm10, maskShufLittleEndian
luffa_512.s: ^
luffa_512.s: <instantiation>:1:1: note: while in macro instantiation
luffa_512.s: mPSSTEPI %xmm10, %xmm11, maskShufLittleEndian
luffa_512.s: ^
luffa_512.s: luffa_512.s:303:2: note: while in macro instantiation
luffa_512.s: mPS %xmm10, %xmm11, %xmm12, %xmm13, %xmm14, %xmm15
luffa_512.s: ^
luffa_512.s: <instantiation>:2:9: error: unknown token in expression
luffa_512.s: pshufb %xmm11, maskShufLittleEndian
luffa_512.s: ^
luffa_512.s: <instantiation>:1:1: note: while in macro instantiation
luffa_512.s: mPSSTEPI %xmm10, %xmm11, maskShufLittleEndian
luffa_512.s: ^
luffa_512.s: luffa_512.s:303:2: note: while in macro instantiation
luffa_512.s: mPS %xmm10, %xmm11, %xmm12, %xmm13, %xmm14, %xmm15
luffa_512.s: ^
luffa_512.s: <instantiation>:1:8: error: unknown token in expression
luffa_512.s: movaps %xmm12, %xmm10
luffa_512.s: ^
luffa_512.s: <instantiation>:2:2: note: while in macro instantiation
luffa_512.s: mPSSTEPII %xmm10, %xmm11, %xmm12, %xmm13, %xmm14, %xmm15
luffa_512.s: ^
luffa_512.s: luffa_512.s:303:2: note: while in macro instantiation
luffa_512.s: ...

Number of similar (compiler,implementation) pairs: 5, namely:
CompilerImplementations
clang -march=native -O2 -fomit-frame-pointer -fwrapv -Qunused-arguments -fPIC -fPIE T:thomaz/asm-PS
clang -march=native -O3 -fomit-frame-pointer -fwrapv -Qunused-arguments -fPIC -fPIE T:thomaz/asm-PS
clang -march=native -O -fomit-frame-pointer -fwrapv -Qunused-arguments -fPIC -fPIE T:thomaz/asm-PS
clang -march=native -Os -fomit-frame-pointer -fwrapv -Qunused-arguments -fPIC -fPIE T:thomaz/asm-PS
clang -mcpu=native -O3 -fomit-frame-pointer -fwrapv -Qunused-arguments -fPIC -fPIE T:thomaz/asm-PS

Compiler output

Implementation: T:thomaz/asm-PS
Security model: timingleaks
Compiler: gcc -march=native -mtune=native -O2 -fomit-frame-pointer -fwrapv -fPIC -fPIE
hash.c: hash.c: In function 'crypto_hash_luffa512_thomaz_asm_PS_timingleaks':
hash.c: hash.c:32:12: warning: passing argument 1 of 'fLuffa512' discards 'const' qualifier from pointer target type [-Wdiscarded-qualifiers]
hash.c: fLuffa512(in, out, inlen);
hash.c: ^~
hash.c: hash.c:29:6: note: expected 'unsigned char *' but argument is of type 'const unsigned char *'
hash.c: void fLuffa512(unsigned char *input, unsigned char *output, int len);
hash.c: ^~~~~~~~~
try.c: /usr/bin/ld: libcrypto_hash_luffa512.a(luffa_512.o): relocation R_X86_64_32S against `.rodata' can not be used when making a PIE object; recompile with -fPIC
try.c: /usr/bin/ld: final link failed: Nonrepresentable section on output
try.c: collect2: error: ld returned 1 exit status

Number of similar (compiler,implementation) pairs: 4, namely:
CompilerImplementations
gcc -march=native -mtune=native -O2 -fomit-frame-pointer -fwrapv -fPIC -fPIE T:thomaz/asm-PS
gcc -march=native -mtune=native -O3 -fomit-frame-pointer -fwrapv -fPIC -fPIE T:thomaz/asm-PS
gcc -march=native -mtune=native -O -fomit-frame-pointer -fwrapv -fPIC -fPIE T:thomaz/asm-PS
gcc -march=native -mtune=native -Os -fomit-frame-pointer -fwrapv -fPIC -fPIE T:thomaz/asm-PS

Compiler output

Implementation: T:thomaz/asm-PS-v2-FP
Security model: timingleaks
Compiler: clang -march=native -O2 -fomit-frame-pointer -fwrapv -Qunused-arguments -fPIC -fPIE
hash.c: hash.c:32:12: warning: passing 'const unsigned char *' to parameter of type 'unsigned char *' discards qualifiers [-Wincompatible-pointer-types-discards-qualifiers]
hash.c: fLuffa512(in, out, inlen);
hash.c: ^~
hash.c: hash.c:29:31: note: passing argument to parameter 'input' here
hash.c: void fLuffa512(unsigned char *input, unsigned char *output, int len);
hash.c: ^
hash.c: 1 warning generated.
luffa_512.s: <instantiation>:1:8: error: unknown token in expression
luffa_512.s: pshufb %xmm10, maskShufLittleEndian
luffa_512.s: ^
luffa_512.s: <instantiation>:1:1: note: while in macro instantiation
luffa_512.s: mPSSTEPI %xmm10, %xmm11, maskShufLittleEndian
luffa_512.s: ^
luffa_512.s: luffa_512.s:302:2: note: while in macro instantiation
luffa_512.s: mPS %xmm10, %xmm11, %xmm12, %xmm13, %xmm14, %xmm15
luffa_512.s: ^
luffa_512.s: <instantiation>:2:9: error: unknown token in expression
luffa_512.s: pshufb %xmm11, maskShufLittleEndian
luffa_512.s: ^
luffa_512.s: <instantiation>:1:1: note: while in macro instantiation
luffa_512.s: mPSSTEPI %xmm10, %xmm11, maskShufLittleEndian
luffa_512.s: ^
luffa_512.s: luffa_512.s:302:2: note: while in macro instantiation
luffa_512.s: mPS %xmm10, %xmm11, %xmm12, %xmm13, %xmm14, %xmm15
luffa_512.s: ^
luffa_512.s: <instantiation>:1:8: error: unknown token in expression
luffa_512.s: movaps %xmm12, %xmm10
luffa_512.s: ^
luffa_512.s: <instantiation>:2:2: note: while in macro instantiation
luffa_512.s: mPSSTEPII %xmm10, %xmm11, %xmm12, %xmm13, %xmm14, %xmm15
luffa_512.s: ^
luffa_512.s: luffa_512.s:302:2: note: while in macro instantiation
luffa_512.s: ...

Number of similar (compiler,implementation) pairs: 5, namely:
CompilerImplementations
clang -march=native -O2 -fomit-frame-pointer -fwrapv -Qunused-arguments -fPIC -fPIE T:thomaz/asm-PS-v2-FP
clang -march=native -O3 -fomit-frame-pointer -fwrapv -Qunused-arguments -fPIC -fPIE T:thomaz/asm-PS-v2-FP
clang -march=native -O -fomit-frame-pointer -fwrapv -Qunused-arguments -fPIC -fPIE T:thomaz/asm-PS-v2-FP
clang -march=native -Os -fomit-frame-pointer -fwrapv -Qunused-arguments -fPIC -fPIE T:thomaz/asm-PS-v2-FP
clang -mcpu=native -O3 -fomit-frame-pointer -fwrapv -Qunused-arguments -fPIC -fPIE T:thomaz/asm-PS-v2-FP

Compiler output

Implementation: T:thomaz/asm-PS-v2-FP
Security model: timingleaks
Compiler: gcc -march=native -mtune=native -O2 -fomit-frame-pointer -fwrapv -fPIC -fPIE
hash.c: hash.c: In function 'crypto_hash_luffa512_thomaz_asm_PS_v2_FP_timingleaks':
hash.c: hash.c:32:12: warning: passing argument 1 of 'fLuffa512' discards 'const' qualifier from pointer target type [-Wdiscarded-qualifiers]
hash.c: fLuffa512(in, out, inlen);
hash.c: ^~
hash.c: hash.c:29:6: note: expected 'unsigned char *' but argument is of type 'const unsigned char *'
hash.c: void fLuffa512(unsigned char *input, unsigned char *output, int len);
hash.c: ^~~~~~~~~
try.c: /usr/bin/ld: libcrypto_hash_luffa512.a(luffa_512.o): relocation R_X86_64_32S against `.rodata' can not be used when making a PIE object; recompile with -fPIC
try.c: /usr/bin/ld: final link failed: Nonrepresentable section on output
try.c: collect2: error: ld returned 1 exit status

Number of similar (compiler,implementation) pairs: 4, namely:
CompilerImplementations
gcc -march=native -mtune=native -O2 -fomit-frame-pointer -fwrapv -fPIC -fPIE T:thomaz/asm-PS-v2-FP
gcc -march=native -mtune=native -O3 -fomit-frame-pointer -fwrapv -fPIC -fPIE T:thomaz/asm-PS-v2-FP
gcc -march=native -mtune=native -O -fomit-frame-pointer -fwrapv -fPIC -fPIE T:thomaz/asm-PS-v2-FP
gcc -march=native -mtune=native -Os -fomit-frame-pointer -fwrapv -fPIC -fPIE T:thomaz/asm-PS-v2-FP

Compiler output

Implementation: T:thomaz/asm-PS-v2-INT
Security model: timingleaks
Compiler: clang -march=native -O2 -fomit-frame-pointer -fwrapv -Qunused-arguments -fPIC -fPIE
hash.c: hash.c:32:12: warning: passing 'const unsigned char *' to parameter of type 'unsigned char *' discards qualifiers [-Wincompatible-pointer-types-discards-qualifiers]
hash.c: fLuffa512(in, out, inlen);
hash.c: ^~
hash.c: hash.c:29:31: note: passing argument to parameter 'input' here
hash.c: void fLuffa512(unsigned char *input, unsigned char *output, int len);
hash.c: ^
hash.c: 1 warning generated.
luffa_512.s: <instantiation>:1:8: error: unknown token in expression
luffa_512.s: pshufb %xmm10, maskShufLittleEndian
luffa_512.s: ^
luffa_512.s: <instantiation>:1:1: note: while in macro instantiation
luffa_512.s: mPSSTEPI %xmm10, %xmm11, maskShufLittleEndian
luffa_512.s: ^
luffa_512.s: luffa_512.s:305:2: note: while in macro instantiation
luffa_512.s: mPS %xmm10, %xmm11, %xmm12, %xmm13, %xmm14, %xmm15
luffa_512.s: ^
luffa_512.s: <instantiation>:2:9: error: unknown token in expression
luffa_512.s: pshufb %xmm11, maskShufLittleEndian
luffa_512.s: ^
luffa_512.s: <instantiation>:1:1: note: while in macro instantiation
luffa_512.s: mPSSTEPI %xmm10, %xmm11, maskShufLittleEndian
luffa_512.s: ^
luffa_512.s: luffa_512.s:305:2: note: while in macro instantiation
luffa_512.s: mPS %xmm10, %xmm11, %xmm12, %xmm13, %xmm14, %xmm15
luffa_512.s: ^
luffa_512.s: <instantiation>:1:8: error: unknown token in expression
luffa_512.s: movdqa %xmm12, %xmm10
luffa_512.s: ^
luffa_512.s: <instantiation>:2:2: note: while in macro instantiation
luffa_512.s: mPSSTEPII %xmm10, %xmm11, %xmm12, %xmm13, %xmm14, %xmm15
luffa_512.s: ^
luffa_512.s: luffa_512.s:305:2: note: while in macro instantiation
luffa_512.s: ...

Number of similar (compiler,implementation) pairs: 5, namely:
CompilerImplementations
clang -march=native -O2 -fomit-frame-pointer -fwrapv -Qunused-arguments -fPIC -fPIE T:thomaz/asm-PS-v2-INT
clang -march=native -O3 -fomit-frame-pointer -fwrapv -Qunused-arguments -fPIC -fPIE T:thomaz/asm-PS-v2-INT
clang -march=native -O -fomit-frame-pointer -fwrapv -Qunused-arguments -fPIC -fPIE T:thomaz/asm-PS-v2-INT
clang -march=native -Os -fomit-frame-pointer -fwrapv -Qunused-arguments -fPIC -fPIE T:thomaz/asm-PS-v2-INT
clang -mcpu=native -O3 -fomit-frame-pointer -fwrapv -Qunused-arguments -fPIC -fPIE T:thomaz/asm-PS-v2-INT

Compiler output

Implementation: T:thomaz/asm-PS-v2-INT
Security model: timingleaks
Compiler: gcc -march=native -mtune=native -O2 -fomit-frame-pointer -fwrapv -fPIC -fPIE
hash.c: hash.c: In function 'crypto_hash_luffa512_thomaz_asm_PS_v2_INT_timingleaks':
hash.c: hash.c:32:12: warning: passing argument 1 of 'fLuffa512' discards 'const' qualifier from pointer target type [-Wdiscarded-qualifiers]
hash.c: fLuffa512(in, out, inlen);
hash.c: ^~
hash.c: hash.c:29:6: note: expected 'unsigned char *' but argument is of type 'const unsigned char *'
hash.c: void fLuffa512(unsigned char *input, unsigned char *output, int len);
hash.c: ^~~~~~~~~
try.c: /usr/bin/ld: libcrypto_hash_luffa512.a(luffa_512.o): relocation R_X86_64_32S against `.rodata' can not be used when making a PIE object; recompile with -fPIC
try.c: /usr/bin/ld: final link failed: Nonrepresentable section on output
try.c: collect2: error: ld returned 1 exit status

Number of similar (compiler,implementation) pairs: 4, namely:
CompilerImplementations
gcc -march=native -mtune=native -O2 -fomit-frame-pointer -fwrapv -fPIC -fPIE T:thomaz/asm-PS-v2-INT
gcc -march=native -mtune=native -O3 -fomit-frame-pointer -fwrapv -fPIC -fPIE T:thomaz/asm-PS-v2-INT
gcc -march=native -mtune=native -O -fomit-frame-pointer -fwrapv -fPIC -fPIE T:thomaz/asm-PS-v2-INT
gcc -march=native -mtune=native -Os -fomit-frame-pointer -fwrapv -fPIC -fPIE T:thomaz/asm-PS-v2-INT

Compiler output

Implementation: T:thomaz/asm-PSPar-v2-FP
Security model: timingleaks
Compiler: clang -march=native -O2 -fomit-frame-pointer -fwrapv -Qunused-arguments -fPIC -fPIE
hash.c: hash.c:32:12: warning: passing 'const unsigned char *' to parameter of type 'unsigned char *' discards qualifiers [-Wincompatible-pointer-types-discards-qualifiers]
hash.c: fLuffa512(in, out, inlen);
hash.c: ^~
hash.c: hash.c:29:31: note: passing argument to parameter 'input' here
hash.c: void fLuffa512(unsigned char *input, unsigned char *output, int len);
hash.c: ^
hash.c: 1 warning generated.
luffa512.s: <instantiation>:1:8: error: unknown token in expression
luffa512.s: pshufb %xmm10, maskShufLittleEndian
luffa512.s: ^
luffa512.s: <instantiation>:1:1: note: while in macro instantiation
luffa512.s: mPSSTEPI %xmm10, %xmm11, maskShufLittleEndian
luffa512.s: ^
luffa512.s: luffa512.s:449:2: note: while in macro instantiation
luffa512.s: mPS %xmm10, %xmm11, %xmm12, %xmm13, %xmm14, %xmm15
luffa512.s: ^
luffa512.s: <instantiation>:2:9: error: unknown token in expression
luffa512.s: pshufb %xmm11, maskShufLittleEndian
luffa512.s: ^
luffa512.s: <instantiation>:1:1: note: while in macro instantiation
luffa512.s: mPSSTEPI %xmm10, %xmm11, maskShufLittleEndian
luffa512.s: ^
luffa512.s: luffa512.s:449:2: note: while in macro instantiation
luffa512.s: mPS %xmm10, %xmm11, %xmm12, %xmm13, %xmm14, %xmm15
luffa512.s: ^
luffa512.s: <instantiation>:1:8: error: unknown token in expression
luffa512.s: movaps %xmm12, %xmm10
luffa512.s: ^
luffa512.s: <instantiation>:2:2: note: while in macro instantiation
luffa512.s: mPSSTEPII %xmm10, %xmm11, %xmm12, %xmm13, %xmm14, %xmm15
luffa512.s: ^
luffa512.s: luffa512.s:449:2: note: while in macro instantiation
luffa512.s: ...

Number of similar (compiler,implementation) pairs: 5, namely:
CompilerImplementations
clang -march=native -O2 -fomit-frame-pointer -fwrapv -Qunused-arguments -fPIC -fPIE T:thomaz/asm-PSPar-v2-FP
clang -march=native -O3 -fomit-frame-pointer -fwrapv -Qunused-arguments -fPIC -fPIE T:thomaz/asm-PSPar-v2-FP
clang -march=native -O -fomit-frame-pointer -fwrapv -Qunused-arguments -fPIC -fPIE T:thomaz/asm-PSPar-v2-FP
clang -march=native -Os -fomit-frame-pointer -fwrapv -Qunused-arguments -fPIC -fPIE T:thomaz/asm-PSPar-v2-FP
clang -mcpu=native -O3 -fomit-frame-pointer -fwrapv -Qunused-arguments -fPIC -fPIE T:thomaz/asm-PSPar-v2-FP

Compiler output

Implementation: T:thomaz/asm-PSPar-v2-FP
Security model: timingleaks
Compiler: gcc -march=native -mtune=native -O2 -fomit-frame-pointer -fwrapv -fPIC -fPIE
hash.c: hash.c: In function 'crypto_hash_luffa512_thomaz_asm_PSPar_v2_FP_timingleaks':
hash.c: hash.c:32:12: warning: passing argument 1 of 'fLuffa512' discards 'const' qualifier from pointer target type [-Wdiscarded-qualifiers]
hash.c: fLuffa512(in, out, inlen);
hash.c: ^~
hash.c: hash.c:29:6: note: expected 'unsigned char *' but argument is of type 'const unsigned char *'
hash.c: void fLuffa512(unsigned char *input, unsigned char *output, int len);
hash.c: ^~~~~~~~~
try.c: /usr/bin/ld: libcrypto_hash_luffa512.a(luffa512.o): relocation R_X86_64_32S against `.rodata' can not be used when making a PIE object; recompile with -fPIC
try.c: /usr/bin/ld: final link failed: Nonrepresentable section on output
try.c: collect2: error: ld returned 1 exit status

Number of similar (compiler,implementation) pairs: 4, namely:
CompilerImplementations
gcc -march=native -mtune=native -O2 -fomit-frame-pointer -fwrapv -fPIC -fPIE T:thomaz/asm-PSPar-v2-FP
gcc -march=native -mtune=native -O3 -fomit-frame-pointer -fwrapv -fPIC -fPIE T:thomaz/asm-PSPar-v2-FP
gcc -march=native -mtune=native -O -fomit-frame-pointer -fwrapv -fPIC -fPIE T:thomaz/asm-PSPar-v2-FP
gcc -march=native -mtune=native -Os -fomit-frame-pointer -fwrapv -fPIC -fPIE T:thomaz/asm-PSPar-v2-FP

Compiler output

Implementation: T:thomaz/asm-PSPar-v2-INT
Security model: timingleaks
Compiler: clang -march=native -O2 -fomit-frame-pointer -fwrapv -Qunused-arguments -fPIC -fPIE
hash.c: hash.c:32:12: warning: passing 'const unsigned char *' to parameter of type 'unsigned char *' discards qualifiers [-Wincompatible-pointer-types-discards-qualifiers]
hash.c: fLuffa512(in, out, inlen);
hash.c: ^~
hash.c: hash.c:29:31: note: passing argument to parameter 'input' here
hash.c: void fLuffa512(unsigned char *input, unsigned char *output, int len);
hash.c: ^
hash.c: 1 warning generated.
luffa512.s: <instantiation>:1:8: error: unknown token in expression
luffa512.s: pshufb %xmm10, maskShufLittleEndian
luffa512.s: ^
luffa512.s: <instantiation>:1:1: note: while in macro instantiation
luffa512.s: mPSSTEPI %xmm10, %xmm11, maskShufLittleEndian
luffa512.s: ^
luffa512.s: luffa512.s:449:2: note: while in macro instantiation
luffa512.s: mPS %xmm10, %xmm11, %xmm12, %xmm13, %xmm14, %xmm15
luffa512.s: ^
luffa512.s: <instantiation>:2:9: error: unknown token in expression
luffa512.s: pshufb %xmm11, maskShufLittleEndian
luffa512.s: ^
luffa512.s: <instantiation>:1:1: note: while in macro instantiation
luffa512.s: mPSSTEPI %xmm10, %xmm11, maskShufLittleEndian
luffa512.s: ^
luffa512.s: luffa512.s:449:2: note: while in macro instantiation
luffa512.s: mPS %xmm10, %xmm11, %xmm12, %xmm13, %xmm14, %xmm15
luffa512.s: ^
luffa512.s: <instantiation>:1:8: error: unknown token in expression
luffa512.s: movdqa %xmm12, %xmm10
luffa512.s: ^
luffa512.s: <instantiation>:2:2: note: while in macro instantiation
luffa512.s: mPSSTEPII %xmm10, %xmm11, %xmm12, %xmm13, %xmm14, %xmm15
luffa512.s: ^
luffa512.s: luffa512.s:449:2: note: while in macro instantiation
luffa512.s: ...

Number of similar (compiler,implementation) pairs: 5, namely:
CompilerImplementations
clang -march=native -O2 -fomit-frame-pointer -fwrapv -Qunused-arguments -fPIC -fPIE T:thomaz/asm-PSPar-v2-INT
clang -march=native -O3 -fomit-frame-pointer -fwrapv -Qunused-arguments -fPIC -fPIE T:thomaz/asm-PSPar-v2-INT
clang -march=native -O -fomit-frame-pointer -fwrapv -Qunused-arguments -fPIC -fPIE T:thomaz/asm-PSPar-v2-INT
clang -march=native -Os -fomit-frame-pointer -fwrapv -Qunused-arguments -fPIC -fPIE T:thomaz/asm-PSPar-v2-INT
clang -mcpu=native -O3 -fomit-frame-pointer -fwrapv -Qunused-arguments -fPIC -fPIE T:thomaz/asm-PSPar-v2-INT

Compiler output

Implementation: T:thomaz/asm-PSPar-v2-INT
Security model: timingleaks
Compiler: gcc -march=native -mtune=native -O2 -fomit-frame-pointer -fwrapv -fPIC -fPIE
hash.c: hash.c: In function 'crypto_hash_luffa512_thomaz_asm_PSPar_v2_INT_timingleaks':
hash.c: hash.c:32:12: warning: passing argument 1 of 'fLuffa512' discards 'const' qualifier from pointer target type [-Wdiscarded-qualifiers]
hash.c: fLuffa512(in, out, inlen);
hash.c: ^~
hash.c: hash.c:29:6: note: expected 'unsigned char *' but argument is of type 'const unsigned char *'
hash.c: void fLuffa512(unsigned char *input, unsigned char *output, int len);
hash.c: ^~~~~~~~~
try.c: /usr/bin/ld: libcrypto_hash_luffa512.a(luffa512.o): relocation R_X86_64_32S against `.rodata' can not be used when making a PIE object; recompile with -fPIC
try.c: /usr/bin/ld: final link failed: Nonrepresentable section on output
try.c: collect2: error: ld returned 1 exit status

Number of similar (compiler,implementation) pairs: 4, namely:
CompilerImplementations
gcc -march=native -mtune=native -O2 -fomit-frame-pointer -fwrapv -fPIC -fPIE T:thomaz/asm-PSPar-v2-INT
gcc -march=native -mtune=native -O3 -fomit-frame-pointer -fwrapv -fPIC -fPIE T:thomaz/asm-PSPar-v2-INT
gcc -march=native -mtune=native -O -fomit-frame-pointer -fwrapv -fPIC -fPIE T:thomaz/asm-PSPar-v2-INT
gcc -march=native -mtune=native -Os -fomit-frame-pointer -fwrapv -fPIC -fPIE T:thomaz/asm-PSPar-v2-INT

Namespace violations

Implementation: T:opt32
Security model: timingleaks
Compiler: clang -march=native -O2 -fomit-frame-pointer -fwrapv -Qunused-arguments -fPIC -fPIE
luffa_for_32.o CNS D
luffa_for_32.o Final T
luffa_for_32.o Hash T
luffa_for_32.o IV R
luffa_for_32.o Init T
luffa_for_32.o Update T
luffa_for_32.o Update256 T
luffa_for_32.o Update384 T
luffa_for_32.o Update512 T
luffa_for_32.o finalization224 T
luffa_for_32.o finalization256 T
luffa_for_32.o finalization384 T
luffa_for_32.o finalization512 T
luffa_for_32.o process_last_msgs256 T
luffa_for_32.o process_last_msgs384 T
luffa_for_32.o process_last_msgs512 T
luffa_for_32.o rnd256 T
luffa_for_32.o rnd384 T
luffa_for_32.o rnd512 T

Number of similar (compiler,implementation) pairs: 8, namely:
CompilerImplementations
clang -march=native -O2 -fomit-frame-pointer -fwrapv -Qunused-arguments -fPIC -fPIE T:opt32
clang -march=native -O3 -fomit-frame-pointer -fwrapv -Qunused-arguments -fPIC -fPIE T:opt32
clang -march=native -O -fomit-frame-pointer -fwrapv -Qunused-arguments -fPIC -fPIE T:opt32
clang -march=native -Os -fomit-frame-pointer -fwrapv -Qunused-arguments -fPIC -fPIE T:opt32
clang -mcpu=native -O3 -fomit-frame-pointer -fwrapv -Qunused-arguments -fPIC -fPIE T:opt32
gcc -march=native -mtune=native -O2 -fomit-frame-pointer -fwrapv -fPIC -fPIE T:opt32
gcc -march=native -mtune=native -O -fomit-frame-pointer -fwrapv -fPIC -fPIE T:opt32
gcc -march=native -mtune=native -Os -fomit-frame-pointer -fwrapv -fPIC -fPIE T:opt32

Namespace violations

Implementation: T:sphlib
Security model: timingleaks
Compiler: clang -march=native -O2 -fomit-frame-pointer -fwrapv -Qunused-arguments -fPIC -fPIE
luffa.o sph_luffa224 T
luffa.o sph_luffa224_addbits_and_close T
luffa.o sph_luffa224_close T
luffa.o sph_luffa224_init T
luffa.o sph_luffa256 T
luffa.o sph_luffa256_addbits_and_close T
luffa.o sph_luffa256_close T
luffa.o sph_luffa256_init T
luffa.o sph_luffa384 T
luffa.o sph_luffa384_addbits_and_close T
luffa.o sph_luffa384_close T
luffa.o sph_luffa384_init T
luffa.o sph_luffa512 T
luffa.o sph_luffa512_addbits_and_close T
luffa.o sph_luffa512_close T
luffa.o sph_luffa512_init T

Number of similar (compiler,implementation) pairs: 9, namely:
CompilerImplementations
clang -march=native -O2 -fomit-frame-pointer -fwrapv -Qunused-arguments -fPIC -fPIE T:sphlib
clang -march=native -O3 -fomit-frame-pointer -fwrapv -Qunused-arguments -fPIC -fPIE T:sphlib
clang -march=native -O -fomit-frame-pointer -fwrapv -Qunused-arguments -fPIC -fPIE T:sphlib
clang -march=native -Os -fomit-frame-pointer -fwrapv -Qunused-arguments -fPIC -fPIE T:sphlib
clang -mcpu=native -O3 -fomit-frame-pointer -fwrapv -Qunused-arguments -fPIC -fPIE T:sphlib
gcc -march=native -mtune=native -O2 -fomit-frame-pointer -fwrapv -fPIC -fPIE T:sphlib
gcc -march=native -mtune=native -O3 -fomit-frame-pointer -fwrapv -fPIC -fPIE T:sphlib
gcc -march=native -mtune=native -O -fomit-frame-pointer -fwrapv -fPIC -fPIE T:sphlib
gcc -march=native -mtune=native -Os -fomit-frame-pointer -fwrapv -fPIC -fPIE T:sphlib

Namespace violations

Implementation: T:sse2
Security model: timingleaks
Compiler: clang -march=native -O2 -fomit-frame-pointer -fwrapv -Qunused-arguments -fPIC -fPIE
luffa_for_sse2.o ALLONE C
luffa_for_sse2.o CNS128 C
luffa_for_sse2.o Final T
luffa_for_sse2.o Hash T
luffa_for_sse2.o Init T
luffa_for_sse2.o MASK C
luffa_for_sse2.o Update T

Number of similar (compiler,implementation) pairs: 9, namely:
CompilerImplementations
clang -march=native -O2 -fomit-frame-pointer -fwrapv -Qunused-arguments -fPIC -fPIE T:sse2
clang -march=native -O3 -fomit-frame-pointer -fwrapv -Qunused-arguments -fPIC -fPIE T:sse2
clang -march=native -O -fomit-frame-pointer -fwrapv -Qunused-arguments -fPIC -fPIE T:sse2
clang -march=native -Os -fomit-frame-pointer -fwrapv -Qunused-arguments -fPIC -fPIE T:sse2
clang -mcpu=native -O3 -fomit-frame-pointer -fwrapv -Qunused-arguments -fPIC -fPIE T:sse2
gcc -march=native -mtune=native -O2 -fomit-frame-pointer -fwrapv -fPIC -fPIE T:sse2
gcc -march=native -mtune=native -O3 -fomit-frame-pointer -fwrapv -fPIC -fPIE T:sse2
gcc -march=native -mtune=native -O -fomit-frame-pointer -fwrapv -fPIC -fPIE T:sse2
gcc -march=native -mtune=native -Os -fomit-frame-pointer -fwrapv -fPIC -fPIE T:sse2